hbase-dev mailing list archives

Site index · List index
Message view « Date » · « Thread »
Top « Date » · « Thread »
From Stack <st...@duboce.net>
Subject Re: Build failed in Jenkins: HBase-Trunk_matrix » latest1.8,Hadoop #512
Date Mon, 30 Nov 2015 02:54:36 GMT
This fails rarely enough:
https://builds.apache.org/view/H-L/view/HBase/job/HBase-Trunk_matrix/512/jdk=latest1.8,label=Hadoop/testReport/junit/org.apache.hadoop.hbase.master/TestTableLockManager/testReapAllTableLocks/history/

Lets keep an eye on it.

St.Ack

On Sun, Nov 29, 2015 at 3:18 PM, Apache Jenkins Server <
jenkins@builds.apache.org> wrote:

> See <
> https://builds.apache.org/job/HBase-Trunk_matrix/jdk=latest1.8,label=Hadoop/512/changes
> >
>
> Changes:
>
> [tedyu] HBASE-14531 graceful_stop.sh "if [ \"$local\" ]" condition
> unexpected
>
> ------------------------------------------
> [...truncated 6127 lines...]
> Tests run: 1, Failures: 0, Errors: 0, Skipped: 0, Time elapsed: 1.494 sec
> - in org.apache.hadoop.hbase.wal.TestSecureWAL
> Java HotSpot(TM) 64-Bit Server VM warning: ignoring option
> MaxPermSize=256m; support was removed in 8.0
> Running org.apache.hadoop.hbase.wal.TestDefaultWALProvider
> Running org.apache.hadoop.hbase.wal.TestWALFactory
> Tests run: 5, Failures: 0, Errors: 0, Skipped: 0, Time elapsed: 11.288 sec
> - in org.apache.hadoop.hbase.wal.TestDefaultWALProvider
> Java HotSpot(TM) 64-Bit Server VM warning: ignoring option
> MaxPermSize=256m; support was removed in 8.0
> Java HotSpot(TM) 64-Bit Server VM warning: ignoring option
> MaxPermSize=256m; support was removed in 8.0
> Tests run: 9, Failures: 0, Errors: 0, Skipped: 0, Time elapsed: 16.684 sec
> - in org.apache.hadoop.hbase.wal.TestWALFactory
> Java HotSpot(TM) 64-Bit Server VM warning: ignoring option
> MaxPermSize=256m; support was removed in 8.0
> Tests run: 5, Failures: 0, Errors: 0, Skipped: 0, Time elapsed: 33.681 sec
> - in org.apache.hadoop.hbase.wal.TestBoundedRegionGroupingStrategy
> Java HotSpot(TM) 64-Bit Server VM warning: ignoring option
> MaxPermSize=256m; support was removed in 8.0
> Java HotSpot(TM) 64-Bit Server VM warning: ignoring option
> MaxPermSize=256m; support was removed in 8.0
> Running org.apache.hadoop.hbase.mob.TestDefaultMobStoreFlusher
> Running org.apache.hadoop.hbase.mob.TestMobDataBlockEncoding
> Tests run: 2, Failures: 0, Errors: 0, Skipped: 0, Time elapsed: 4.629 sec
> - in org.apache.hadoop.hbase.mob.TestDefaultMobStoreFlusher
> Java HotSpot(TM) 64-Bit Server VM warning: ignoring option
> MaxPermSize=256m; support was removed in 8.0
> Running org.apache.hadoop.hbase.mob.mapreduce.TestMobSweepJob
> Tests run: 3, Failures: 0, Errors: 0, Skipped: 0, Time elapsed: 2.8 sec -
> in org.apache.hadoop.hbase.mob.mapreduce.TestMobSweepJob
> Java HotSpot(TM) 64-Bit Server VM warning: ignoring option
> MaxPermSize=256m; support was removed in 8.0
> Java HotSpot(TM) 64-Bit Server VM warning: ignoring option
> MaxPermSize=256m; support was removed in 8.0
> Running org.apache.hadoop.hbase.mob.TestExpiredMobFileCleaner
> Tests run: 1, Failures: 0, Errors: 0, Skipped: 0, Time elapsed: 14.058 sec
> - in org.apache.hadoop.hbase.mob.TestMobDataBlockEncoding
> Running org.apache.hadoop.hbase.mob.mapreduce.TestMobSweepReducer
> Java HotSpot(TM) 64-Bit Server VM warning: ignoring option
> MaxPermSize=256m; support was removed in 8.0
> Java HotSpot(TM) 64-Bit Server VM warning: ignoring option
> MaxPermSize=256m; support was removed in 8.0
> Java HotSpot(TM) 64-Bit Server VM warning: ignoring option
> MaxPermSize=256m; support was removed in 8.0
> Tests run: 15, Failures: 0, Errors: 0, Skipped: 1, Time elapsed: 110.032
> sec - in org.apache.hadoop.hbase.util.TestHBaseFsckTwoRS
> Java HotSpot(TM) 64-Bit Server VM warning: ignoring option
> MaxPermSize=256m; support was removed in 8.0
> Tests run: 1, Failures: 0, Errors: 0, Skipped: 0, Time elapsed: 6.912 sec
> - in org.apache.hadoop.hbase.mob.mapreduce.TestMobSweepReducer
> Java HotSpot(TM) 64-Bit Server VM warning: ignoring option
> MaxPermSize=256m; support was removed in 8.0
> Java HotSpot(TM) 64-Bit Server VM warning: ignoring option
> MaxPermSize=256m; support was removed in 8.0
> Java HotSpot(TM) 64-Bit Server VM warning: ignoring option
> MaxPermSize=256m; support was removed in 8.0
> Tests run: 1, Failures: 0, Errors: 0, Skipped: 0, Time elapsed: 19.402 sec
> - in org.apache.hadoop.hbase.mob.TestExpiredMobFileCleaner
> Running org.apache.hadoop.hbase.mob.compactions.TestPartitionedMobCompactor
> Java HotSpot(TM) 64-Bit Server VM warning: ignoring option
> MaxPermSize=256m; support was removed in 8.0
> Running org.apache.hadoop.hbase.mob.compactions.TestMobCompactor
> Running org.apache.hadoop.hbase.namespace.TestNamespaceAuditor
> Running org.apache.hadoop.hbase.constraint.TestConstraint
> Tests run: 6, Failures: 0, Errors: 0, Skipped: 0, Time elapsed: 33.201 sec
> - in org.apache.hadoop.hbase.mob.compactions.TestPartitionedMobCompactor
> Java HotSpot(TM) 64-Bit Server VM warning: ignoring option
> MaxPermSize=256m; support was removed in 8.0
> Java HotSpot(TM) 64-Bit Server VM warning: ignoring option
> MaxPermSize=256m; support was removed in 8.0
> Tests run: 5, Failures: 0, Errors: 0, Skipped: 0, Time elapsed: 24.629 sec
> - in org.apache.hadoop.hbase.constraint.TestConstraint
> Java HotSpot(TM) 64-Bit Server VM warning: ignoring option
> MaxPermSize=256m; support was removed in 8.0
> Java HotSpot(TM) 64-Bit Server VM warning: ignoring option
> MaxPermSize=256m; support was removed in 8.0
> Java HotSpot(TM) 64-Bit Server VM warning: ignoring option
> MaxPermSize=256m; support was removed in 8.0
> Running org.apache.hadoop.hbase.TestNamespace
> Running org.apache.hadoop.hbase.TestInfoServers
> Tests run: 3, Failures: 0, Errors: 0, Skipped: 0, Time elapsed: 5.003 sec
> - in org.apache.hadoop.hbase.TestInfoServers
> Java HotSpot(TM) 64-Bit Server VM warning: ignoring option
> MaxPermSize=256m; support was removed in 8.0
> Running org.apache.hadoop.hbase.TestRegionRebalancing
> Tests run: 5, Failures: 0, Errors: 0, Skipped: 0, Time elapsed: 75.709 sec
> - in org.apache.hadoop.hbase.mob.compactions.TestMobCompactor
> Java HotSpot(TM) 64-Bit Server VM warning: ignoring option
> MaxPermSize=256m; support was removed in 8.0
> Java HotSpot(TM) 64-Bit Server VM warning: ignoring option
> MaxPermSize=256m; support was removed in 8.0
> Java HotSpot(TM) 64-Bit Server VM warning: ignoring option
> MaxPermSize=256m; support was removed in 8.0
> Java HotSpot(TM) 64-Bit Server VM warning: ignoring option
> MaxPermSize=256m; support was removed in 8.0
> Java HotSpot(TM) 64-Bit Server VM warning: ignoring option
> MaxPermSize=256m; support was removed in 8.0
> Tests run: 8, Failures: 0, Errors: 0, Skipped: 0, Time elapsed: 37.663 sec
> - in org.apache.hadoop.hbase.TestNamespace
> Java HotSpot(TM) 64-Bit Server VM warning: ignoring option
> MaxPermSize=256m; support was removed in 8.0
> Running org.apache.hadoop.hbase.filter.TestMultiRowRangeFilter
> Running org.apache.hadoop.hbase.filter.TestScanRowPrefix
> Tests run: 1, Failures: 0, Errors: 0, Skipped: 0, Time elapsed: 6.491 sec
> - in org.apache.hadoop.hbase.filter.TestScanRowPrefix
> Java HotSpot(TM) 64-Bit Server VM warning: ignoring option
> MaxPermSize=256m; support was removed in 8.0
> Java HotSpot(TM) 64-Bit Server VM warning: ignoring option
> MaxPermSize=256m; support was removed in 8.0
> Java HotSpot(TM) 64-Bit Server VM warning: ignoring option
> MaxPermSize=256m; support was removed in 8.0
> Java HotSpot(TM) 64-Bit Server VM warning: ignoring option
> MaxPermSize=256m; support was removed in 8.0
> Tests run: 2, Failures: 0, Errors: 0, Skipped: 0, Time elapsed: 56.752 sec
> - in org.apache.hadoop.hbase.TestRegionRebalancing
> Java HotSpot(TM) 64-Bit Server VM warning: ignoring option
> MaxPermSize=256m; support was removed in 8.0
> Java HotSpot(TM) 64-Bit Server VM warning: ignoring option
> MaxPermSize=256m; support was removed in 8.0
> Java HotSpot(TM) 64-Bit Server VM warning: ignoring option
> MaxPermSize=256m; support was removed in 8.0
> Java HotSpot(TM) 64-Bit Server VM warning: ignoring option
> MaxPermSize=256m; support was removed in 8.0
> Tests run: 20, Failures: 0, Errors: 0, Skipped: 0, Time elapsed: 23.792
> sec - in org.apache.hadoop.hbase.filter.TestMultiRowRangeFilter
> Java HotSpot(TM) 64-Bit Server VM warning: ignoring option
> MaxPermSize=256m; support was removed in 8.0
> Java HotSpot(TM) 64-Bit Server VM warning: ignoring option
> MaxPermSize=256m; support was removed in 8.0
> Java HotSpot(TM) 64-Bit Server VM warning: ignoring option
> MaxPermSize=256m; support was removed in 8.0
> Running org.apache.hadoop.hbase.filter.TestFilterWrapper
> Tests run: 1, Failures: 0, Errors: 0, Skipped: 0, Time elapsed: 3.884 sec
> - in org.apache.hadoop.hbase.filter.TestFilterWrapper
> Java HotSpot(TM) 64-Bit Server VM warning: ignoring option
> MaxPermSize=256m; support was removed in 8.0
> Java HotSpot(TM) 64-Bit Server VM warning: ignoring option
> MaxPermSize=256m; support was removed in 8.0
> Java HotSpot(TM) 64-Bit Server VM warning: ignoring option
> MaxPermSize=256m; support was removed in 8.0
> Running org.apache.hadoop.hbase.filter.TestFuzzyRowFilterEndToEnd
> Running org.apache.hadoop.hbase.filter.TestFuzzyRowAndColumnRangeFilter
> Tests run: 12, Failures: 0, Errors: 0, Skipped: 0, Time elapsed: 130.846
> sec - in org.apache.hadoop.hbase.namespace.TestNamespaceAuditor
> Java HotSpot(TM) 64-Bit Server VM warning: ignoring option
> MaxPermSize=256m; support was removed in 8.0
> Tests run: 1, Failures: 0, Errors: 0, Skipped: 0, Time elapsed: 5.428 sec
> - in org.apache.hadoop.hbase.filter.TestFuzzyRowAndColumnRangeFilter
> Java HotSpot(TM) 64-Bit Server VM warning: ignoring option
> MaxPermSize=256m; support was removed in 8.0
> Tests run: 40, Failures: 0, Errors: 0, Skipped: 1, Time elapsed: 287.171
> sec - in org.apache.hadoop.hbase.util.TestHBaseFsckOneRS
> Java HotSpot(TM) 64-Bit Server VM warning: ignoring option
> MaxPermSize=256m; support was removed in 8.0
> Java HotSpot(TM) 64-Bit Server VM warning: ignoring option
> MaxPermSize=256m; support was removed in 8.0
> Java HotSpot(TM) 64-Bit Server VM warning: ignoring option
> MaxPermSize=256m; support was removed in 8.0
> Running org.apache.hadoop.hbase.filter.TestColumnRangeFilter
> Java HotSpot(TM) 64-Bit Server VM warning: ignoring option
> MaxPermSize=256m; support was removed in 8.0
> Java HotSpot(TM) 64-Bit Server VM warning: ignoring option
> MaxPermSize=256m; support was removed in 8.0
> Java HotSpot(TM) 64-Bit Server VM warning: ignoring option
> MaxPermSize=256m; support was removed in 8.0
> Java HotSpot(TM) 64-Bit Server VM warning: ignoring option
> MaxPermSize=256m; support was removed in 8.0
> Java HotSpot(TM) 64-Bit Server VM warning: ignoring option
> MaxPermSize=256m; support was removed in 8.0
> Java HotSpot(TM) 64-Bit Server VM warning: ignoring option
> MaxPermSize=256m; support was removed in 8.0
> Java HotSpot(TM) 64-Bit Server VM warning: ignoring option
> MaxPermSize=256m; support was removed in 8.0
> Running org.apache.hadoop.hbase.io.TestFileLink
> Running org.apache.hadoop.hbase.io.hfile.TestScannerSelectionUsingTTL
> Tests run: 1, Failures: 0, Errors: 0, Skipped: 0, Time elapsed: 8.474 sec
> - in org.apache.hadoop.hbase.filter.TestColumnRangeFilter
> Java HotSpot(TM) 64-Bit Server VM warning: ignoring option
> MaxPermSize=256m; support was removed in 8.0
> Java HotSpot(TM) 64-Bit Server VM warning: ignoring option
> MaxPermSize=256m; support was removed in 8.0
> Running org.apache.hadoop.hbase.io.hfile.TestCacheConfig
> Tests run: 6, Failures: 0, Errors: 0, Skipped: 0, Time elapsed: 1.921 sec
> - in org.apache.hadoop.hbase.io.hfile.TestCacheConfig
> Java HotSpot(TM) 64-Bit Server VM warning: ignoring option
> MaxPermSize=256m; support was removed in 8.0
> Running org.apache.hadoop.hbase.io.hfile.TestHFileSeek
> Running org.apache.hadoop.hbase.filter.TestFilterWithScanLimits
> Tests run: 1, Failures: 0, Errors: 0, Skipped: 0, Time elapsed: 2.311 sec
> - in org.apache.hadoop.hbase.io.hfile.TestHFileSeek
> Java HotSpot(TM) 64-Bit Server VM warning: ignoring option
> MaxPermSize=256m; support was removed in 8.0
> Running org.apache.hadoop.hbase.io.hfile.TestSeekBeforeWithInlineBlocks
> Tests run: 5, Failures: 0, Errors: 0, Skipped: 0, Time elapsed: 15.77 sec
> - in org.apache.hadoop.hbase.io.TestFileLink
> Java HotSpot(TM) 64-Bit Server VM warning: ignoring option
> MaxPermSize=256m; support was removed in 8.0
> Java HotSpot(TM) 64-Bit Server VM warning: ignoring option
> MaxPermSize=256m; support was removed in 8.0
> Running org.apache.hadoop.hbase.io.hfile.TestForceCacheImportantBlocks
> Tests run: 1, Failures: 0, Errors: 0, Skipped: 0, Time elapsed: 12.454 sec
> - in org.apache.hadoop.hbase.io.hfile.TestSeekBeforeWithInlineBlocks
> Java HotSpot(TM) 64-Bit Server VM warning: ignoring option
> MaxPermSize=256m; support was removed in 8.0
> Java HotSpot(TM) 64-Bit Server VM warning: ignoring option
> MaxPermSize=256m; support was removed in 8.0
> Running org.apache.hadoop.hbase.io.hfile.TestCacheOnWrite
> Tests run: 2, Failures: 0, Errors: 0, Skipped: 0, Time elapsed: 23.187 sec
> - in org.apache.hadoop.hbase.io.hfile.TestForceCacheImportantBlocks
> Java HotSpot(TM) 64-Bit Server VM warning: ignoring option
> MaxPermSize=256m; support was removed in 8.0
> Java HotSpot(TM) 64-Bit Server VM warning: ignoring option
> MaxPermSize=256m; support was removed in 8.0
> Java HotSpot(TM) 64-Bit Server VM warning: ignoring option
> MaxPermSize=256m; support was removed in 8.0
> Java HotSpot(TM) 64-Bit Server VM warning: ignoring option
> MaxPermSize=256m; support was removed in 8.0
> Java HotSpot(TM) 64-Bit Server VM warning: ignoring option
> MaxPermSize=256m; support was removed in 8.0
> Running org.apache.hadoop.hbase.io.hfile.TestHFileBlock
> Tests run: 1, Failures: 0, Errors: 0, Skipped: 0, Time elapsed: 52.012 sec
> - in org.apache.hadoop.hbase.filter.TestFilterWithScanLimits
> Java HotSpot(TM) 64-Bit Server VM warning: ignoring option
> MaxPermSize=256m; support was removed in 8.0
> Tests run: 6, Failures: 0, Errors: 0, Skipped: 0, Time elapsed: 63.596 sec
> - in org.apache.hadoop.hbase.io.hfile.TestScannerSelectionUsingTTL
> Java HotSpot(TM) 64-Bit Server VM warning: ignoring option
> MaxPermSize=256m; support was removed in 8.0
> Java HotSpot(TM) 64-Bit Server VM warning: ignoring option
> MaxPermSize=256m; support was removed in 8.0
> Java HotSpot(TM) 64-Bit Server VM warning: ignoring option
> MaxPermSize=256m; support was removed in 8.0
> Java HotSpot(TM) 64-Bit Server VM warning: ignoring option
> MaxPermSize=256m; support was removed in 8.0
> Java HotSpot(TM) 64-Bit Server VM warning: ignoring option
> MaxPermSize=256m; support was removed in 8.0
> Java HotSpot(TM) 64-Bit Server VM warning: ignoring option
> MaxPermSize=256m; support was removed in 8.0
> Java HotSpot(TM) 64-Bit Server VM warning: ignoring option
> MaxPermSize=256m; support was removed in 8.0
> Java HotSpot(TM) 64-Bit Server VM warning: ignoring option
> MaxPermSize=256m; support was removed in 8.0
> Java HotSpot(TM) 64-Bit Server VM warning: ignoring option
> MaxPermSize=256m; support was removed in 8.0
> Java HotSpot(TM) 64-Bit Server VM warning: ignoring option
> MaxPermSize=256m; support was removed in 8.0
> Running org.apache.hadoop.hbase.io.hfile.TestHFileBlockIndex
> Java HotSpot(TM) 64-Bit Server VM warning: ignoring option
> MaxPermSize=256m; support was removed in 8.0
> Java HotSpot(TM) 64-Bit Server VM warning: ignoring option
> MaxPermSize=256m; support was removed in 8.0
> Running org.apache.hadoop.hbase.io.hfile.TestScannerFromBucketCache
> Tests run: 4, Failures: 0, Errors: 0, Skipped: 0, Time elapsed: 6.01 sec -
> in org.apache.hadoop.hbase.io.hfile.TestScannerFromBucketCache
> Java HotSpot(TM) 64-Bit Server VM warning: ignoring option
> MaxPermSize=256m; support was removed in 8.0
> Java HotSpot(TM) 64-Bit Server VM warning: ignoring option
> MaxPermSize=256m; support was removed in 8.0
> Java HotSpot(TM) 64-Bit Server VM warning: ignoring option
> MaxPermSize=256m; support was removed in 8.0
> Java HotSpot(TM) 64-Bit Server VM warning: ignoring option
> MaxPermSize=256m; support was removed in 8.0
> Java HotSpot(TM) 64-Bit Server VM warning: ignoring option
> MaxPermSize=256m; support was removed in 8.0
> Java HotSpot(TM) 64-Bit Server VM warning: ignoring option
> MaxPermSize=256m; support was removed in 8.0
> Java HotSpot(TM) 64-Bit Server VM warning: ignoring option
> MaxPermSize=256m; support was removed in 8.0
> Tests run: 10, Failures: 0, Errors: 0, Skipped: 0, Time elapsed: 12.263
> sec - in org.apache.hadoop.hbase.io.hfile.TestHFileBlockIndex
> Java HotSpot(TM) 64-Bit Server VM warning: ignoring option
> MaxPermSize=256m; support was removed in 8.0
> Java HotSpot(TM) 64-Bit Server VM warning: ignoring option
> MaxPermSize=256m; support was removed in 8.0
> Running org.apache.hadoop.hbase.io.encoding.TestLoadAndSwitchEncodeOnDisk
> Java HotSpot(TM) 64-Bit Server VM warning: ignoring option
> MaxPermSize=256m; support was removed in 8.0
> Java HotSpot(TM) 64-Bit Server VM warning: ignoring option
> MaxPermSize=256m; support was removed in 8.0
> Running org.apache.hadoop.hbase.io.encoding.TestBufferedDataBlockEncoder
> Tests run: 2, Failures: 0, Errors: 0, Skipped: 0, Time elapsed: 18.077 sec
> - in org.apache.hadoop.hbase.io.encoding.TestBufferedDataBlockEncoder
> Java HotSpot(TM) 64-Bit Server VM warning: ignoring option
> MaxPermSize=256m; support was removed in 8.0
> Running org.apache.hadoop.hbase.io.encoding.TestEncodedSeekers
> Tests run: 1, Failures: 0, Errors: 0, Skipped: 0, Time elapsed: 33.204 sec
> - in org.apache.hadoop.hbase.io.encoding.TestLoadAndSwitchEncodeOnDisk
> Java HotSpot(TM) 64-Bit Server VM warning: ignoring option
> MaxPermSize=256m; support was removed in 8.0
> Running org.apache.hadoop.hbase.io.encoding.TestDataBlockEncoders
> Tests run: 28, Failures: 0, Errors: 0, Skipped: 0, Time elapsed: 91.911
> sec - in org.apache.hadoop.hbase.io.hfile.TestHFileBlock
> Java HotSpot(TM) 64-Bit Server VM warning: ignoring option
> MaxPermSize=256m; support was removed in 8.0
> Java HotSpot(TM) 64-Bit Server VM warning: ignoring option
> MaxPermSize=256m; support was removed in 8.0
> Running org.apache.hadoop.hbase.io.encoding.TestChangingEncoding
> Tests run: 72, Failures: 0, Errors: 0, Skipped: 0, Time elapsed: 155.913
> sec - in org.apache.hadoop.hbase.io.hfile.TestCacheOnWrite
> Java HotSpot(TM) 64-Bit Server VM warning: ignoring option
> MaxPermSize=256m; support was removed in 8.0
> Java HotSpot(TM) 64-Bit Server VM warning: ignoring option
> MaxPermSize=256m; support was removed in 8.0
> Java HotSpot(TM) 64-Bit Server VM warning: ignoring option
> MaxPermSize=256m; support was removed in 8.0
> Java HotSpot(TM) 64-Bit Server VM warning: ignoring option
> MaxPermSize=256m; support was removed in 8.0
> Running org.apache.hadoop.hbase.TestClusterBootOrder
> Tests run: 56, Failures: 0, Errors: 0, Skipped: 0, Time elapsed: 98.063
> sec - in org.apache.hadoop.hbase.io.encoding.TestDataBlockEncoders
> Tests run: 2, Failures: 0, Errors: 0, Skipped: 0, Time elapsed: 32.451 sec
> - in org.apache.hadoop.hbase.TestClusterBootOrder
> Tests run: 3, Failures: 0, Errors: 0, Skipped: 0, Time elapsed: 257.956
> sec - in org.apache.hadoop.hbase.filter.TestFuzzyRowFilterEndToEnd
> Tests run: 20, Failures: 0, Errors: 0, Skipped: 0, Time elapsed: 139.845
> sec - in org.apache.hadoop.hbase.io.encoding.TestEncodedSeekers
> Tests run: 3, Failures: 0, Errors: 0, Skipped: 0, Time elapsed: 147.686
> sec - in org.apache.hadoop.hbase.io.encoding.TestChangingEncoding
>
> Results :
>
> Failed tests:
>   TestHRegion.testBatchPut_whileNoRowLocksHeld:1498 Metrics Counters
> should be equal expected:<174> but was:<173>
> Tests in error:
>   TestTableLockManager.testReapAllTableLocks:282 » LockTimeout Timed out
> acquiri...
>
> Tests run: 2459, Failures: 1, Errors: 1, Skipped: 40
>
> [INFO]
> ------------------------------------------------------------------------
> [INFO] Reactor Summary:
> [INFO]
> [INFO] Apache HBase ...................................... SUCCESS [
> 3.077 s]
> [INFO] Apache HBase - Checkstyle ......................... SUCCESS [
> 0.685 s]
> [INFO] Apache HBase - Resource Bundle .................... SUCCESS [
> 0.182 s]
> [INFO] Apache HBase - Annotations ........................ SUCCESS [
> 0.185 s]
> [INFO] Apache HBase - Protocol ........................... SUCCESS [
> 2.994 s]
> [INFO] Apache HBase - Common ............................. SUCCESS [01:41
> min]
> [INFO] Apache HBase - Procedure .......................... SUCCESS [02:28
> min]
> [INFO] Apache HBase - Client ............................. SUCCESS [
> 35.359 s]
> [INFO] Apache HBase - Hadoop Compatibility ............... SUCCESS [
> 7.924 s]
> [INFO] Apache HBase - Hadoop Two Compatibility ........... SUCCESS [
> 9.065 s]
> [INFO] Apache HBase - Prefix Tree ........................ SUCCESS [
> 12.468 s]
> [INFO] Apache HBase - Server ............................. FAILURE [
> 01:23 h]
> [INFO] Apache HBase - Testing Util ....................... SKIPPED
> [INFO] Apache HBase - Thrift ............................. SKIPPED
> [INFO] Apache HBase - Shell .............................. SKIPPED
> [INFO] Apache HBase - Integration Tests .................. SKIPPED
> [INFO] Apache HBase - Examples ........................... SKIPPED
> [INFO] Apache HBase - Rest ............................... SKIPPED
> [INFO] Apache HBase - External Block Cache ............... SKIPPED
> [INFO] Apache HBase - Assembly ........................... SKIPPED
> [INFO] Apache HBase - Shaded ............................. SKIPPED
> [INFO] Apache HBase - Shaded - Client .................... SKIPPED
> [INFO] Apache HBase - Shaded - Server .................... SKIPPED
> [INFO] Apache HBase - Spark .............................. SKIPPED
> [INFO]
> ------------------------------------------------------------------------
> [INFO] BUILD FAILURE
> [INFO]
> ------------------------------------------------------------------------
> [INFO] Total time: 01:28 h
> [INFO] Finished at: 2015-11-29T23:15:04+00:00
> [INFO] Final Memory: 66M/4414M
> [INFO]
> ------------------------------------------------------------------------
> [ERROR] Failed to execute goal
> org.apache.maven.plugins:maven-surefire-plugin:2.18.1:test
> (secondPartTestsExecution) on project hbase-server: There are test failures.
> [ERROR]
> [ERROR] Please refer to <
> https://builds.apache.org/job/HBase-Trunk_matrix/jdk=latest1.8,label=Hadoop/ws/hbase-server/target/surefire-reports>
> for the individual test results.
> [ERROR] -> [Help 1]
> [ERROR]
> [ERROR] To see the full stack trace of the errors, re-run Maven with the
> -e switch.
> [ERROR] Re-run Maven using the -X switch to enable full debug logging.
> [ERROR]
> [ERROR] For more information about the errors and possible solutions,
> please read the following articles:
> [ERROR] [Help 1]
> http://cwiki.apache.org/confluence/display/MAVEN/MojoFailureException
> [ERROR]
> [ERROR] After correcting the problems, you can resume the build with the
> command
> [ERROR]   mvn <goals> -rf :hbase-server
> Build step 'Invoke top-level Maven targets' marked build as failure
> Performing Post build task...
> Match found for :.* : True
> Logical operation result is TRUE
> Running script  : # Run zombie detector script
> ./dev-support/zombie-detector.sh --jenkins ${BUILD_ID}
> [Hadoop] $ /bin/bash -xe /tmp/hudson5435707610274571289.sh
> + ./dev-support/zombie-detector.sh --jenkins 512
> POST BUILD TASK : SUCCESS
> END OF POST BUILD TASK : 0
> Archiving artifacts
> Recording test results
> [FINDBUGS] Skipping publisher since build result is FAILURE
> [CHECKSTYLE] Skipping publisher since build result is FAILURE
>

Mime
  • Unnamed multipart/alternative (inline, None, 0 bytes)
View raw message