hbase-dev mailing list archives

Site index · List index
Message view « Date » · « Thread »
Top « Date » · « Thread »
From Ted Yu <yuzhih...@gmail.com>
Subject Re: Branch 2 build failing?
Date Thu, 24 Sep 2015 15:47:50 GMT
I think branch-2 was created by accident.

Please base your testing on master / branch-1.

Cheers

On Thu, Sep 24, 2015 at 8:06 AM, Jean-Marc Spaggiari <
jean-marc@spaggiari.org> wrote:

> Talking about origin/branch-2...
>
> But maybe I just choosed the wrong one ;) The patch I'm testing doesn't
> apply on trunk but applies on this one, so I took a chance ;)
>
> JM
>
> 2015-09-24 11:02 GMT-04:00 Ted Yu <yuzhihong@gmail.com>:
>
> > I think you meant master branch - branch-2 hasn't been cut yet.
> >
> > TestHFileBlockPositionalRead.java was added on Sept 11th.
> >
> > I sync'ed with master branch but didn't reproduce the compilation error.
> >
> > FYI
> >
> > On Thu, Sep 24, 2015 at 7:51 AM, Jean-Marc Spaggiari <
> > jean-marc@spaggiari.org> wrote:
> >
> > > I have exported branch-2 this morning and it seems to fail to build:
> > >
> > > [INFO]
> > >
> ------------------------------------------------------------------------
> > > [INFO] BUILD FAILURE
> > > [INFO]
> > >
> ------------------------------------------------------------------------
> > > [INFO] Total time: 01:36 min
> > > [INFO] Finished at: 2015-09-24T10:43:22-04:00
> > > [INFO] Final Memory: 114M/1556M
> > > [INFO]
> > >
> ------------------------------------------------------------------------
> > > [ERROR] Failed to execute goal
> > > org.apache.maven.plugins:maven-compiler-plugin:2.5.1:testCompile
> > > (default-testCompile) on project hbase-server: Compilation failure:
> > > Compilation failure:
> > > [ERROR]
> > >
> > >
> >
> /stock/hbase-releases/hbase-trunk/hbase-server/src/test/java/org/apache/hadoop/hbase/io/hfile/TestHFileBlockPositionalRead.java:[26,49]
> > > error: cannot find symbol
> > > [ERROR] symbol:   class IOTests
> > > [ERROR] location: package org.apache.hadoop.hbase.testclassification
> > > [ERROR]
> > >
> > >
> >
> /stock/hbase-releases/hbase-trunk/hbase-server/src/test/java/org/apache/hadoop/hbase/io/hfile/TestHFileBlockPositionalRead.java:[36,11]
> > > error: cannot find symbol
> > > [ERROR] -> [Help 1]
> > > [ERROR]
> > >
> > >
> > > I just delete the file to build, but someone might want to look at
> that.
> > >
> >
>

Mime
  • Unnamed multipart/alternative (inline, None, 0 bytes)
View raw message