hbase-dev mailing list archives

Site index · List index
Message view « Date » · « Thread »
Top « Date » · « Thread »
From "Andrew Purtell (JIRA)" <j...@apache.org>
Subject [jira] [Resolved] (HBASE-4822) TestCoprocessorEndpoint is failing intermittently
Date Sat, 11 Apr 2015 01:04:12 GMT

     [ https://issues.apache.org/jira/browse/HBASE-4822?page=com.atlassian.jira.plugin.system.issuetabpanels:all-tabpanel
]

Andrew Purtell resolved HBASE-4822.
-----------------------------------
    Resolution: Cannot Reproduce

> TestCoprocessorEndpoint is failing intermittently
> -------------------------------------------------
>
>                 Key: HBASE-4822
>                 URL: https://issues.apache.org/jira/browse/HBASE-4822
>             Project: HBase
>          Issue Type: Bug
>          Components: test
>    Affects Versions: 0.92.0, 0.94.0
>            Reporter: Gary Helmling
>         Attachments: 4822.txt
>
>
> TestCoprocessorEndpoint is failing intermittently in Jenkins.  The errors are all similar
to:
> {noformat}
> -------------------------------------------------------------------------------
> Test set: org.apache.hadoop.hbase.coprocessor.TestCoprocessorEndpoint
> -------------------------------------------------------------------------------
> Tests run: 2, Failures: 1, Errors: 0, Skipped: 0, Time elapsed: 30.562 sec <<<
FAILURE!
> testAggregation(org.apache.hadoop.hbase.coprocessor.TestCoprocessorEndpoint)  Time elapsed:
0.069 sec  <<< FAILURE!
> java.lang.AssertionError: Invalid result expected:<180> but was:<190>
> 	at org.junit.Assert.fail(Assert.java:93)
> 	at org.junit.Assert.failNotEquals(Assert.java:647)
> 	at org.junit.Assert.assertEquals(Assert.java:128)
> 	at org.junit.Assert.assertEquals(Assert.java:472)
> 	at org.apache.hadoop.hbase.coprocessor.TestCoprocessorEndpoint.testAggregation(TestCoprocessorEndpoint.java:149)
> {noformat}



--
This message was sent by Atlassian JIRA
(v6.3.4#6332)

Mime
View raw message