hbase-dev mailing list archives

Site index · List index
Message view « Date » · « Thread »
Top « Date » · « Thread »
From "Jean-Daniel Cryans (JIRA)" <j...@apache.org>
Subject [jira] [Created] (HBASE-8855) TestTableInputFormatScan1/2 fail semi-silently with the hadoop 2 profile
Date Tue, 02 Jul 2013 23:18:21 GMT
Jean-Daniel Cryans created HBASE-8855:

             Summary: TestTableInputFormatScan1/2 fail semi-silently with the hadoop 2 profile
                 Key: HBASE-8855
                 URL: https://issues.apache.org/jira/browse/HBASE-8855
             Project: HBase
          Issue Type: Bug
    Affects Versions: 0.95.1, 0.94.8
            Reporter: Jean-Daniel Cryans

It looks like TestTableInputFormatScan1 and TestTableInputFormatScan2 never complete and surefire
doesn't complain about it. Sure, you may see this:

Tests run: 6, Failures: 5, Errors: 1, Skipped: 0, Time elapsed: 269.036 sec <<< FAILURE!
org.apache.maven.surefire.util.SurefireReflectionException: ...
Caused by: java.lang.OutOfMemoryError: PermGen space
org.apache.maven.surefire.booter.SurefireBooterForkException: Error occurred in starting fork,
check output in log

But then:

[INFO] HBase - Server .................................... SUCCESS [10:59.929s]

This is on my machine. On our local jenkins it's leaking and the processes never die. And
this is only with Hadoop 2. It also looks like other tests are failing with PermGen space.

This message is automatically generated by JIRA.
If you think it was sent incorrectly, please contact your JIRA administrators
For more information on JIRA, see: http://www.atlassian.com/software/jira

View raw message