hbase-dev mailing list archives

Site index · List index
Message view « Date » · « Thread »
Top « Date » · « Thread »
From apurt...@apache.org
Subject Build failed in Jenkins: HBase-TRUNK-Hadoop-2 #341
Date Mon, 03 Jun 2013 09:05:33 GMT
See <http://54.241.6.143/job/HBase-TRUNK-Hadoop-2/341/>

------------------------------------------
[...truncated 2551 lines...]
A         hbase-hadoop-compat/src/main/java/org/apache
A         hbase-hadoop-compat/src/main/java/org/apache/hadoop
A         hbase-hadoop-compat/src/main/java/org/apache/hadoop/hbase
A         hbase-hadoop-compat/src/main/java/org/apache/hadoop/hbase/thrift
A         hbase-hadoop-compat/src/main/java/org/apache/hadoop/hbase/thrift/MetricsThriftServerSource.java
A         hbase-hadoop-compat/src/main/java/org/apache/hadoop/hbase/thrift/metrics
A         hbase-hadoop-compat/src/main/java/org/apache/hadoop/hbase/thrift/MetricsThriftServerSourceFactory.java
A         hbase-hadoop-compat/src/main/java/org/apache/hadoop/hbase/CompatibilityFactory.java
A         hbase-hadoop-compat/src/main/java/org/apache/hadoop/hbase/CompatibilitySingletonFactory.java
A         hbase-hadoop-compat/src/main/java/org/apache/hadoop/hbase/metrics
A         hbase-hadoop-compat/src/main/java/org/apache/hadoop/hbase/metrics/MBeanSource.java
A         hbase-hadoop-compat/src/main/java/org/apache/hadoop/hbase/metrics/BaseSource.java
A         hbase-hadoop-compat/src/main/java/org/apache/hadoop/hbase/replication
A         hbase-hadoop-compat/src/main/java/org/apache/hadoop/hbase/replication/regionserver
A         hbase-hadoop-compat/src/main/java/org/apache/hadoop/hbase/replication/regionserver/MetricsReplicationSource.java
A         hbase-hadoop-compat/src/main/java/org/apache/hadoop/hbase/replication/regionserver/metrics
A         hbase-hadoop-compat/src/main/java/org/apache/hadoop/hbase/regionserver
A         hbase-hadoop-compat/src/main/java/org/apache/hadoop/hbase/regionserver/MetricsRegionAggregateSource.java
A         hbase-hadoop-compat/src/main/java/org/apache/hadoop/hbase/regionserver/MetricsRegionServerSource.java
A         hbase-hadoop-compat/src/main/java/org/apache/hadoop/hbase/regionserver/MetricsRegionServerWrapper.java
A         hbase-hadoop-compat/src/main/java/org/apache/hadoop/hbase/regionserver/wal
A         hbase-hadoop-compat/src/main/java/org/apache/hadoop/hbase/regionserver/wal/MetricsWALSource.java
A         hbase-hadoop-compat/src/main/java/org/apache/hadoop/hbase/regionserver/wal/MetricsEditsReplaySource.java
A         hbase-hadoop-compat/src/main/java/org/apache/hadoop/hbase/regionserver/MetricsRegionServerSourceFactory.java
A         hbase-hadoop-compat/src/main/java/org/apache/hadoop/hbase/regionserver/MetricsRegionSource.java
A         hbase-hadoop-compat/src/main/java/org/apache/hadoop/hbase/regionserver/MetricsRegionWrapper.java
A         hbase-hadoop-compat/src/main/java/org/apache/hadoop/hbase/ipc
A         hbase-hadoop-compat/src/main/java/org/apache/hadoop/hbase/ipc/MetricsHBaseServerSource.java
A         hbase-hadoop-compat/src/main/java/org/apache/hadoop/hbase/ipc/MetricsHBaseServerWrapper.java
A         hbase-hadoop-compat/src/main/java/org/apache/hadoop/hbase/ipc/MetricsHBaseServerSourceFactory.java
A         hbase-hadoop-compat/src/main/java/org/apache/hadoop/hbase/master
A         hbase-hadoop-compat/src/main/java/org/apache/hadoop/hbase/master/MetricsMasterSource.java
A         hbase-hadoop-compat/src/main/java/org/apache/hadoop/hbase/master/MetricsMasterWrapper.java
A         hbase-hadoop-compat/src/main/java/org/apache/hadoop/hbase/master/metrics
A         hbase-hadoop-compat/src/main/java/org/apache/hadoop/hbase/master/MetricsMasterSourceFactory.java
A         hbase-hadoop-compat/src/main/java/org/apache/hadoop/hbase/rest
A         hbase-hadoop-compat/src/main/java/org/apache/hadoop/hbase/rest/MetricsRESTSource.java
A         hbase-hadoop-compat/src/main/java/org/apache/hadoop/hbase/rest/metrics
A         hbase-hadoop-compat/src/main/java/org/apache/hadoop/metrics
A         hbase-hadoop-compat/src/main/java/org/apache/hadoop/metrics2
A         hbase-hadoop-compat/src/main/java/org/apache/hadoop/metrics2/MetricHistogram.java
A         hbase-hadoop-compat/src/main/java/org/apache/hadoop/metrics2/MetricsExecutor.java
A         hbase-hadoop-compat/pom.xml
A         README.txt
 U        .
At revision 1488909
no change for https://svn.apache.org/repos/asf/hbase/trunk since the previous build
[HBase-TRUNK-Hadoop-2] $ /bin/bash -xe /tmp/hudson1116936119708857639.sh
+ uname -a
Linux ip-10-174-105-230 3.4.36-39.44.amzn1.x86_64 #1 SMP Tue Mar 19 05:24:46 UTC 2013 x86_64
x86_64 x86_64 GNU/Linux
+ ulimit -a
core file size          (blocks, -c) 0
data seg size           (kbytes, -d) unlimited
scheduling priority             (-e) 0
file size               (blocks, -f) unlimited
pending signals                 (-i) 119688
max locked memory       (kbytes, -l) 64
max memory size         (kbytes, -m) unlimited
open files                      (-n) 65536
pipe size            (512 bytes, -p) 8
POSIX message queues     (bytes, -q) 819200
real-time priority              (-r) 0
stack size              (kbytes, -s) 8192
cpu time               (seconds, -t) unlimited
max user processes              (-u) 65536
virtual memory          (kbytes, -v) unlimited
file locks                      (-x) unlimited
+ mvn -version
Apache Maven 3.0.4 (r1232337; 2012-01-17 08:44:56+0000)
Maven home: /opt/maven
Java version: 1.6.0_43, vendor: Sun Microsystems Inc.
Java home: /usr/java/jdk1.6.0_43/jre
Default locale: en_US, platform encoding: UTF-8
OS name: "linux", version: "3.4.36-39.44.amzn1.x86_64", arch: "amd64", family: "unix"
Parsing POMs
[HBase-TRUNK-Hadoop-2] $ /usr/java/default/bin/java -Xmx5g -XX:MaxPermSize=1g -cp /home/ec2-user/jenkins/maven3-agent.jar:/opt/maven/boot/plexus-classworlds-2.4.jar
org.jvnet.hudson.maven3.agent.Maven3Main /opt/maven /tmp/slave.jar /home/ec2-user/jenkins/maven3-interceptor.jar
59552
<===[JENKINS REMOTING CAPACITY]===>   channel started
log4j:WARN No appenders could be found for logger (org.apache.commons.beanutils.converters.BooleanConverter).
log4j:WARN Please initialize the log4j system properly.
Executing Maven:  -B -f <http://54.241.6.143/job/HBase-TRUNK-Hadoop-2/ws/pom.xml> -Dmaven.repo.local=/home/ec2-user/jenkins/maven-repositories/0
-PrunAllTests -Dhadoop.profile=2.0 install javadoc:aggregate site assembly:single
[INFO] Scanning for projects...
[INFO] ------------------------------------------------------------------------
[INFO] Reactor Build Order:
[INFO] 
[INFO] HBase
[INFO] HBase - Common
[INFO] HBase - Protocol
[INFO] HBase - Client
[INFO] HBase - Prefix Tree
[INFO] HBase - Hadoop Compatibility
[INFO] HBase - Hadoop Two Compatibility
[INFO] HBase - Server
[INFO] HBase - Integration Tests
[INFO] HBase - Examples
[INFO] HBase - Assembly
Downloading: http://people.apache.org/~garyh/mvn/org/apache/maven/plugins/maven-surefire-report-plugin/2.12-TRUNK-HBASE-2/maven-surefire-report-plugin-2.12-TRUNK-HBASE-2.pom
Downloading: http://repo.maven.apache.org/maven2/org/apache/maven/plugins/maven-surefire-report-plugin/2.12-TRUNK-HBASE-2/maven-surefire-report-plugin-2.12-TRUNK-HBASE-2.pom
[WARNING] Failed to retrieve plugin descriptor for org.apache.maven.plugins:maven-surefire-report-plugin:2.12-TRUNK-HBASE-2:
Plugin org.apache.maven.plugins:maven-surefire-report-plugin:2.12-TRUNK-HBASE-2 or one of
its dependencies could not be resolved: Failed to read artifact descriptor for org.apache.maven.plugins:maven-surefire-report-plugin:jar:2.12-TRUNK-HBASE-2
[INFO]                                                                         
[INFO] ------------------------------------------------------------------------
[INFO] Building HBase 0.97.0-SNAPSHOT
[INFO] ------------------------------------------------------------------------
[INFO] 
[INFO] --- maven-remote-resources-plugin:1.4:process (default) @ hbase ---
[INFO] 
[INFO] --- findbugs-maven-plugin:2.5.2:findbugs (default) @ hbase ---
[FINDBUGS] No report found for mojo findbugs
[INFO] 
[INFO] --- maven-site-plugin:3.2:attach-descriptor (attach-descriptor) @ hbase ---
[INFO] 
[INFO] --- maven-install-plugin:2.3.1:install (default-install) @ hbase ---
[INFO] Installing <http://54.241.6.143/job/HBase-TRUNK-Hadoop-2/ws/pom.xml> to /home/ec2-user/jenkins/maven-repositories/0/org/apache/hbase/hbase/0.97.0-SNAPSHOT/hbase-0.97.0-SNAPSHOT.pom
[INFO] Installing <http://54.241.6.143/job/HBase-TRUNK-Hadoop-2/ws/target/hbase-0.97.0-SNAPSHOT-site.xml>
to /home/ec2-user/jenkins/maven-repositories/0/org/apache/hbase/hbase/0.97.0-SNAPSHOT/hbase-0.97.0-SNAPSHOT-site.xml
[INFO]                                                                         
[INFO] ------------------------------------------------------------------------
[INFO] Building HBase - Common 0.97.0-SNAPSHOT
[INFO] ------------------------------------------------------------------------
Downloading: http://people.apache.org/~garyh/mvn/org/apache/maven/plugins/maven-surefire-plugin/2.12-TRUNK-HBASE-2/maven-surefire-plugin-2.12-TRUNK-HBASE-2.pom
Downloading: http://repo.maven.apache.org/maven2/org/apache/maven/plugins/maven-surefire-plugin/2.12-TRUNK-HBASE-2/maven-surefire-plugin-2.12-TRUNK-HBASE-2.pom
[INFO]                                                                         
[INFO] ------------------------------------------------------------------------
[INFO] Skipping HBase
[INFO] This project has been banned from the build due to previous failures.
[INFO] ------------------------------------------------------------------------
[INFO]                                                                         
[INFO] ------------------------------------------------------------------------
[INFO] Skipping HBase
[INFO] This project has been banned from the build due to previous failures.
[INFO] ------------------------------------------------------------------------
[INFO] ------------------------------------------------------------------------
[INFO] Reactor Summary:
[INFO] 
[INFO] HBase ............................................. SUCCESS [10.000s]
[INFO] HBase - Common .................................... FAILURE [1:03.150s]
[INFO] HBase - Protocol .................................. SKIPPED
[INFO] HBase - Client .................................... SKIPPED
[INFO] HBase - Prefix Tree ............................... SKIPPED
[INFO] HBase - Hadoop Compatibility ...................... SKIPPED
[INFO] HBase - Hadoop Two Compatibility .................. SKIPPED
[INFO] HBase - Server .................................... SKIPPED
[INFO] HBase - Integration Tests ......................... SKIPPED
[INFO] HBase - Examples .................................. SKIPPED
[INFO] HBase - Assembly .................................. SKIPPED
[INFO] ------------------------------------------------------------------------
[INFO] BUILD FAILURE
[INFO] ------------------------------------------------------------------------
[INFO] Total time: 2:18.925s
[INFO] Finished at: Mon Jun 03 09:05:30 UTC 2013
[INFO] Final Memory: 25M/223M
[INFO] ------------------------------------------------------------------------
[JENKINS] Archiving <http://54.241.6.143/job/HBase-TRUNK-Hadoop-2/ws/hbase-hadoop2-compat/pom.xml>
to /var/lib/jenkins/jobs/HBase-TRUNK-Hadoop-2/modules/org.apache.hbase$hbase-hadoop2-compat/builds/2013-06-03_09-03-04/archive/org.apache.hbase/hbase-hadoop2-compat/0.97.0-SNAPSHOT/hbase-hadoop2-compat-0.97.0-SNAPSHOT.pom
[JENKINS] Archiving <http://54.241.6.143/job/HBase-TRUNK-Hadoop-2/ws/hbase-common/pom.xml>
to /var/lib/jenkins/jobs/HBase-TRUNK-Hadoop-2/modules/org.apache.hbase$hbase-common/builds/2013-06-03_09-03-04/archive/org.apache.hbase/hbase-common/0.97.0-SNAPSHOT/hbase-common-0.97.0-SNAPSHOT.pom
[JENKINS] Archiving <http://54.241.6.143/job/HBase-TRUNK-Hadoop-2/ws/hbase-hadoop-compat/pom.xml>
to /var/lib/jenkins/jobs/HBase-TRUNK-Hadoop-2/modules/org.apache.hbase$hbase-hadoop-compat/builds/2013-06-03_09-03-04/archive/org.apache.hbase/hbase-hadoop-compat/0.97.0-SNAPSHOT/hbase-hadoop-compat-0.97.0-SNAPSHOT.pom
[JENKINS] Archiving <http://54.241.6.143/job/HBase-TRUNK-Hadoop-2/ws/hbase-examples/pom.xml>
to /var/lib/jenkins/jobs/HBase-TRUNK-Hadoop-2/modules/org.apache.hbase$hbase-examples/builds/2013-06-03_09-03-04/archive/org.apache.hbase/hbase-examples/0.97.0-SNAPSHOT/hbase-examples-0.97.0-SNAPSHOT.pom
[JENKINS] Archiving <http://54.241.6.143/job/HBase-TRUNK-Hadoop-2/ws/hbase-it/pom.xml>
to /var/lib/jenkins/jobs/HBase-TRUNK-Hadoop-2/modules/org.apache.hbase$hbase-it/builds/2013-06-03_09-03-04/archive/org.apache.hbase/hbase-it/0.97.0-SNAPSHOT/hbase-it-0.97.0-SNAPSHOT.pom
[JENKINS] Archiving <http://54.241.6.143/job/HBase-TRUNK-Hadoop-2/ws/pom.xml> to /var/lib/jenkins/jobs/HBase-TRUNK-Hadoop-2/modules/org.apache.hbase$hbase/builds/2013-06-03_09-03-04/archive/org.apache.hbase/hbase/0.97.0-SNAPSHOT/hbase-0.97.0-SNAPSHOT.pom
[JENKINS] Archiving <http://54.241.6.143/job/HBase-TRUNK-Hadoop-2/ws/target/hbase-0.97.0-SNAPSHOT-site.xml>
to /var/lib/jenkins/jobs/HBase-TRUNK-Hadoop-2/modules/org.apache.hbase$hbase/builds/2013-06-03_09-03-04/archive/org.apache.hbase/hbase/0.97.0-SNAPSHOT/hbase-0.97.0-SNAPSHOT-site.xml
[JENKINS] Archiving <http://54.241.6.143/job/HBase-TRUNK-Hadoop-2/ws/hbase-assembly/pom.xml>
to /var/lib/jenkins/jobs/HBase-TRUNK-Hadoop-2/modules/org.apache.hbase$hbase-assembly/builds/2013-06-03_09-03-04/archive/org.apache.hbase/hbase-assembly/0.97.0-SNAPSHOT/hbase-assembly-0.97.0-SNAPSHOT.pom
[JENKINS] Archiving <http://54.241.6.143/job/HBase-TRUNK-Hadoop-2/ws/hbase-client/pom.xml>
to /var/lib/jenkins/jobs/HBase-TRUNK-Hadoop-2/modules/org.apache.hbase$hbase-client/builds/2013-06-03_09-03-04/archive/org.apache.hbase/hbase-client/0.97.0-SNAPSHOT/hbase-client-0.97.0-SNAPSHOT.pom
[JENKINS] Archiving <http://54.241.6.143/job/HBase-TRUNK-Hadoop-2/ws/hbase-prefix-tree/pom.xml>
to /var/lib/jenkins/jobs/HBase-TRUNK-Hadoop-2/modules/org.apache.hbase$hbase-prefix-tree/builds/2013-06-03_09-03-04/archive/org.apache.hbase/hbase-prefix-tree/0.97.0-SNAPSHOT/hbase-prefix-tree-0.97.0-SNAPSHOT.pom
[JENKINS] Archiving <http://54.241.6.143/job/HBase-TRUNK-Hadoop-2/ws/hbase-protocol/pom.xml>
to /var/lib/jenkins/jobs/HBase-TRUNK-Hadoop-2/modules/org.apache.hbase$hbase-protocol/builds/2013-06-03_09-03-04/archive/org.apache.hbase/hbase-protocol/0.97.0-SNAPSHOT/hbase-protocol-0.97.0-SNAPSHOT.pom
[JENKINS] Archiving <http://54.241.6.143/job/HBase-TRUNK-Hadoop-2/ws/hbase-server/pom.xml>
to /var/lib/jenkins/jobs/HBase-TRUNK-Hadoop-2/modules/org.apache.hbase$hbase-server/builds/2013-06-03_09-03-04/archive/org.apache.hbase/hbase-server/0.97.0-SNAPSHOT/hbase-server-0.97.0-SNAPSHOT.pom
Waiting for Jenkins to finish collecting data
mavenExecutionResult exceptions not empty
message : Plugin org.apache.maven.plugins:maven-surefire-plugin:2.12-TRUNK-HBASE-2 or one
of its dependencies could not be resolved: Failed to read artifact descriptor for org.apache.maven.plugins:maven-surefire-plugin:jar:2.12-TRUNK-HBASE-2
cause : Failed to read artifact descriptor for org.apache.maven.plugins:maven-surefire-plugin:jar:2.12-TRUNK-HBASE-2
Stack trace : 
org.apache.maven.plugin.PluginResolutionException: Plugin org.apache.maven.plugins:maven-surefire-plugin:2.12-TRUNK-HBASE-2
or one of its dependencies could not be resolved: Failed to read artifact descriptor for org.apache.maven.plugins:maven-surefire-plugin:jar:2.12-TRUNK-HBASE-2
	at org.apache.maven.plugin.internal.DefaultPluginDependenciesResolver.resolve(DefaultPluginDependenciesResolver.java:129)
	at org.apache.maven.plugin.internal.DefaultMavenPluginManager.getPluginDescriptor(DefaultMavenPluginManager.java:142)
	at org.apache.maven.plugin.internal.DefaultMavenPluginManager.getMojoDescriptor(DefaultMavenPluginManager.java:261)
	at org.apache.maven.plugin.DefaultBuildPluginManager.getMojoDescriptor(DefaultBuildPluginManager.java:185)
	at org.apache.maven.lifecycle.internal.DefaultLifecycleExecutionPlanCalculator.setupMojoExecution(DefaultLifecycleExecutionPlanCalculator.java:152)
	at org.apache.maven.lifecycle.internal.DefaultLifecycleExecutionPlanCalculator.setupMojoExecutions(DefaultLifecycleExecutionPlanCalculator.java:139)
	at org.apache.maven.lifecycle.internal.DefaultLifecycleExecutionPlanCalculator.calculateExecutionPlan(DefaultLifecycleExecutionPlanCalculator.java:116)
	at org.apache.maven.lifecycle.internal.DefaultLifecycleExecutionPlanCalculator.calculateExecutionPlan(DefaultLifecycleExecutionPlanCalculator.java:129)
	at org.apache.maven.lifecycle.internal.BuilderCommon.resolveBuildPlan(BuilderCommon.java:92)
	at org.apache.maven.lifecycle.internal.LifecycleModuleBuilder.buildProject(LifecycleModuleBuilder.java:81)
	at org.apache.maven.lifecycle.internal.LifecycleModuleBuilder.buildProject(LifecycleModuleBuilder.java:59)
	at org.apache.maven.lifecycle.internal.LifecycleStarter.singleThreadedBuild(LifecycleStarter.java:183)
	at org.apache.maven.lifecycle.internal.LifecycleStarter.execute(LifecycleStarter.java:161)
	at org.apache.maven.DefaultMaven.doExecute(DefaultMaven.java:320)
	at org.apache.maven.DefaultMaven.execute(DefaultMaven.java:156)
	at org.jvnet.hudson.maven3.launcher.Maven3Launcher.main(Maven3Launcher.java:79)
	at sun.reflect.NativeMethodAccessorImpl.invoke0(Native Method)
	at sun.reflect.NativeMethodAccessorImpl.invoke(NativeMethodAccessorImpl.java:39)
	at sun.reflect.DelegatingMethodAccessorImpl.invoke(DelegatingMethodAccessorImpl.java:25)
	at java.lang.reflect.Method.invoke(Method.java:597)
	at org.codehaus.plexus.classworlds.launcher.Launcher.launchStandard(Launcher.java:329)
	at org.codehaus.plexus.classworlds.launcher.Launcher.launch(Launcher.java:239)
	at org.jvnet.hudson.maven3.agent.Maven3Main.launch(Maven3Main.java:158)
	at hudson.maven.Maven3Builder.call(Maven3Builder.java:100)
	at hudson.maven.Maven3Builder.call(Maven3Builder.java:66)
	at hudson.remoting.UserRequest.perform(UserRequest.java:118)
	at hudson.remoting.UserRequest.perform(UserRequest.java:48)
	at hudson.remoting.Request$2.run(Request.java:326)
	at hudson.remoting.InterceptingExecutorService$1.call(InterceptingExecutorService.java:72)
	at java.util.concurrent.FutureTask$Sync.innerRun(FutureTask.java:303)
	at java.util.concurrent.FutureTask.run(FutureTask.java:138)
	at java.util.concurrent.ThreadPoolExecutor$Worker.runTask(ThreadPoolExecutor.java:895)
	at java.util.concurrent.ThreadPoolExecutor$Worker.run(ThreadPoolExecutor.java:918)
	at java.lang.Thread.run(Thread.java:662)
Caused by: org.sonatype.aether.resolution.ArtifactDescriptorException: Failed to read artifact
descriptor for org.apache.maven.plugins:maven-surefire-plugin:jar:2.12-TRUNK-HBASE-2
	at org.apache.maven.repository.internal.DefaultArtifactDescriptorReader.loadPom(DefaultArtifactDescriptorReader.java:296)
	at org.apache.maven.repository.internal.DefaultArtifactDescriptorReader.readArtifactDescriptor(DefaultArtifactDescriptorReader.java:186)
	at org.sonatype.aether.impl.internal.DefaultRepositorySystem.readArtifactDescriptor(DefaultRepositorySystem.java:279)
	at org.apache.maven.plugin.internal.DefaultPluginDependenciesResolver.resolve(DefaultPluginDependenciesResolver.java:115)
	... 33 more
Caused by: org.sonatype.aether.resolution.ArtifactResolutionException: Could not transfer
artifact org.apache.maven.plugins:maven-surefire-plugin:pom:2.12-TRUNK-HBASE-2 from/to ghelmling.testing
(http://people.apache.org/~garyh/mvn/): Connection to http://people.apache.org refused
	at org.sonatype.aether.impl.internal.DefaultArtifactResolver.resolve(DefaultArtifactResolver.java:538)
	at org.sonatype.aether.impl.internal.DefaultArtifactResolver.resolveArtifacts(DefaultArtifactResolver.java:216)
	at org.sonatype.aether.impl.internal.DefaultArtifactResolver.resolveArtifact(DefaultArtifactResolver.java:193)
	at org.apache.maven.repository.internal.DefaultArtifactDescriptorReader.loadPom(DefaultArtifactDescriptorReader.java:281)
	... 36 more
Caused by: org.sonatype.aether.transfer.ArtifactTransferException: Could not transfer artifact
org.apache.maven.plugins:maven-surefire-plugin:pom:2.12-TRUNK-HBASE-2 from/to ghelmling.testing
(http://people.apache.org/~garyh/mvn/): Connection to http://people.apache.org refused
	at org.sonatype.aether.connector.wagon.WagonRepositoryConnector$4.wrap(WagonRepositoryConnector.java:951)
	at org.sonatype.aether.connector.wagon.WagonRepositoryConnector$4.wrap(WagonRepositoryConnector.java:941)
	at org.sonatype.aether.connector.wagon.WagonRepositoryConnector$GetTask.run(WagonRepositoryConnector.java:669)
	at org.sonatype.aether.util.concurrency.RunnableErrorForwarder$1.run(RunnableErrorForwarder.java:60)
	... 3 more
Caused by: org.apache.maven.wagon.TransferFailedException: Connection to http://people.apache.org
refused
	at org.apache.maven.wagon.shared.http4.AbstractHttpClientWagon.fillInputData(AbstractHttpClientWagon.java:799)
	at org.apache.maven.wagon.StreamWagon.getInputStream(StreamWagon.java:116)
	at org.apache.maven.wagon.StreamWagon.getIfNewer(StreamWagon.java:88)
	at org.apache.maven.wagon.StreamWagon.get(StreamWagon.java:61)
	at org.sonatype.aether.connector.wagon.WagonRepositoryConnector$GetTask.run(WagonRepositoryConnector.java:601)
	... 4 more
Caused by: org.apache.maven.wagon.providers.http.httpclient.conn.HttpHostConnectException:
Connection to http://people.apache.org refused
	at org.apache.maven.wagon.providers.http.httpclient.impl.conn.DefaultClientConnectionOperator.openConnection(DefaultClientConnectionOperator.java:158)
	at org.apache.maven.wagon.providers.http.httpclient.impl.conn.AbstractPoolEntry.open(AbstractPoolEntry.java:149)
	at org.apache.maven.wagon.providers.http.httpclient.impl.conn.AbstractPooledConnAdapter.open(AbstractPooledConnAdapter.java:121)
	at org.apache.maven.wagon.providers.http.httpclient.impl.client.DefaultRequestDirector.tryConnect(DefaultRequestDirector.java:573)
	at org.apache.maven.wagon.providers.http.httpclient.impl.client.DefaultRequestDirector.execute(DefaultRequestDirector.java:425)
	at org.apache.maven.wagon.providers.http.httpclient.impl.client.AbstractHttpClient.execute(AbstractHttpClient.java:820)
	at org.apache.maven.wagon.providers.http.httpclient.impl.client.AbstractHttpClient.execute(AbstractHttpClient.java:754)
	at org.apache.maven.wagon.shared.http4.AbstractHttpClientWagon.execute(AbstractHttpClientWagon.java:674)
	at org.apache.maven.wagon.shared.http4.AbstractHttpClientWagon.fillInputData(AbstractHttpClientWagon.java:793)
	... 8 more
Caused by: java.net.ConnectException: Connection timed out
	at java.net.PlainSocketImpl.socketConnect(Native Method)
	at java.net.PlainSocketImpl.doConnect(PlainSocketImpl.java:351)
	at java.net.PlainSocketImpl.connectToAddress(PlainSocketImpl.java:213)
	at java.net.PlainSocketImpl.connect(PlainSocketImpl.java:200)
	at java.net.SocksSocketImpl.connect(SocksSocketImpl.java:366)
	at java.net.Socket.connect(Socket.java:529)
	at org.apache.maven.wagon.providers.http.httpclient.conn.scheme.PlainSocketFactory.connectSocket(PlainSocketFactory.java:123)
	at org.apache.maven.wagon.providers.http.httpclient.impl.conn.DefaultClientConnectionOperator.openConnection(DefaultClientConnectionOperator.java:148)
	... 16 more
channel stopped

Mime
View raw message