hbase-dev mailing list archives

Site index · List index
Message view « Date » · « Thread »
Top « Date » · « Thread »
From Apache Jenkins Server <jenk...@builds.apache.org>
Subject Build failed in Jenkins: hbase-0.95-on-hadoop2 #123
Date Thu, 06 Jun 2013 03:19:54 GMT
See <https://builds.apache.org/job/hbase-0.95-on-hadoop2/123/changes>

Changes:

[stack] HBASE-8402 ScanMetrics depends on number of rpc calls to the server

[jyates] HBASE-8684: Table Coprocessor can't access external HTable by default - ADDENDUM: moving test to correct package

[stack] HBASE-8645 Change ServerName so it uses hostname only, not FQDN hostnames

[jyates] HBASE-8684: Table Coprocessor can't access external HTable by default

------------------------------------------
[...truncated 24539 lines...]
Tests run: 3, Failures: 0, Errors: 0, Skipped: 0, Time elapsed: 77.552 sec
Forking command line: /bin/sh -c cd <https://builds.apache.org/job/hbase-0.95-on-hadoop2/ws/0.95-on-hadoop2/hbase-server> && /home/jenkins/tools/java/jdk1.6.0_45-32/jre/bin/java -enableassertions -Xmx1900m -Djava.security.egd=file:/dev/./urandom -Djava.net.preferIPv4Stack=true -jar <https://builds.apache.org/job/hbase-0.95-on-hadoop2/ws/0.95-on-hadoop2/hbase-server/target/surefire/surefirebooter7834987369322784533.jar> <https://builds.apache.org/job/hbase-0.95-on-hadoop2/ws/0.95-on-hadoop2/hbase-server/target/surefire/surefire8788817953357582946tmp> <https://builds.apache.org/job/hbase-0.95-on-hadoop2/ws/0.95-on-hadoop2/hbase-server/target/surefire/surefire_193177400945660795444tmp>
Running org.apache.hadoop.hbase.replication.TestReplicationQueueFailover
Tests run: 1, Failures: 0, Errors: 0, Skipped: 0, Time elapsed: 100.796 sec
Forking command line: /bin/sh -c cd <https://builds.apache.org/job/hbase-0.95-on-hadoop2/ws/0.95-on-hadoop2/hbase-server> && /home/jenkins/tools/java/jdk1.6.0_45-32/jre/bin/java -enableassertions -Xmx1900m -Djava.security.egd=file:/dev/./urandom -Djava.net.preferIPv4Stack=true -jar <https://builds.apache.org/job/hbase-0.95-on-hadoop2/ws/0.95-on-hadoop2/hbase-server/target/surefire/surefirebooter6724223405696401900.jar> <https://builds.apache.org/job/hbase-0.95-on-hadoop2/ws/0.95-on-hadoop2/hbase-server/target/surefire/surefire2857820298213370572tmp> <https://builds.apache.org/job/hbase-0.95-on-hadoop2/ws/0.95-on-hadoop2/hbase-server/target/surefire/surefire_194368107731775255637tmp>
Running org.apache.hadoop.hbase.coprocessor.TestCoprocessorEndpoint
Tests run: 6, Failures: 0, Errors: 0, Skipped: 0, Time elapsed: 9.771 sec
Forking command line: /bin/sh -c cd <https://builds.apache.org/job/hbase-0.95-on-hadoop2/ws/0.95-on-hadoop2/hbase-server> && /home/jenkins/tools/java/jdk1.6.0_45-32/jre/bin/java -enableassertions -Xmx1900m -Djava.security.egd=file:/dev/./urandom -Djava.net.preferIPv4Stack=true -jar <https://builds.apache.org/job/hbase-0.95-on-hadoop2/ws/0.95-on-hadoop2/hbase-server/target/surefire/surefirebooter8667553699289258703.jar> <https://builds.apache.org/job/hbase-0.95-on-hadoop2/ws/0.95-on-hadoop2/hbase-server/target/surefire/surefire2188851869549591760tmp> <https://builds.apache.org/job/hbase-0.95-on-hadoop2/ws/0.95-on-hadoop2/hbase-server/target/surefire/surefire_1958311229791856012803tmp>
Running org.apache.hadoop.hbase.coprocessor.TestMasterObserver
Tests run: 4, Failures: 0, Errors: 0, Skipped: 0, Time elapsed: 32.882 sec
Forking command line: /bin/sh -c cd <https://builds.apache.org/job/hbase-0.95-on-hadoop2/ws/0.95-on-hadoop2/hbase-server> && /home/jenkins/tools/java/jdk1.6.0_45-32/jre/bin/java -enableassertions -Xmx1900m -Djava.security.egd=file:/dev/./urandom -Djava.net.preferIPv4Stack=true -jar <https://builds.apache.org/job/hbase-0.95-on-hadoop2/ws/0.95-on-hadoop2/hbase-server/target/surefire/surefirebooter7125952070776666332.jar> <https://builds.apache.org/job/hbase-0.95-on-hadoop2/ws/0.95-on-hadoop2/hbase-server/target/surefire/surefire7061253556691073817tmp> <https://builds.apache.org/job/hbase-0.95-on-hadoop2/ws/0.95-on-hadoop2/hbase-server/target/surefire/surefire_1965818447822176073324tmp>
Running org.apache.hadoop.hbase.coprocessor.TestWALObserver
Tests run: 3, Failures: 0, Errors: 0, Skipped: 0, Time elapsed: 12.923 sec
Forking command line: /bin/sh -c cd <https://builds.apache.org/job/hbase-0.95-on-hadoop2/ws/0.95-on-hadoop2/hbase-server> && /home/jenkins/tools/java/jdk1.6.0_45-32/jre/bin/java -enableassertions -Xmx1900m -Djava.security.egd=file:/dev/./urandom -Djava.net.preferIPv4Stack=true -jar <https://builds.apache.org/job/hbase-0.95-on-hadoop2/ws/0.95-on-hadoop2/hbase-server/target/surefire/surefirebooter6151729873055355946.jar> <https://builds.apache.org/job/hbase-0.95-on-hadoop2/ws/0.95-on-hadoop2/hbase-server/target/surefire/surefire5397116171565360699tmp> <https://builds.apache.org/job/hbase-0.95-on-hadoop2/ws/0.95-on-hadoop2/hbase-server/target/surefire/surefire_197715160201003651763tmp>
Running org.apache.hadoop.hbase.coprocessor.TestRegionObserverBypass
Tests run: 2, Failures: 0, Errors: 0, Skipped: 0, Time elapsed: 12.33 sec
Forking command line: /bin/sh -c cd <https://builds.apache.org/job/hbase-0.95-on-hadoop2/ws/0.95-on-hadoop2/hbase-server> && /home/jenkins/tools/java/jdk1.6.0_45-32/jre/bin/java -enableassertions -Xmx1900m -Djava.security.egd=file:/dev/./urandom -Djava.net.preferIPv4Stack=true -jar <https://builds.apache.org/job/hbase-0.95-on-hadoop2/ws/0.95-on-hadoop2/hbase-server/target/surefire/surefirebooter9169531626502880812.jar> <https://builds.apache.org/job/hbase-0.95-on-hadoop2/ws/0.95-on-hadoop2/hbase-server/target/surefire/surefire3427190612775881146tmp> <https://builds.apache.org/job/hbase-0.95-on-hadoop2/ws/0.95-on-hadoop2/hbase-server/target/surefire/surefire_1982471455914478740157tmp>
Running org.apache.hadoop.hbase.coprocessor.TestRegionServerCoprocessorExceptionWithAbort
Tests run: 1, Failures: 0, Errors: 0, Skipped: 0, Time elapsed: 12.19 sec
Forking command line: /bin/sh -c cd <https://builds.apache.org/job/hbase-0.95-on-hadoop2/ws/0.95-on-hadoop2/hbase-server> && /home/jenkins/tools/java/jdk1.6.0_45-32/jre/bin/java -enableassertions -Xmx1900m -Djava.security.egd=file:/dev/./urandom -Djava.net.preferIPv4Stack=true -jar <https://builds.apache.org/job/hbase-0.95-on-hadoop2/ws/0.95-on-hadoop2/hbase-server/target/surefire/surefirebooter3313593066941173107.jar> <https://builds.apache.org/job/hbase-0.95-on-hadoop2/ws/0.95-on-hadoop2/hbase-server/target/surefire/surefire5772603982416953742tmp> <https://builds.apache.org/job/hbase-0.95-on-hadoop2/ws/0.95-on-hadoop2/hbase-server/target/surefire/surefire_1991383191275450284146tmp>
Running org.apache.hadoop.hbase.coprocessor.TestMasterCoprocessorExceptionWithAbort
Tests run: 1, Failures: 0, Errors: 0, Skipped: 0, Time elapsed: 22.018 sec
Forking command line: /bin/sh -c cd <https://builds.apache.org/job/hbase-0.95-on-hadoop2/ws/0.95-on-hadoop2/hbase-server> && /home/jenkins/tools/java/jdk1.6.0_45-32/jre/bin/java -enableassertions -Xmx1900m -Djava.security.egd=file:/dev/./urandom -Djava.net.preferIPv4Stack=true -jar <https://builds.apache.org/job/hbase-0.95-on-hadoop2/ws/0.95-on-hadoop2/hbase-server/target/surefire/surefirebooter3188771402150141019.jar> <https://builds.apache.org/job/hbase-0.95-on-hadoop2/ws/0.95-on-hadoop2/hbase-server/target/surefire/surefire7853629077540496909tmp> <https://builds.apache.org/job/hbase-0.95-on-hadoop2/ws/0.95-on-hadoop2/hbase-server/target/surefire/surefire_2004171448574448304732tmp>
Running org.apache.hadoop.hbase.coprocessor.TestMasterCoprocessorExceptionWithRemove
Tests run: 1, Failures: 0, Errors: 0, Skipped: 0, Time elapsed: 11.149 sec
Forking command line: /bin/sh -c cd <https://builds.apache.org/job/hbase-0.95-on-hadoop2/ws/0.95-on-hadoop2/hbase-server> && /home/jenkins/tools/java/jdk1.6.0_45-32/jre/bin/java -enableassertions -Xmx1900m -Djava.security.egd=file:/dev/./urandom -Djava.net.preferIPv4Stack=true -jar <https://builds.apache.org/job/hbase-0.95-on-hadoop2/ws/0.95-on-hadoop2/hbase-server/target/surefire/surefirebooter709793256733828816.jar> <https://builds.apache.org/job/hbase-0.95-on-hadoop2/ws/0.95-on-hadoop2/hbase-server/target/surefire/surefire685970464183576319tmp> <https://builds.apache.org/job/hbase-0.95-on-hadoop2/ws/0.95-on-hadoop2/hbase-server/target/surefire/surefire_2017446315882423231523tmp>
Running org.apache.hadoop.hbase.coprocessor.TestRegionObserverScannerOpenHook
Tests run: 1, Failures: 0, Errors: 0, Skipped: 0, Time elapsed: 7.969 sec
Forking command line: /bin/sh -c cd <https://builds.apache.org/job/hbase-0.95-on-hadoop2/ws/0.95-on-hadoop2/hbase-server> && /home/jenkins/tools/java/jdk1.6.0_45-32/jre/bin/java -enableassertions -Xmx1900m -Djava.security.egd=file:/dev/./urandom -Djava.net.preferIPv4Stack=true -jar <https://builds.apache.org/job/hbase-0.95-on-hadoop2/ws/0.95-on-hadoop2/hbase-server/target/surefire/surefirebooter971398725033427508.jar> <https://builds.apache.org/job/hbase-0.95-on-hadoop2/ws/0.95-on-hadoop2/hbase-server/target/surefire/surefire2838547189332924559tmp> <https://builds.apache.org/job/hbase-0.95-on-hadoop2/ws/0.95-on-hadoop2/hbase-server/target/surefire/surefire_2027224221500854931001tmp>
Running org.apache.hadoop.hbase.coprocessor.TestOpenTableInCoprocessor
Tests run: 1, Failures: 0, Errors: 0, Skipped: 0, Time elapsed: 24.54 sec
Forking command line: /bin/sh -c cd <https://builds.apache.org/job/hbase-0.95-on-hadoop2/ws/0.95-on-hadoop2/hbase-server> && /home/jenkins/tools/java/jdk1.6.0_45-32/jre/bin/java -enableassertions -Xmx1900m -Djava.security.egd=file:/dev/./urandom -Djava.net.preferIPv4Stack=true -jar <https://builds.apache.org/job/hbase-0.95-on-hadoop2/ws/0.95-on-hadoop2/hbase-server/target/surefire/surefirebooter1267624752634398089.jar> <https://builds.apache.org/job/hbase-0.95-on-hadoop2/ws/0.95-on-hadoop2/hbase-server/target/surefire/surefire6082122291536403713tmp> <https://builds.apache.org/job/hbase-0.95-on-hadoop2/ws/0.95-on-hadoop2/hbase-server/target/surefire/surefire_2034103001480934538889tmp>
Running org.apache.hadoop.hbase.procedure.TestZKProcedureControllers
Tests run: 4, Failures: 0, Errors: 0, Skipped: 0, Time elapsed: 1.705 sec
Forking command line: /bin/sh -c cd <https://builds.apache.org/job/hbase-0.95-on-hadoop2/ws/0.95-on-hadoop2/hbase-server> && /home/jenkins/tools/java/jdk1.6.0_45-32/jre/bin/java -enableassertions -Xmx1900m -Djava.security.egd=file:/dev/./urandom -Djava.net.preferIPv4Stack=true -jar <https://builds.apache.org/job/hbase-0.95-on-hadoop2/ws/0.95-on-hadoop2/hbase-server/target/surefire/surefirebooter4950222629133888489.jar> <https://builds.apache.org/job/hbase-0.95-on-hadoop2/ws/0.95-on-hadoop2/hbase-server/target/surefire/surefire3538676515796027874tmp> <https://builds.apache.org/job/hbase-0.95-on-hadoop2/ws/0.95-on-hadoop2/hbase-server/target/surefire/surefire_2047734535847836540716tmp>
Running org.apache.hadoop.hbase.procedure.TestZKProcedure
Tests run: 4, Failures: 0, Errors: 0, Skipped: 0, Time elapsed: 1.574 sec
Forking command line: /bin/sh -c cd <https://builds.apache.org/job/hbase-0.95-on-hadoop2/ws/0.95-on-hadoop2/hbase-server> && /home/jenkins/tools/java/jdk1.6.0_45-32/jre/bin/java -enableassertions -Xmx1900m -Djava.security.egd=file:/dev/./urandom -Djava.net.preferIPv4Stack=true -jar <https://builds.apache.org/job/hbase-0.95-on-hadoop2/ws/0.95-on-hadoop2/hbase-server/target/surefire/surefirebooter2457345763845957940.jar> <https://builds.apache.org/job/hbase-0.95-on-hadoop2/ws/0.95-on-hadoop2/hbase-server/target/surefire/surefire3034071928587940500tmp> <https://builds.apache.org/job/hbase-0.95-on-hadoop2/ws/0.95-on-hadoop2/hbase-server/target/surefire/surefire_2054580322992823923455tmp>
Running org.apache.hadoop.hbase.coprocessor.TestClassLoading
Running org.apache.hadoop.hbase.coprocessor.TestRowProcessorEndpoint
Tests run: 8, Failures: 0, Errors: 0, Skipped: 0, Time elapsed: 29.02 sec
Tests run: 4, Failures: 0, Errors: 0, Skipped: 0, Time elapsed: 23.271 sec
Forking command line: /bin/sh -c cd <https://builds.apache.org/job/hbase-0.95-on-hadoop2/ws/0.95-on-hadoop2/hbase-server> && /home/jenkins/tools/java/jdk1.6.0_45-32/jre/bin/java -enableassertions -Xmx1900m -Djava.security.egd=file:/dev/./urandom -Djava.net.preferIPv4Stack=true -jar <https://builds.apache.org/job/hbase-0.95-on-hadoop2/ws/0.95-on-hadoop2/hbase-server/target/surefire/surefirebooter1565237217730157715.jar> <https://builds.apache.org/job/hbase-0.95-on-hadoop2/ws/0.95-on-hadoop2/hbase-server/target/surefire/surefire3480839753132096595tmp> <https://builds.apache.org/job/hbase-0.95-on-hadoop2/ws/0.95-on-hadoop2/hbase-server/target/surefire/surefire_2068078463801480325767tmp>
Forking command line: /bin/sh -c cd <https://builds.apache.org/job/hbase-0.95-on-hadoop2/ws/0.95-on-hadoop2/hbase-server> && /home/jenkins/tools/java/jdk1.6.0_45-32/jre/bin/java -enableassertions -Xmx1900m -Djava.security.egd=file:/dev/./urandom -Djava.net.preferIPv4Stack=true -jar <https://builds.apache.org/job/hbase-0.95-on-hadoop2/ws/0.95-on-hadoop2/hbase-server/target/surefire/surefirebooter508356663257509503.jar> <https://builds.apache.org/job/hbase-0.95-on-hadoop2/ws/0.95-on-hadoop2/hbase-server/target/surefire/surefire5761659560466491506tmp> <https://builds.apache.org/job/hbase-0.95-on-hadoop2/ws/0.95-on-hadoop2/hbase-server/target/surefire/surefire_2076938825687472307426tmp>
Running org.apache.hadoop.hbase.snapshot.TestSnapshotDescriptionUtils
Tests run: 2, Failures: 0, Errors: 0, Skipped: 0, Time elapsed: 0.947 sec
Forking command line: /bin/sh -c cd <https://builds.apache.org/job/hbase-0.95-on-hadoop2/ws/0.95-on-hadoop2/hbase-server> && /home/jenkins/tools/java/jdk1.6.0_45-32/jre/bin/java -enableassertions -Xmx1900m -Djava.security.egd=file:/dev/./urandom -Djava.net.preferIPv4Stack=true -jar <https://builds.apache.org/job/hbase-0.95-on-hadoop2/ws/0.95-on-hadoop2/hbase-server/target/surefire/surefirebooter9142933662908519033.jar> <https://builds.apache.org/job/hbase-0.95-on-hadoop2/ws/0.95-on-hadoop2/hbase-server/target/surefire/surefire6666392018559349946tmp> <https://builds.apache.org/job/hbase-0.95-on-hadoop2/ws/0.95-on-hadoop2/hbase-server/target/surefire/surefire_2086678238537737755044tmp>
Running org.apache.hadoop.hbase.constraint.TestConstraint
Tests run: 5, Failures: 0, Errors: 0, Skipped: 0, Time elapsed: 23.401 sec
Forking command line: /bin/sh -c cd <https://builds.apache.org/job/hbase-0.95-on-hadoop2/ws/0.95-on-hadoop2/hbase-server> && /home/jenkins/tools/java/jdk1.6.0_45-32/jre/bin/java -enableassertions -Xmx1900m -Djava.security.egd=file:/dev/./urandom -Djava.net.preferIPv4Stack=true -jar <https://builds.apache.org/job/hbase-0.95-on-hadoop2/ws/0.95-on-hadoop2/hbase-server/target/surefire/surefirebooter7717098485758588961.jar> <https://builds.apache.org/job/hbase-0.95-on-hadoop2/ws/0.95-on-hadoop2/hbase-server/target/surefire/surefire4064773275237318668tmp> <https://builds.apache.org/job/hbase-0.95-on-hadoop2/ws/0.95-on-hadoop2/hbase-server/target/surefire/surefire_2094509562295925256465tmp>
Running org.apache.hadoop.hbase.snapshot.TestExportSnapshot
Tests run: 4, Failures: 0, Errors: 0, Skipped: 0, Time elapsed: 21.764 sec
Forking command line: /bin/sh -c cd <https://builds.apache.org/job/hbase-0.95-on-hadoop2/ws/0.95-on-hadoop2/hbase-server> && /home/jenkins/tools/java/jdk1.6.0_45-32/jre/bin/java -enableassertions -Xmx1900m -Djava.security.egd=file:/dev/./urandom -Djava.net.preferIPv4Stack=true -jar <https://builds.apache.org/job/hbase-0.95-on-hadoop2/ws/0.95-on-hadoop2/hbase-server/target/surefire/surefirebooter2584467976567987143.jar> <https://builds.apache.org/job/hbase-0.95-on-hadoop2/ws/0.95-on-hadoop2/hbase-server/target/surefire/surefire854388932506827522tmp> <https://builds.apache.org/job/hbase-0.95-on-hadoop2/ws/0.95-on-hadoop2/hbase-server/target/surefire/surefire_2103573182146568337899tmp>
Running org.apache.hadoop.hbase.snapshot.TestFlushSnapshotFromClient
Tests run: 5, Failures: 0, Errors: 0, Skipped: 0, Time elapsed: 35.879 sec
Forking command line: /bin/sh -c cd <https://builds.apache.org/job/hbase-0.95-on-hadoop2/ws/0.95-on-hadoop2/hbase-server> && /home/jenkins/tools/java/jdk1.6.0_45-32/jre/bin/java -enableassertions -Xmx1900m -Djava.security.egd=file:/dev/./urandom -Djava.net.preferIPv4Stack=true -jar <https://builds.apache.org/job/hbase-0.95-on-hadoop2/ws/0.95-on-hadoop2/hbase-server/target/surefire/surefirebooter2657425226461153385.jar> <https://builds.apache.org/job/hbase-0.95-on-hadoop2/ws/0.95-on-hadoop2/hbase-server/target/surefire/surefire6493066506921046738tmp> <https://builds.apache.org/job/hbase-0.95-on-hadoop2/ws/0.95-on-hadoop2/hbase-server/target/surefire/surefire_2117619857566127751021tmp>
Running org.apache.hadoop.hbase.mapred.TestTableInputFormat
Tests run: 10, Failures: 0, Errors: 0, Skipped: 0, Time elapsed: 19.099 sec
Forking command line: /bin/sh -c cd <https://builds.apache.org/job/hbase-0.95-on-hadoop2/ws/0.95-on-hadoop2/hbase-server> && /home/jenkins/tools/java/jdk1.6.0_45-32/jre/bin/java -enableassertions -Xmx1900m -Djava.security.egd=file:/dev/./urandom -Djava.net.preferIPv4Stack=true -jar <https://builds.apache.org/job/hbase-0.95-on-hadoop2/ws/0.95-on-hadoop2/hbase-server/target/surefire/surefirebooter7111090751420939403.jar> <https://builds.apache.org/job/hbase-0.95-on-hadoop2/ws/0.95-on-hadoop2/hbase-server/target/surefire/surefire1117447518872048736tmp> <https://builds.apache.org/job/hbase-0.95-on-hadoop2/ws/0.95-on-hadoop2/hbase-server/target/surefire/surefire_2128516156043624235253tmp>
Running org.apache.hadoop.hbase.snapshot.TestRestoreFlushSnapshotFromClient
Tests run: 5, Failures: 0, Errors: 0, Skipped: 0, Time elapsed: 55.37 sec
Forking command line: /bin/sh -c cd <https://builds.apache.org/job/hbase-0.95-on-hadoop2/ws/0.95-on-hadoop2/hbase-server> && /home/jenkins/tools/java/jdk1.6.0_45-32/jre/bin/java -enableassertions -Xmx1900m -Djava.security.egd=file:/dev/./urandom -Djava.net.preferIPv4Stack=true -jar <https://builds.apache.org/job/hbase-0.95-on-hadoop2/ws/0.95-on-hadoop2/hbase-server/target/surefire/surefirebooter3301309047121678474.jar> <https://builds.apache.org/job/hbase-0.95-on-hadoop2/ws/0.95-on-hadoop2/hbase-server/target/surefire/surefire5062754473578689405tmp> <https://builds.apache.org/job/hbase-0.95-on-hadoop2/ws/0.95-on-hadoop2/hbase-server/target/surefire/surefire_2138765008868900652012tmp>
Running org.apache.hadoop.hbase.master.TestAssignmentManager
Tests run: 15, Failures: 0, Errors: 0, Skipped: 0, Time elapsed: 3.733 sec
Forking command line: /bin/sh -c cd <https://builds.apache.org/job/hbase-0.95-on-hadoop2/ws/0.95-on-hadoop2/hbase-server> && /home/jenkins/tools/java/jdk1.6.0_45-32/jre/bin/java -enableassertions -Xmx1900m -Djava.security.egd=file:/dev/./urandom -Djava.net.preferIPv4Stack=true -jar <https://builds.apache.org/job/hbase-0.95-on-hadoop2/ws/0.95-on-hadoop2/hbase-server/target/surefire/surefirebooter4327516739950618847.jar> <https://builds.apache.org/job/hbase-0.95-on-hadoop2/ws/0.95-on-hadoop2/hbase-server/target/surefire/surefire8281760562265368758tmp> <https://builds.apache.org/job/hbase-0.95-on-hadoop2/ws/0.95-on-hadoop2/hbase-server/target/surefire/surefire_2143906531923238887784tmp>
Running org.apache.hadoop.hbase.master.TestOpenedRegionHandler
Tests run: 2, Failures: 0, Errors: 0, Skipped: 0, Time elapsed: 11.319 sec
Forking command line: /bin/sh -c cd <https://builds.apache.org/job/hbase-0.95-on-hadoop2/ws/0.95-on-hadoop2/hbase-server> && /home/jenkins/tools/java/jdk1.6.0_45-32/jre/bin/java -enableassertions -Xmx1900m -Djava.security.egd=file:/dev/./urandom -Djava.net.preferIPv4Stack=true -jar <https://builds.apache.org/job/hbase-0.95-on-hadoop2/ws/0.95-on-hadoop2/hbase-server/target/surefire/surefirebooter1628159784385117290.jar> <https://builds.apache.org/job/hbase-0.95-on-hadoop2/ws/0.95-on-hadoop2/hbase-server/target/surefire/surefire7271663276770285111tmp> <https://builds.apache.org/job/hbase-0.95-on-hadoop2/ws/0.95-on-hadoop2/hbase-server/target/surefire/surefire_2155010538958069171329tmp>
Running org.apache.hadoop.hbase.master.TestActiveMasterManager
Tests run: 2, Failures: 0, Errors: 0, Skipped: 0, Time elapsed: 1.422 sec
Forking command line: /bin/sh -c cd <https://builds.apache.org/job/hbase-0.95-on-hadoop2/ws/0.95-on-hadoop2/hbase-server> && /home/jenkins/tools/java/jdk1.6.0_45-32/jre/bin/java -enableassertions -Xmx1900m -Djava.security.egd=file:/dev/./urandom -Djava.net.preferIPv4Stack=true -jar <https://builds.apache.org/job/hbase-0.95-on-hadoop2/ws/0.95-on-hadoop2/hbase-server/target/surefire/surefirebooter8428074921488342585.jar> <https://builds.apache.org/job/hbase-0.95-on-hadoop2/ws/0.95-on-hadoop2/hbase-server/target/surefire/surefire3296881833125525621tmp> <https://builds.apache.org/job/hbase-0.95-on-hadoop2/ws/0.95-on-hadoop2/hbase-server/target/surefire/surefire_2167214890851270097601tmp>
Running org.apache.hadoop.hbase.mapred.TestTableMapReduce
Tests run: 1, Failures: 0, Errors: 0, Skipped: 0, Time elapsed: 48.482 sec
Forking command line: /bin/sh -c cd <https://builds.apache.org/job/hbase-0.95-on-hadoop2/ws/0.95-on-hadoop2/hbase-server> && /home/jenkins/tools/java/jdk1.6.0_45-32/jre/bin/java -enableassertions -Xmx1900m -Djava.security.egd=file:/dev/./urandom -Djava.net.preferIPv4Stack=true -jar <https://builds.apache.org/job/hbase-0.95-on-hadoop2/ws/0.95-on-hadoop2/hbase-server/target/surefire/surefirebooter8013333956556640730.jar> <https://builds.apache.org/job/hbase-0.95-on-hadoop2/ws/0.95-on-hadoop2/hbase-server/target/surefire/surefire3523595378374855354tmp> <https://builds.apache.org/job/hbase-0.95-on-hadoop2/ws/0.95-on-hadoop2/hbase-server/target/surefire/surefire_21781409312532178336tmp>
Running org.apache.hadoop.hbase.master.TestMasterFailoverBalancerPersistence
Tests run: 1, Failures: 0, Errors: 0, Skipped: 0, Time elapsed: 11.894 sec
Forking command line: /bin/sh -c cd <https://builds.apache.org/job/hbase-0.95-on-hadoop2/ws/0.95-on-hadoop2/hbase-server> && /home/jenkins/tools/java/jdk1.6.0_45-32/jre/bin/java -enableassertions -Xmx1900m -Djava.security.egd=file:/dev/./urandom -Djava.net.preferIPv4Stack=true -jar <https://builds.apache.org/job/hbase-0.95-on-hadoop2/ws/0.95-on-hadoop2/hbase-server/target/surefire/surefirebooter1095898973957158270.jar> <https://builds.apache.org/job/hbase-0.95-on-hadoop2/ws/0.95-on-hadoop2/hbase-server/target/surefire/surefire8046851045883057458tmp> <https://builds.apache.org/job/hbase-0.95-on-hadoop2/ws/0.95-on-hadoop2/hbase-server/target/surefire/surefire_2185548701186685396596tmp>
Running org.apache.hadoop.hbase.master.TestMasterRestartAfterDisablingTable
Tests run: 1, Failures: 0, Errors: 0, Skipped: 0, Time elapsed: 12.983 sec
Forking command line: /bin/sh -c cd <https://builds.apache.org/job/hbase-0.95-on-hadoop2/ws/0.95-on-hadoop2/hbase-server> && /home/jenkins/tools/java/jdk1.6.0_45-32/jre/bin/java -enableassertions -Xmx1900m -Djava.security.egd=file:/dev/./urandom -Djava.net.preferIPv4Stack=true -jar <https://builds.apache.org/job/hbase-0.95-on-hadoop2/ws/0.95-on-hadoop2/hbase-server/target/surefire/surefirebooter5646159058771886942.jar> <https://builds.apache.org/job/hbase-0.95-on-hadoop2/ws/0.95-on-hadoop2/hbase-server/target/surefire/surefire3461367030832366771tmp> <https://builds.apache.org/job/hbase-0.95-on-hadoop2/ws/0.95-on-hadoop2/hbase-server/target/surefire/surefire_2197101506686783153697tmp>
Running org.apache.hadoop.hbase.master.TestMasterTransitions
Tests run: 3, Failures: 0, Errors: 0, Skipped: 3, Time elapsed: 11.707 sec
Forking command line: /bin/sh -c cd <https://builds.apache.org/job/hbase-0.95-on-hadoop2/ws/0.95-on-hadoop2/hbase-server> && /home/jenkins/tools/java/jdk1.6.0_45-32/jre/bin/java -enableassertions -Xmx1900m -Djava.security.egd=file:/dev/./urandom -Djava.net.preferIPv4Stack=true -jar <https://builds.apache.org/job/hbase-0.95-on-hadoop2/ws/0.95-on-hadoop2/hbase-server/target/surefire/surefirebooter7121371830641264272.jar> <https://builds.apache.org/job/hbase-0.95-on-hadoop2/ws/0.95-on-hadoop2/hbase-server/target/surefire/surefire5175424485344331891tmp> <https://builds.apache.org/job/hbase-0.95-on-hadoop2/ws/0.95-on-hadoop2/hbase-server/target/surefire/surefire_2206375486866961359839tmp>
Running org.apache.hadoop.hbase.master.TestMasterFailover
Tests run: 4, Failures: 0, Errors: 0, Skipped: 0, Time elapsed: 36.139 sec
Forking command line: /bin/sh -c cd <https://builds.apache.org/job/hbase-0.95-on-hadoop2/ws/0.95-on-hadoop2/hbase-server> && /home/jenkins/tools/java/jdk1.6.0_45-32/jre/bin/java -enableassertions -Xmx1900m -Djava.security.egd=file:/dev/./urandom -Djava.net.preferIPv4Stack=true -jar <https://builds.apache.org/job/hbase-0.95-on-hadoop2/ws/0.95-on-hadoop2/hbase-server/target/surefire/surefirebooter7669276382127627046.jar> <https://builds.apache.org/job/hbase-0.95-on-hadoop2/ws/0.95-on-hadoop2/hbase-server/target/surefire/surefire8475488667214326207tmp> <https://builds.apache.org/job/hbase-0.95-on-hadoop2/ws/0.95-on-hadoop2/hbase-server/target/surefire/surefire_2219163716152513728445tmp>
Running org.apache.hadoop.hbase.master.TestRollingRestart
Tests run: 1, Failures: 0, Errors: 0, Skipped: 0, Time elapsed: 29.989 sec
Forking command line: /bin/sh -c cd <https://builds.apache.org/job/hbase-0.95-on-hadoop2/ws/0.95-on-hadoop2/hbase-server> && /home/jenkins/tools/java/jdk1.6.0_45-32/jre/bin/java -enableassertions -Xmx1900m -Djava.security.egd=file:/dev/./urandom -Djava.net.preferIPv4Stack=true -jar <https://builds.apache.org/job/hbase-0.95-on-hadoop2/ws/0.95-on-hadoop2/hbase-server/target/surefire/surefirebooter3121439592725987638.jar> <https://builds.apache.org/job/hbase-0.95-on-hadoop2/ws/0.95-on-hadoop2/hbase-server/target/surefire/surefire2663085858555041968tmp> <https://builds.apache.org/job/hbase-0.95-on-hadoop2/ws/0.95-on-hadoop2/hbase-server/target/surefire/surefire_2223829682507470433284tmp>
Running org.apache.hadoop.hbase.master.TestMasterStatusServlet
Tests run: 4, Failures: 0, Errors: 0, Skipped: 0, Time elapsed: 1.545 sec
Forking command line: /bin/sh -c cd <https://builds.apache.org/job/hbase-0.95-on-hadoop2/ws/0.95-on-hadoop2/hbase-server> && /home/jenkins/tools/java/jdk1.6.0_45-32/jre/bin/java -enableassertions -Xmx1900m -Djava.security.egd=file:/dev/./urandom -Djava.net.preferIPv4Stack=true -jar <https://builds.apache.org/job/hbase-0.95-on-hadoop2/ws/0.95-on-hadoop2/hbase-server/target/surefire/surefirebooter7331661404281812191.jar> <https://builds.apache.org/job/hbase-0.95-on-hadoop2/ws/0.95-on-hadoop2/hbase-server/target/surefire/surefire8152574356756965885tmp> <https://builds.apache.org/job/hbase-0.95-on-hadoop2/ws/0.95-on-hadoop2/hbase-server/target/surefire/surefire_2233386954500871507386tmp>
Running org.apache.hadoop.hbase.master.TestHMasterRPCException
Tests run: 1, Failures: 0, Errors: 0, Skipped: 0, Time elapsed: 2.038 sec
Forking command line: /bin/sh -c cd <https://builds.apache.org/job/hbase-0.95-on-hadoop2/ws/0.95-on-hadoop2/hbase-server> && /home/jenkins/tools/java/jdk1.6.0_45-32/jre/bin/java -enableassertions -Xmx1900m -Djava.security.egd=file:/dev/./urandom -Djava.net.preferIPv4Stack=true -jar <https://builds.apache.org/job/hbase-0.95-on-hadoop2/ws/0.95-on-hadoop2/hbase-server/target/surefire/surefirebooter8470751451924538380.jar> <https://builds.apache.org/job/hbase-0.95-on-hadoop2/ws/0.95-on-hadoop2/hbase-server/target/surefire/surefire6825695841758749034tmp> <https://builds.apache.org/job/hbase-0.95-on-hadoop2/ws/0.95-on-hadoop2/hbase-server/target/surefire/surefire_2246836919846271831636tmp>
Running org.apache.hadoop.hbase.master.TestRestartCluster
Tests run: 2, Failures: 0, Errors: 0, Skipped: 0, Time elapsed: 22.588 sec
Forking command line: /bin/sh -c cd <https://builds.apache.org/job/hbase-0.95-on-hadoop2/ws/0.95-on-hadoop2/hbase-server> && /home/jenkins/tools/java/jdk1.6.0_45-32/jre/bin/java -enableassertions -Xmx1900m -Djava.security.egd=file:/dev/./urandom -Djava.net.preferIPv4Stack=true -jar <https://builds.apache.org/job/hbase-0.95-on-hadoop2/ws/0.95-on-hadoop2/hbase-server/target/surefire/surefirebooter8997911500168278592.jar> <https://builds.apache.org/job/hbase-0.95-on-hadoop2/ws/0.95-on-hadoop2/hbase-server/target/surefire/surefire3634214622370763893tmp> <https://builds.apache.org/job/hbase-0.95-on-hadoop2/ws/0.95-on-hadoop2/hbase-server/target/surefire/surefire_2257393712172507791424tmp>
Running org.apache.hadoop.hbase.master.TestMasterMetrics
Tests run: 2, Failures: 0, Errors: 0, Skipped: 0, Time elapsed: 21.005 sec
Forking command line: /bin/sh -c cd <https://builds.apache.org/job/hbase-0.95-on-hadoop2/ws/0.95-on-hadoop2/hbase-server> && /home/jenkins/tools/java/jdk1.6.0_45-32/jre/bin/java -enableassertions -Xmx1900m -Djava.security.egd=file:/dev/./urandom -Djava.net.preferIPv4Stack=true -jar <https://builds.apache.org/job/hbase-0.95-on-hadoop2/ws/0.95-on-hadoop2/hbase-server/target/surefire/surefirebooter7603626480907705392.jar> <https://builds.apache.org/job/hbase-0.95-on-hadoop2/ws/0.95-on-hadoop2/hbase-server/target/surefire/surefire1049355365299889111tmp> <https://builds.apache.org/job/hbase-0.95-on-hadoop2/ws/0.95-on-hadoop2/hbase-server/target/surefire/surefire_2268596416352475936708tmp>
Running org.apache.hadoop.hbase.master.TestRegionPlacement
Tests run: 2, Failures: 0, Errors: 0, Skipped: 0, Time elapsed: 9.254 sec
Forking command line: /bin/sh -c cd <https://builds.apache.org/job/hbase-0.95-on-hadoop2/ws/0.95-on-hadoop2/hbase-server> && /home/jenkins/tools/java/jdk1.6.0_45-32/jre/bin/java -enableassertions -Xmx1900m -Djava.security.egd=file:/dev/./urandom -Djava.net.preferIPv4Stack=true -jar <https://builds.apache.org/job/hbase-0.95-on-hadoop2/ws/0.95-on-hadoop2/hbase-server/target/surefire/surefirebooter2319076377087958761.jar> <https://builds.apache.org/job/hbase-0.95-on-hadoop2/ws/0.95-on-hadoop2/hbase-server/target/surefire/surefire4449476021674142463tmp> <https://builds.apache.org/job/hbase-0.95-on-hadoop2/ws/0.95-on-hadoop2/hbase-server/target/surefire/surefire_2272389347511693261948tmp>
Running org.apache.hadoop.hbase.master.balancer.TestFavoredNodeAssignmentHelper
Tests run: 6, Failures: 0, Errors: 0, Skipped: 0, Time elapsed: 12.569 sec
Forking command line: /bin/sh -c cd <https://builds.apache.org/job/hbase-0.95-on-hadoop2/ws/0.95-on-hadoop2/hbase-server> && /home/jenkins/tools/java/jdk1.6.0_45-32/jre/bin/java -enableassertions -Xmx1900m -Djava.security.egd=file:/dev/./urandom -Djava.net.preferIPv4Stack=true -jar <https://builds.apache.org/job/hbase-0.95-on-hadoop2/ws/0.95-on-hadoop2/hbase-server/target/surefire/surefirebooter3672300474000703234.jar> <https://builds.apache.org/job/hbase-0.95-on-hadoop2/ws/0.95-on-hadoop2/hbase-server/target/surefire/surefire2373232515425877685tmp> <https://builds.apache.org/job/hbase-0.95-on-hadoop2/ws/0.95-on-hadoop2/hbase-server/target/surefire/surefire_2284985891834697757425tmp>
Running org.apache.hadoop.hbase.master.balancer.TestBaseLoadBalancer
Tests run: 3, Failures: 0, Errors: 0, Skipped: 0, Time elapsed: 0.519 sec
Forking command line: /bin/sh -c cd <https://builds.apache.org/job/hbase-0.95-on-hadoop2/ws/0.95-on-hadoop2/hbase-server> && /home/jenkins/tools/java/jdk1.6.0_45-32/jre/bin/java -enableassertions -Xmx1900m -Djava.security.egd=file:/dev/./urandom -Djava.net.preferIPv4Stack=true -jar <https://builds.apache.org/job/hbase-0.95-on-hadoop2/ws/0.95-on-hadoop2/hbase-server/target/surefire/surefirebooter3594206149853924301.jar> <https://builds.apache.org/job/hbase-0.95-on-hadoop2/ws/0.95-on-hadoop2/hbase-server/target/surefire/surefire1284107523249682809tmp> <https://builds.apache.org/job/hbase-0.95-on-hadoop2/ws/0.95-on-hadoop2/hbase-server/target/surefire/surefire_2294378788721525179638tmp>
Running org.apache.hadoop.hbase.master.TestAssignmentManagerOnCluster
Tests run: 9, Failures: 0, Errors: 0, Skipped: 0, Time elapsed: 37.303 sec
Forking command line: /bin/sh -c cd <https://builds.apache.org/job/hbase-0.95-on-hadoop2/ws/0.95-on-hadoop2/hbase-server> && /home/jenkins/tools/java/jdk1.6.0_45-32/jre/bin/java -enableassertions -Xmx1900m -Djava.security.egd=file:/dev/./urandom -Djava.net.preferIPv4Stack=true -jar <https://builds.apache.org/job/hbase-0.95-on-hadoop2/ws/0.95-on-hadoop2/hbase-server/target/surefire/surefirebooter1558396103158069788.jar> <https://builds.apache.org/job/hbase-0.95-on-hadoop2/ws/0.95-on-hadoop2/hbase-server/target/surefire/surefire1232303543552941555tmp> <https://builds.apache.org/job/hbase-0.95-on-hadoop2/ws/0.95-on-hadoop2/hbase-server/target/surefire/surefire_2304269098626140314282tmp>
Running org.apache.hadoop.hbase.master.balancer.TestDefaultLoadBalancer
Tests run: 1, Failures: 0, Errors: 0, Skipped: 0, Time elapsed: 1.546 sec
Forking command line: /bin/sh -c cd <https://builds.apache.org/job/hbase-0.95-on-hadoop2/ws/0.95-on-hadoop2/hbase-server> && /home/jenkins/tools/java/jdk1.6.0_45-32/jre/bin/java -enableassertions -Xmx1900m -Djava.security.egd=file:/dev/./urandom -Djava.net.preferIPv4Stack=true -jar <https://builds.apache.org/job/hbase-0.95-on-hadoop2/ws/0.95-on-hadoop2/hbase-server/target/surefire/surefirebooter690207840052624250.jar> <https://builds.apache.org/job/hbase-0.95-on-hadoop2/ws/0.95-on-hadoop2/hbase-server/target/surefire/surefire5835485578177382176tmp> <https://builds.apache.org/job/hbase-0.95-on-hadoop2/ws/0.95-on-hadoop2/hbase-server/target/surefire/surefire_2318932762073723419655tmp>
Running org.apache.hadoop.hbase.master.TestMaster
Tests run: 4, Failures: 0, Errors: 0, Skipped: 0, Time elapsed: 17.092 sec
Forking command line: /bin/sh -c cd <https://builds.apache.org/job/hbase-0.95-on-hadoop2/ws/0.95-on-hadoop2/hbase-server> && /home/jenkins/tools/java/jdk1.6.0_45-32/jre/bin/java -enableassertions -Xmx1900m -Djava.security.egd=file:/dev/./urandom -Djava.net.preferIPv4Stack=true -jar <https://builds.apache.org/job/hbase-0.95-on-hadoop2/ws/0.95-on-hadoop2/hbase-server/target/surefire/surefirebooter1925914957844361131.jar> <https://builds.apache.org/job/hbase-0.95-on-hadoop2/ws/0.95-on-hadoop2/hbase-server/target/surefire/surefire2727439160923054945tmp> <https://builds.apache.org/job/hbase-0.95-on-hadoop2/ws/0.95-on-hadoop2/hbase-server/target/surefire/surefire_2321605844670753714991tmp>
Running org.apache.hadoop.hbase.master.cleaner.TestHFileCleaner
Tests run: 3, Failures: 0, Errors: 0, Skipped: 0, Time elapsed: 3.877 sec
Forking command line: /bin/sh -c cd <https://builds.apache.org/job/hbase-0.95-on-hadoop2/ws/0.95-on-hadoop2/hbase-server> && /home/jenkins/tools/java/jdk1.6.0_45-32/jre/bin/java -enableassertions -Xmx1900m -Djava.security.egd=file:/dev/./urandom -Djava.net.preferIPv4Stack=true -jar <https://builds.apache.org/job/hbase-0.95-on-hadoop2/ws/0.95-on-hadoop2/hbase-server/target/surefire/surefirebooter246694490117259860.jar> <https://builds.apache.org/job/hbase-0.95-on-hadoop2/ws/0.95-on-hadoop2/hbase-server/target/surefire/surefire5062685494971652381tmp> <https://builds.apache.org/job/hbase-0.95-on-hadoop2/ws/0.95-on-hadoop2/hbase-server/target/surefire/surefire_2339069236478880930621tmp>
Running org.apache.hadoop.hbase.master.cleaner.TestLogsCleaner
Tests run: 1, Failures: 0, Errors: 0, Skipped: 0, Time elapsed: 11.403 sec
Forking command line: /bin/sh -c cd <https://builds.apache.org/job/hbase-0.95-on-hadoop2/ws/0.95-on-hadoop2/hbase-server> && /home/jenkins/tools/java/jdk1.6.0_45-32/jre/bin/java -enableassertions -Xmx1900m -Djava.security.egd=file:/dev/./urandom -Djava.net.preferIPv4Stack=true -jar <https://builds.apache.org/job/hbase-0.95-on-hadoop2/ws/0.95-on-hadoop2/hbase-server/target/surefire/surefirebooter1381805684168754208.jar> <https://builds.apache.org/job/hbase-0.95-on-hadoop2/ws/0.95-on-hadoop2/hbase-server/target/surefire/surefire7134483286747562039tmp> <https://builds.apache.org/job/hbase-0.95-on-hadoop2/ws/0.95-on-hadoop2/hbase-server/target/surefire/surefire_2349052442981507500399tmp>
Running org.apache.hadoop.hbase.master.cleaner.TestSnapshotFromMaster
Tests run: 4, Failures: 0, Errors: 0, Skipped: 0, Time elapsed: 25.76 sec
Forking command line: /bin/sh -c cd <https://builds.apache.org/job/hbase-0.95-on-hadoop2/ws/0.95-on-hadoop2/hbase-server> && /home/jenkins/tools/java/jdk1.6.0_45-32/jre/bin/java -enableassertions -Xmx1900m -Djava.security.egd=file:/dev/./urandom -Djava.net.preferIPv4Stack=true -jar <https://builds.apache.org/job/hbase-0.95-on-hadoop2/ws/0.95-on-hadoop2/hbase-server/target/surefire/surefirebooter6288581414625463402.jar> <https://builds.apache.org/job/hbase-0.95-on-hadoop2/ws/0.95-on-hadoop2/hbase-server/target/surefire/surefire4485113605327464334tmp> <https://builds.apache.org/job/hbase-0.95-on-hadoop2/ws/0.95-on-hadoop2/hbase-server/target/surefire/surefire_2356958893483322861616tmp>
Running org.apache.hadoop.hbase.master.TestMasterShutdown
Tests run: 2, Failures: 0, Errors: 0, Skipped: 0, Time elapsed: 13.265 sec
Forking command line: /bin/sh -c cd <https://builds.apache.org/job/hbase-0.95-on-hadoop2/ws/0.95-on-hadoop2/hbase-server> && /home/jenkins/tools/java/jdk1.6.0_45-32/jre/bin/java -enableassertions -Xmx1900m -Djava.security.egd=file:/dev/./urandom -Djava.net.preferIPv4Stack=true -jar <https://builds.apache.org/job/hbase-0.95-on-hadoop2/ws/0.95-on-hadoop2/hbase-server/target/surefire/surefirebooter6027576361531350933.jar> <https://builds.apache.org/job/hbase-0.95-on-hadoop2/ws/0.95-on-hadoop2/hbase-server/target/surefire/surefire3213789864244136573tmp> <https://builds.apache.org/job/hbase-0.95-on-hadoop2/ws/0.95-on-hadoop2/hbase-server/target/surefire/surefire_2367757866361342075146tmp>
Running org.apache.hadoop.hbase.master.TestMasterFileSystem
Tests run: 2, Failures: 0, Errors: 0, Skipped: 0, Time elapsed: 6.861 sec
Forking command line: /bin/sh -c cd <https://builds.apache.org/job/hbase-0.95-on-hadoop2/ws/0.95-on-hadoop2/hbase-server> && /home/jenkins/tools/java/jdk1.6.0_45-32/jre/bin/java -enableassertions -Xmx1900m -Djava.security.egd=file:/dev/./urandom -Djava.net.preferIPv4Stack=true -jar <https://builds.apache.org/job/hbase-0.95-on-hadoop2/ws/0.95-on-hadoop2/hbase-server/target/surefire/surefirebooter7750419813774315466.jar> <https://builds.apache.org/job/hbase-0.95-on-hadoop2/ws/0.95-on-hadoop2/hbase-server/target/surefire/surefire199102204131202784tmp> <https://builds.apache.org/job/hbase-0.95-on-hadoop2/ws/0.95-on-hadoop2/hbase-server/target/surefire/surefire_2373996678280742230047tmp>
Running org.apache.hadoop.hbase.master.handler.TestTableDeleteFamilyHandler
Tests run: 1, Failures: 0, Errors: 0, Skipped: 0, Time elapsed: 16.793 sec
Forking command line: /bin/sh -c cd <https://builds.apache.org/job/hbase-0.95-on-hadoop2/ws/0.95-on-hadoop2/hbase-server> && /home/jenkins/tools/java/jdk1.6.0_45-32/jre/bin/java -enableassertions -Xmx1900m -Djava.security.egd=file:/dev/./urandom -Djava.net.preferIPv4Stack=true -jar <https://builds.apache.org/job/hbase-0.95-on-hadoop2/ws/0.95-on-hadoop2/hbase-server/target/surefire/surefirebooter3308032036512494467.jar> <https://builds.apache.org/job/hbase-0.95-on-hadoop2/ws/0.95-on-hadoop2/hbase-server/target/surefire/surefire2538318005763445170tmp> <https://builds.apache.org/job/hbase-0.95-on-hadoop2/ws/0.95-on-hadoop2/hbase-server/target/surefire/surefire_2386197449245456013588tmp>
Running org.apache.hadoop.hbase.master.TestTableLockManager
Tests run: 5, Failures: 0, Errors: 0, Skipped: 0, Time elapsed: 181.695 sec
Forking command line: /bin/sh -c cd <https://builds.apache.org/job/hbase-0.95-on-hadoop2/ws/0.95-on-hadoop2/hbase-server> && /home/jenkins/tools/java/jdk1.6.0_45-32/jre/bin/java -enableassertions -Xmx1900m -Djava.security.egd=file:/dev/./urandom -Djava.net.preferIPv4Stack=true -jar <https://builds.apache.org/job/hbase-0.95-on-hadoop2/ws/0.95-on-hadoop2/hbase-server/target/surefire/surefirebooter4341663646761564044.jar> <https://builds.apache.org/job/hbase-0.95-on-hadoop2/ws/0.95-on-hadoop2/hbase-server/target/surefire/surefire1211226787761814883tmp> <https://builds.apache.org/job/hbase-0.95-on-hadoop2/ws/0.95-on-hadoop2/hbase-server/target/surefire/surefire_2394291468331079147938tmp>
Running org.apache.hadoop.hbase.master.handler.TestCreateTableHandler
Tests run: 2, Failures: 0, Errors: 0, Skipped: 0, Time elapsed: 13.795 sec
Forking command line: /bin/sh -c cd <https://builds.apache.org/job/hbase-0.95-on-hadoop2/ws/0.95-on-hadoop2/hbase-server> && /home/jenkins/tools/java/jdk1.6.0_45-32/jre/bin/java -enableassertions -Xmx1900m -Djava.security.egd=file:/dev/./urandom -Djava.net.preferIPv4Stack=true -jar <https://builds.apache.org/job/hbase-0.95-on-hadoop2/ws/0.95-on-hadoop2/hbase-server/target/surefire/surefirebooter257110209971831871.jar> <https://builds.apache.org/job/hbase-0.95-on-hadoop2/ws/0.95-on-hadoop2/hbase-server/target/surefire/surefire16188736067485167tmp> <https://builds.apache.org/job/hbase-0.95-on-hadoop2/ws/0.95-on-hadoop2/hbase-server/target/surefire/surefire_2403633958152423445995tmp>
Running org.apache.hadoop.hbase.master.handler.TestTableDescriptorModification
Tests run: 3, Failures: 0, Errors: 0, Skipped: 0, Time elapsed: 17.003 sec
Forking command line: /bin/sh -c cd <https://builds.apache.org/job/hbase-0.95-on-hadoop2/ws/0.95-on-hadoop2/hbase-server> && /home/jenkins/tools/java/jdk1.6.0_45-32/jre/bin/java -enableassertions -Xmx1900m -Djava.security.egd=file:/dev/./urandom -Djava.net.preferIPv4Stack=true -jar <https://builds.apache.org/job/hbase-0.95-on-hadoop2/ws/0.95-on-hadoop2/hbase-server/target/surefire/surefirebooter8788317870290554742.jar> <https://builds.apache.org/job/hbase-0.95-on-hadoop2/ws/0.95-on-hadoop2/hbase-server/target/surefire/surefire4694571831210524848tmp> <https://builds.apache.org/job/hbase-0.95-on-hadoop2/ws/0.95-on-hadoop2/hbase-server/target/surefire/surefire_2417118948515505727125tmp>
Running org.apache.hadoop.hbase.master.TestClusterStatusPublisher
Tests run: 3, Failures: 0, Errors: 0, Skipped: 0, Time elapsed: 0.435 sec
Forking command line: /bin/sh -c cd <https://builds.apache.org/job/hbase-0.95-on-hadoop2/ws/0.95-on-hadoop2/hbase-server> && /home/jenkins/tools/java/jdk1.6.0_45-32/jre/bin/java -enableassertions -Xmx1900m -Djava.security.egd=file:/dev/./urandom -Djava.net.preferIPv4Stack=true -jar <https://builds.apache.org/job/hbase-0.95-on-hadoop2/ws/0.95-on-hadoop2/hbase-server/target/surefire/surefirebooter952836707952796173.jar> <https://builds.apache.org/job/hbase-0.95-on-hadoop2/ws/0.95-on-hadoop2/hbase-server/target/surefire/surefire2434994487016021230tmp> <https://builds.apache.org/job/hbase-0.95-on-hadoop2/ws/0.95-on-hadoop2/hbase-server/target/surefire/surefire_2427327173855338308160tmp>
Running org.apache.hadoop.hbase.master.snapshot.TestSnapshotFileCache
Tests run: 4, Failures: 0, Errors: 0, Skipped: 0, Time elapsed: 3.806 sec
Forking command line: /bin/sh -c cd <https://builds.apache.org/job/hbase-0.95-on-hadoop2/ws/0.95-on-hadoop2/hbase-server> && /home/jenkins/tools/java/jdk1.6.0_45-32/jre/bin/java -enableassertions -Xmx1900m -Djava.security.egd=file:/dev/./urandom -Djava.net.preferIPv4Stack=true -jar <https://builds.apache.org/job/hbase-0.95-on-hadoop2/ws/0.95-on-hadoop2/hbase-server/target/surefire/surefirebooter5449798219664227032.jar> <https://builds.apache.org/job/hbase-0.95-on-hadoop2/ws/0.95-on-hadoop2/hbase-server/target/surefire/surefire605825101906956933tmp> <https://builds.apache.org/job/hbase-0.95-on-hadoop2/ws/0.95-on-hadoop2/hbase-server/target/surefire/surefire_2434789191302234135797tmp>
Running org.apache.hadoop.hbase.master.TestMasterMetricsWrapper
Tests run: 1, Failures: 0, Errors: 0, Skipped: 0, Time elapsed: 8.173 sec
Forking command line: /bin/sh -c cd <https://builds.apache.org/job/hbase-0.95-on-hadoop2/ws/0.95-on-hadoop2/hbase-server> && /home/jenkins/tools/java/jdk1.6.0_45-32/jre/bin/java -enableassertions -Xmx1900m -Djava.security.egd=file:/dev/./urandom -Djava.net.preferIPv4Stack=true -jar <https://builds.apache.org/job/hbase-0.95-on-hadoop2/ws/0.95-on-hadoop2/hbase-server/target/surefire/surefirebooter7249287978733369662.jar> <https://builds.apache.org/job/hbase-0.95-on-hadoop2/ws/0.95-on-hadoop2/hbase-server/target/surefire/surefire4463232896189602956tmp> <https://builds.apache.org/job/hbase-0.95-on-hadoop2/ws/0.95-on-hadoop2/hbase-server/target/surefire/surefire_2444001728980179046107tmp>
Running org.apache.hadoop.hbase.master.TestMasterNoCluster
Tests run: 4, Failures: 0, Errors: 0, Skipped: 0, Time elapsed: 8.321 sec
Forking command line: /bin/sh -c cd <https://builds.apache.org/job/hbase-0.95-on-hadoop2/ws/0.95-on-hadoop2/hbase-server> && /home/jenkins/tools/java/jdk1.6.0_45-32/jre/bin/java -enableassertions -Xmx1900m -Djava.security.egd=file:/dev/./urandom -Djava.net.preferIPv4Stack=true -jar <https://builds.apache.org/job/hbase-0.95-on-hadoop2/ws/0.95-on-hadoop2/hbase-server/target/surefire/surefirebooter1387790976503212668.jar> <https://builds.apache.org/job/hbase-0.95-on-hadoop2/ws/0.95-on-hadoop2/hbase-server/target/surefire/surefire1111387752306826609tmp> <https://builds.apache.org/job/hbase-0.95-on-hadoop2/ws/0.95-on-hadoop2/hbase-server/target/surefire/surefire_245823985374614265625tmp>
Running org.apache.hadoop.hbase.master.TestDeadServer
Tests run: 3, Failures: 0, Errors: 0, Skipped: 0, Time elapsed: 0.299 sec
Forking command line: /bin/sh -c cd <https://builds.apache.org/job/hbase-0.95-on-hadoop2/ws/0.95-on-hadoop2/hbase-server> && /home/jenkins/tools/java/jdk1.6.0_45-32/jre/bin/java -enableassertions -Xmx1900m -Djava.security.egd=file:/dev/./urandom -Djava.net.preferIPv4Stack=true -jar <https://builds.apache.org/job/hbase-0.95-on-hadoop2/ws/0.95-on-hadoop2/hbase-server/target/surefire/surefirebooter5966257577134309993.jar> <https://builds.apache.org/job/hbase-0.95-on-hadoop2/ws/0.95-on-hadoop2/hbase-server/target/surefire/surefire4936033337053303752tmp> <https://builds.apache.org/job/hbase-0.95-on-hadoop2/ws/0.95-on-hadoop2/hbase-server/target/surefire/surefire_2464207649607473833991tmp>
Running org.apache.hadoop.hbase.master.TestZKBasedOpenCloseRegion
Tests run: 4, Failures: 0, Errors: 0, Skipped: 0, Time elapsed: 11.981 sec
Running org.apache.hadoop.hbase.master.balancer.TestStochasticLoadBalancer
Tests run: 12, Failures: 0, Errors: 0, Skipped: 0, Time elapsed: 187.433 sec
Running org.apache.hadoop.hbase.master.TestSplitLogManager
Tests run: 13, Failures: 0, Errors: 0, Skipped: 0, Time elapsed: 82.513 sec
Running org.apache.hadoop.hbase.master.TestDistributedLogSplitting
Tests run: 13, Failures: 0, Errors: 1, Skipped: 0, Time elapsed: 786.236 sec <<< FAILURE!

Results :

Failed tests:   testMROnTableWithCustomMapper(org.apache.hadoop.hbase.mapreduce.TestImportTsv): expected:<0> but was:<1>

Tests in error: 
  testCorrectnessWhenMasterFailOver(org.apache.hadoop.hbase.regionserver.TestRSKilledWhenMasterInitializing): test timed out after 120000 milliseconds
  testWorkerAbort(org.apache.hadoop.hbase.master.TestDistributedLogSplitting): test timed out after 300000 milliseconds

Tests run: 1451, Failures: 1, Errors: 2, Skipped: 14

[INFO]                                                                         
[INFO] ------------------------------------------------------------------------
[INFO] Skipping HBase
[INFO] This project has been banned from the build due to previous failures.
[INFO] ------------------------------------------------------------------------
[INFO] ------------------------------------------------------------------------
[INFO] Reactor Summary:
[INFO] 
[INFO] HBase ............................................. SUCCESS [7.043s]
[INFO] HBase - Common .................................... SUCCESS [21.871s]
[INFO] HBase - Protocol .................................. SUCCESS [15.946s]
[INFO] HBase - Client .................................... SUCCESS [8.778s]
[INFO] HBase - Prefix Tree ............................... SUCCESS [3.640s]
[INFO] HBase - Hadoop Compatibility ...................... SUCCESS [5.430s]
[INFO] HBase - Hadoop Two Compatibility .................. SUCCESS [2.937s]
[INFO] HBase - Server .................................... FAILURE [48:07.625s]
[INFO] HBase - Integration Tests ......................... SKIPPED
[INFO] HBase - Examples .................................. SKIPPED
[INFO] HBase - Assembly .................................. SKIPPED
[INFO] ------------------------------------------------------------------------
[INFO] BUILD FAILURE
[INFO] ------------------------------------------------------------------------
[INFO] Total time: 49:17.485s
[INFO] Finished at: Thu Jun 06 03:18:55 UTC 2013
[INFO] Final Memory: 116M/599M
[INFO] ------------------------------------------------------------------------
[ERROR] Failed to execute goal org.apache.maven.plugins:maven-surefire-plugin:2.12-TRUNK-HBASE-2:test (secondPartTestsExecution) on project hbase-server: Failure or timeout -> [Help 1]
org.apache.maven.lifecycle.LifecycleExecutionException: Failed to execute goal org.apache.maven.plugins:maven-surefire-plugin:2.12-TRUNK-HBASE-2:test (secondPartTestsExecution) on project hbase-server: Failure or timeout
	at org.apache.maven.lifecycle.internal.MojoExecutor.execute(MojoExecutor.java:217)
	at org.apache.maven.lifecycle.internal.MojoExecutor.execute(MojoExecutor.java:153)
	at org.apache.maven.lifecycle.internal.MojoExecutor.execute(MojoExecutor.java:145)
	at org.apache.maven.lifecycle.internal.LifecycleModuleBuilder.buildProject(LifecycleModuleBuilder.java:84)
	at org.apache.maven.lifecycle.internal.LifecycleModuleBuilder.buildProject(LifecycleModuleBuilder.java:59)
	at org.apache.maven.lifecycle.internal.LifecycleStarter.singleThreadedBuild(LifecycleStarter.java:183)
	at org.apache.maven.lifecycle.internal.LifecycleStarter.execute(LifecycleStarter.java:161)
	at org.apache.maven.DefaultMaven.doExecute(DefaultMaven.java:320)
	at org.apache.maven.DefaultMaven.execute(DefaultMaven.java:156)
	at org.apache.maven.cli.MavenCli.execute(MavenCli.java:537)
	at org.apache.maven.cli.MavenCli.doMain(MavenCli.java:196)
	at org.apache.maven.cli.MavenCli.main(MavenCli.java:141)
	at sun.reflect.NativeMethodAccessorImpl.invoke0(Native Method)
	at sun.reflect.NativeMethodAccessorImpl.invoke(NativeMethodAccessorImpl.java:39)
	at sun.reflect.DelegatingMethodAccessorImpl.invoke(DelegatingMethodAccessorImpl.java:25)
	at java.lang.reflect.Method.invoke(Method.java:597)
	at org.codehaus.plexus.classworlds.launcher.Launcher.launchEnhanced(Launcher.java:290)
	at org.codehaus.plexus.classworlds.launcher.Launcher.launch(Launcher.java:230)
	at org.codehaus.plexus.classworlds.launcher.Launcher.mainWithExitCode(Launcher.java:409)
	at org.codehaus.plexus.classworlds.launcher.Launcher.main(Launcher.java:352)
Caused by: org.apache.maven.plugin.MojoExecutionException: Failure or timeout
	at org.apache.maven.plugin.surefire.SurefirePlugin.assertNoFailureOrTimeout(SurefirePlugin.java:643)
	at org.apache.maven.plugin.surefire.SurefirePlugin.handleSummary(SurefirePlugin.java:624)
	at org.apache.maven.plugin.surefire.AbstractSurefireMojo.executeAfterPreconditionsChecked(AbstractSurefireMojo.java:137)
	at org.apache.maven.plugin.surefire.AbstractSurefireMojo.execute(AbstractSurefireMojo.java:98)
	at org.apache.maven.plugin.DefaultBuildPluginManager.executeMojo(DefaultBuildPluginManager.java:101)
	at org.apache.maven.lifecycle.internal.MojoExecutor.execute(MojoExecutor.java:209)
	... 19 more
[ERROR] 
[ERROR] 
[ERROR] For more information about the errors and possible solutions, please read the following articles:
[ERROR] [Help 1] http://cwiki.apache.org/confluence/display/MAVEN/MojoExecutionException
[ERROR] 
[ERROR] After correcting the problems, you can resume the build with the command
[ERROR]   mvn <goals> -rf :hbase-server
Build step 'Invoke top-level Maven targets' marked build as failure
Archiving artifacts
Recording test results
Updating HBASE-8684
Updating HBASE-8645
Updating HBASE-8402

Mime
View raw message