hbase-dev mailing list archives

Site index · List index
Message view « Date » · « Thread »
Top « Date » · « Thread »
From apurt...@apache.org
Subject Build failed in Jenkins: HBase-0.95 #446
Date Sat, 15 Jun 2013 17:22:25 GMT
See <http://54.241.6.143/job/HBase-0.95/446/>

------------------------------------------
[...truncated 3400 lines...]
[INFO] 
[INFO] Processing org.apache.hbase:hbase-common
[INFO]     Updating parent org.apache.hbase:hbase
[INFO]         from version 0.97.0-SNAPSHOT to 0.95.0-hadoop1-SNAPSHOT
[INFO] 
[INFO] Processing org.apache.hbase:hbase-examples
[INFO]     Updating parent org.apache.hbase:hbase
[INFO]         from version 0.97.0-SNAPSHOT to 0.95.0-hadoop1-SNAPSHOT
[INFO] 
[INFO] Processing org.apache.hbase:hbase-hadoop-compat
[INFO]     Updating parent org.apache.hbase:hbase
[INFO]         from version 0.97.0-SNAPSHOT to 0.95.0-hadoop1-SNAPSHOT
[INFO] 
[INFO] Processing org.apache.hbase:hbase-hadoop1-compat
[INFO]     Updating parent org.apache.hbase:hbase
[INFO]         from version 0.97.0-SNAPSHOT to 0.95.0-hadoop1-SNAPSHOT
[INFO] 
[INFO] Processing org.apache.hbase:hbase-hadoop2-compat
[INFO]     Updating parent org.apache.hbase:hbase
[INFO]         from version 0.97.0-SNAPSHOT to 0.95.0-hadoop1-SNAPSHOT
[INFO] 
[INFO] Processing org.apache.hbase:hbase-it
[INFO]     Updating parent org.apache.hbase:hbase
[INFO]         from version 0.97.0-SNAPSHOT to 0.95.0-hadoop1-SNAPSHOT
[INFO] 
[INFO] Processing org.apache.hbase:hbase-prefix-tree
[INFO]     Updating parent org.apache.hbase:hbase
[INFO]         from version 0.97.0-SNAPSHOT to 0.95.0-hadoop1-SNAPSHOT
[INFO] 
[INFO] Processing org.apache.hbase:hbase-protocol
[INFO]     Updating parent org.apache.hbase:hbase
[INFO]         from version 0.97.0-SNAPSHOT to 0.95.0-hadoop1-SNAPSHOT
[INFO] 
[INFO] Processing org.apache.hbase:hbase-server
[INFO]     Updating parent org.apache.hbase:hbase
[INFO]         from version 0.97.0-SNAPSHOT to 0.95.0-hadoop1-SNAPSHOT
[INFO] 
[INFO]                                                                         
[INFO] ------------------------------------------------------------------------
[INFO] Building HBase 0.97.0-SNAPSHOT
[INFO] ------------------------------------------------------------------------
Downloading: http://repository-netty.forge.cloudbees.com/snapshot/com/github/stephenc/findbugs/findbugs-annotations/1.3.9-1/findbugs-annotations-1.3.9-1.pom
Downloading: https://repository.apache.org/content/repositories/releases/com/github/stephenc/findbugs/findbugs-annotations/1.3.9-1/findbugs-annotations-1.3.9-1.pom
Downloading: http://download.java.net/maven/2/com/github/stephenc/findbugs/findbugs-annotations/1.3.9-1/findbugs-annotations-1.3.9-1.pom
Downloading: http://repository.codehaus.org/com/github/stephenc/findbugs/findbugs-annotations/1.3.9-1/findbugs-annotations-1.3.9-1.pom
Downloading: http://repository.jboss.org/nexus/content/groups/public-jboss/com/github/stephenc/findbugs/findbugs-annotations/1.3.9-1/findbugs-annotations-1.3.9-1.pom
Downloading: http://people.apache.org/~garyh/mvn/com/github/stephenc/findbugs/findbugs-annotations/1.3.9-1/findbugs-annotations-1.3.9-1.pom
Downloading: http://repo.maven.apache.org/maven2/com/github/stephenc/findbugs/findbugs-annotations/1.3.9-1/findbugs-annotations-1.3.9-1.pom
Downloaded: http://repo.maven.apache.org/maven2/com/github/stephenc/findbugs/findbugs-annotations/1.3.9-1/findbugs-annotations-1.3.9-1.pom
(7 KB at 141.0 KB/sec)
Downloading: http://repository-netty.forge.cloudbees.com/snapshot/org/sonatype/oss/oss-parent/5/oss-parent-5.pom
Downloading: https://repository.apache.org/content/repositories/releases/org/sonatype/oss/oss-parent/5/oss-parent-5.pom
Downloading: http://download.java.net/maven/2/org/sonatype/oss/oss-parent/5/oss-parent-5.pom
Downloading: http://repository.codehaus.org/org/sonatype/oss/oss-parent/5/oss-parent-5.pom
Downloading: http://repository.jboss.org/nexus/content/groups/public-jboss/org/sonatype/oss/oss-parent/5/oss-parent-5.pom
Downloading: http://people.apache.org/~garyh/mvn/org/sonatype/oss/oss-parent/5/oss-parent-5.pom
Downloading: http://repo.maven.apache.org/maven2/org/sonatype/oss/oss-parent/5/oss-parent-5.pom
Downloaded: http://repo.maven.apache.org/maven2/org/sonatype/oss/oss-parent/5/oss-parent-5.pom
(4 KB at 306.6 KB/sec)
Downloading: http://repository-netty.forge.cloudbees.com/snapshot/junit/junit/4.11/junit-4.11.pom
Downloading: https://repository.apache.org/content/repositories/releases/junit/junit/4.11/junit-4.11.pom
Downloading: http://download.java.net/maven/2/junit/junit/4.11/junit-4.11.pom
Downloading: http://repository.codehaus.org/junit/junit/4.11/junit-4.11.pom
Downloading: http://repository.jboss.org/nexus/content/groups/public-jboss/junit/junit/4.11/junit-4.11.pom
Downloading: http://people.apache.org/~garyh/mvn/junit/junit/4.11/junit-4.11.pom
Downloading: http://repo.maven.apache.org/maven2/junit/junit/4.11/junit-4.11.pom
Downloaded: http://repo.maven.apache.org/maven2/junit/junit/4.11/junit-4.11.pom (3 KB at 26.3
KB/sec)
Downloading: http://repository-netty.forge.cloudbees.com/snapshot/org/hamcrest/hamcrest-core/1.3/hamcrest-core-1.3.pom
Downloading: https://repository.apache.org/content/repositories/releases/org/hamcrest/hamcrest-core/1.3/hamcrest-core-1.3.pom
Downloading: http://download.java.net/maven/2/org/hamcrest/hamcrest-core/1.3/hamcrest-core-1.3.pom
Downloading: http://repository.codehaus.org/org/hamcrest/hamcrest-core/1.3/hamcrest-core-1.3.pom
Downloading: http://repository.jboss.org/nexus/content/groups/public-jboss/org/hamcrest/hamcrest-core/1.3/hamcrest-core-1.3.pom
Downloading: http://people.apache.org/~garyh/mvn/org/hamcrest/hamcrest-core/1.3/hamcrest-core-1.3.pom
Downloading: http://repo.maven.apache.org/maven2/org/hamcrest/hamcrest-core/1.3/hamcrest-core-1.3.pom
Downloaded: http://repo.maven.apache.org/maven2/org/hamcrest/hamcrest-core/1.3/hamcrest-core-1.3.pom
(766 B at 25.8 KB/sec)
Downloading: http://repository-netty.forge.cloudbees.com/snapshot/org/hamcrest/hamcrest-parent/1.3/hamcrest-parent-1.3.pom
Downloading: https://repository.apache.org/content/repositories/releases/org/hamcrest/hamcrest-parent/1.3/hamcrest-parent-1.3.pom
Downloading: http://download.java.net/maven/2/org/hamcrest/hamcrest-parent/1.3/hamcrest-parent-1.3.pom
Downloading: http://repository.codehaus.org/org/hamcrest/hamcrest-parent/1.3/hamcrest-parent-1.3.pom
Downloading: http://repository.jboss.org/nexus/content/groups/public-jboss/org/hamcrest/hamcrest-parent/1.3/hamcrest-parent-1.3.pom
Downloading: http://people.apache.org/~garyh/mvn/org/hamcrest/hamcrest-parent/1.3/hamcrest-parent-1.3.pom
Downloading: http://repo.maven.apache.org/maven2/org/hamcrest/hamcrest-parent/1.3/hamcrest-parent-1.3.pom
Downloaded: http://repo.maven.apache.org/maven2/org/hamcrest/hamcrest-parent/1.3/hamcrest-parent-1.3.pom
(2 KB at 148.1 KB/sec)
Downloading: http://repository-netty.forge.cloudbees.com/snapshot/org/mockito/mockito-all/1.9.0/mockito-all-1.9.0.pom
Downloading: https://repository.apache.org/content/repositories/releases/org/mockito/mockito-all/1.9.0/mockito-all-1.9.0.pom
Downloading: http://download.java.net/maven/2/org/mockito/mockito-all/1.9.0/mockito-all-1.9.0.pom
Downloading: http://repository.codehaus.org/org/mockito/mockito-all/1.9.0/mockito-all-1.9.0.pom
Downloading: http://repository.jboss.org/nexus/content/groups/public-jboss/org/mockito/mockito-all/1.9.0/mockito-all-1.9.0.pom
Downloading: http://people.apache.org/~garyh/mvn/org/mockito/mockito-all/1.9.0/mockito-all-1.9.0.pom
Downloading: http://repo.maven.apache.org/maven2/org/mockito/mockito-all/1.9.0/mockito-all-1.9.0.pom
Downloaded: http://repo.maven.apache.org/maven2/org/mockito/mockito-all/1.9.0/mockito-all-1.9.0.pom
(1010 B at 75.9 KB/sec)
Downloading: http://repository-netty.forge.cloudbees.com/snapshot/com/github/stephenc/findbugs/findbugs-annotations/1.3.9-1/findbugs-annotations-1.3.9-1.jar
Downloading: http://repository-netty.forge.cloudbees.com/snapshot/org/hamcrest/hamcrest-core/1.3/hamcrest-core-1.3.jar
Downloading: http://repository-netty.forge.cloudbees.com/snapshot/junit/junit/4.11/junit-4.11.jar
Downloading: https://repository.apache.org/content/repositories/releases/com/github/stephenc/findbugs/findbugs-annotations/1.3.9-1/findbugs-annotations-1.3.9-1.jar
Downloading: https://repository.apache.org/content/repositories/releases/junit/junit/4.11/junit-4.11.jar
Downloading: https://repository.apache.org/content/repositories/releases/org/hamcrest/hamcrest-core/1.3/hamcrest-core-1.3.jar
Downloading: http://download.java.net/maven/2/com/github/stephenc/findbugs/findbugs-annotations/1.3.9-1/findbugs-annotations-1.3.9-1.jar
Downloading: http://download.java.net/maven/2/junit/junit/4.11/junit-4.11.jar
Downloading: http://download.java.net/maven/2/org/hamcrest/hamcrest-core/1.3/hamcrest-core-1.3.jar
Downloading: http://repository.codehaus.org/com/github/stephenc/findbugs/findbugs-annotations/1.3.9-1/findbugs-annotations-1.3.9-1.jar
Downloading: http://repository.codehaus.org/junit/junit/4.11/junit-4.11.jar
Downloading: http://repository.codehaus.org/org/hamcrest/hamcrest-core/1.3/hamcrest-core-1.3.jar
Downloading: http://repository.jboss.org/nexus/content/groups/public-jboss/com/github/stephenc/findbugs/findbugs-annotations/1.3.9-1/findbugs-annotations-1.3.9-1.jar
Downloading: http://repository.jboss.org/nexus/content/groups/public-jboss/junit/junit/4.11/junit-4.11.jar
Downloading: http://repository.jboss.org/nexus/content/groups/public-jboss/org/hamcrest/hamcrest-core/1.3/hamcrest-core-1.3.jar
Downloading: http://people.apache.org/~garyh/mvn/com/github/stephenc/findbugs/findbugs-annotations/1.3.9-1/findbugs-annotations-1.3.9-1.jar
Downloading: http://people.apache.org/~garyh/mvn/junit/junit/4.11/junit-4.11.jar
Downloading: http://people.apache.org/~garyh/mvn/org/hamcrest/hamcrest-core/1.3/hamcrest-core-1.3.jar
Downloading: http://repo.maven.apache.org/maven2/com/github/stephenc/findbugs/findbugs-annotations/1.3.9-1/findbugs-annotations-1.3.9-1.jar
Downloading: http://repo.maven.apache.org/maven2/junit/junit/4.11/junit-4.11.jar
Downloading: http://repo.maven.apache.org/maven2/org/hamcrest/hamcrest-core/1.3/hamcrest-core-1.3.jar
Downloaded: http://repo.maven.apache.org/maven2/com/github/stephenc/findbugs/findbugs-annotations/1.3.9-1/findbugs-annotations-1.3.9-1.jar
(15 KB at 262.5 KB/sec)
Downloaded: http://repo.maven.apache.org/maven2/junit/junit/4.11/junit-4.11.jar (240 KB at
1014.0 KB/sec)
Jun 15, 2013 5:20:37 PM org.apache.maven.wagon.providers.http.httpclient.impl.client.DefaultRequestDirector
tryExecute
INFO: I/O exception (java.net.SocketException) caught when processing request: Connection
reset
Jun 15, 2013 5:20:37 PM org.apache.maven.wagon.providers.http.httpclient.impl.client.DefaultRequestDirector
tryExecute
INFO: Retrying request
Jun 15, 2013 5:21:37 PM org.apache.maven.wagon.providers.http.httpclient.impl.client.DefaultRequestDirector
tryExecute
INFO: I/O exception (java.net.SocketException) caught when processing request: Connection
reset
Jun 15, 2013 5:21:37 PM org.apache.maven.wagon.providers.http.httpclient.impl.client.DefaultRequestDirector
tryExecute
INFO: Retrying request
Jun 15, 2013 5:22:21 PM org.apache.maven.wagon.providers.http.httpclient.impl.client.DefaultRequestDirector
tryExecute
INFO: I/O exception (java.net.SocketException) caught when processing request: Connection
reset
Jun 15, 2013 5:22:21 PM org.apache.maven.wagon.providers.http.httpclient.impl.client.DefaultRequestDirector
tryExecute
INFO: Retrying request
[INFO]                                                                         
[INFO] ------------------------------------------------------------------------
[INFO] Skipping HBase
[INFO] This project has been banned from the build due to previous failures.
[INFO] ------------------------------------------------------------------------
[INFO]                                                                         
[INFO] ------------------------------------------------------------------------
[INFO] Skipping HBase
[INFO] This project has been banned from the build due to previous failures.
[INFO] ------------------------------------------------------------------------
[INFO] ------------------------------------------------------------------------
[INFO] Reactor Summary:
[INFO] 
[INFO] HBase ............................................. FAILURE [2:50.478s]
[INFO] HBase - Common .................................... SKIPPED
[INFO] HBase - Protocol .................................. SKIPPED
[INFO] HBase - Client .................................... SKIPPED
[INFO] HBase - Prefix Tree ............................... SKIPPED
[INFO] HBase - Hadoop Compatibility ...................... SKIPPED
[INFO] HBase - Hadoop One Compatibility .................. SKIPPED
[INFO] HBase - Server .................................... SKIPPED
[INFO] HBase - Integration Tests ......................... SKIPPED
[INFO] HBase - Examples .................................. SKIPPED
[INFO] HBase - Assembly .................................. SKIPPED
[INFO] ------------------------------------------------------------------------
[INFO] BUILD FAILURE
[INFO] ------------------------------------------------------------------------
[INFO] Total time: 3:23.501s
[INFO] Finished at: Sat Jun 15 17:22:22 UTC 2013
[INFO] Final Memory: 18M/215M
[INFO] ------------------------------------------------------------------------
[JENKINS] Archiving <http://54.241.6.143/job/HBase-0.95/ws/hbase-common/pom.xml> to
/var/lib/jenkins/jobs/HBase-0.95/modules/org.apache.hbase$hbase-common/builds/2013-06-15_17-18-52/archive/org.apache.hbase/hbase-common/0.97.0-SNAPSHOT/hbase-common-0.97.0-SNAPSHOT.pom
[JENKINS] Archiving <http://54.241.6.143/job/HBase-0.95/ws/hbase-hadoop-compat/pom.xml>
to /var/lib/jenkins/jobs/HBase-0.95/modules/org.apache.hbase$hbase-hadoop-compat/builds/2013-06-15_17-18-52/archive/org.apache.hbase/hbase-hadoop-compat/0.97.0-SNAPSHOT/hbase-hadoop-compat-0.97.0-SNAPSHOT.pom
[JENKINS] Archiving <http://54.241.6.143/job/HBase-0.95/ws/hbase-examples/pom.xml> to
/var/lib/jenkins/jobs/HBase-0.95/modules/org.apache.hbase$hbase-examples/builds/2013-06-15_17-18-52/archive/org.apache.hbase/hbase-examples/0.97.0-SNAPSHOT/hbase-examples-0.97.0-SNAPSHOT.pom
[JENKINS] Archiving <http://54.241.6.143/job/HBase-0.95/ws/hbase-it/pom.xml> to /var/lib/jenkins/jobs/HBase-0.95/modules/org.apache.hbase$hbase-it/builds/2013-06-15_17-18-52/archive/org.apache.hbase/hbase-it/0.97.0-SNAPSHOT/hbase-it-0.97.0-SNAPSHOT.pom
[JENKINS] Archiving <http://54.241.6.143/job/HBase-0.95/ws/pom.xml> to /var/lib/jenkins/jobs/HBase-0.95/modules/org.apache.hbase$hbase/builds/2013-06-15_17-18-52/archive/org.apache.hbase/hbase/0.97.0-SNAPSHOT/hbase-0.97.0-SNAPSHOT.pom
[JENKINS] Archiving <http://54.241.6.143/job/HBase-0.95/ws/hbase-assembly/pom.xml> to
/var/lib/jenkins/jobs/HBase-0.95/modules/org.apache.hbase$hbase-assembly/builds/2013-06-15_17-18-52/archive/org.apache.hbase/hbase-assembly/0.97.0-SNAPSHOT/hbase-assembly-0.97.0-SNAPSHOT.pom
[JENKINS] Archiving <http://54.241.6.143/job/HBase-0.95/ws/hbase-client/pom.xml> to
/var/lib/jenkins/jobs/HBase-0.95/modules/org.apache.hbase$hbase-client/builds/2013-06-15_17-18-52/archive/org.apache.hbase/hbase-client/0.97.0-SNAPSHOT/hbase-client-0.97.0-SNAPSHOT.pom
[JENKINS] Archiving <http://54.241.6.143/job/HBase-0.95/ws/hbase-prefix-tree/pom.xml>
to /var/lib/jenkins/jobs/HBase-0.95/modules/org.apache.hbase$hbase-prefix-tree/builds/2013-06-15_17-18-52/archive/org.apache.hbase/hbase-prefix-tree/0.97.0-SNAPSHOT/hbase-prefix-tree-0.97.0-SNAPSHOT.pom
[JENKINS] Archiving <http://54.241.6.143/job/HBase-0.95/ws/hbase-protocol/pom.xml> to
/var/lib/jenkins/jobs/HBase-0.95/modules/org.apache.hbase$hbase-protocol/builds/2013-06-15_17-18-52/archive/org.apache.hbase/hbase-protocol/0.97.0-SNAPSHOT/hbase-protocol-0.97.0-SNAPSHOT.pom
[JENKINS] Archiving <http://54.241.6.143/job/HBase-0.95/ws/hbase-hadoop1-compat/pom.xml>
to /var/lib/jenkins/jobs/HBase-0.95/modules/org.apache.hbase$hbase-hadoop1-compat/builds/2013-06-15_17-18-52/archive/org.apache.hbase/hbase-hadoop1-compat/0.97.0-SNAPSHOT/hbase-hadoop1-compat-0.97.0-SNAPSHOT.pom
[JENKINS] Archiving <http://54.241.6.143/job/HBase-0.95/ws/hbase-server/pom.xml> to
/var/lib/jenkins/jobs/HBase-0.95/modules/org.apache.hbase$hbase-server/builds/2013-06-15_17-18-52/archive/org.apache.hbase/hbase-server/0.97.0-SNAPSHOT/hbase-server-0.97.0-SNAPSHOT.pom
Waiting for Jenkins to finish collecting data
mavenExecutionResult exceptions not empty
message : Failed to execute goal on project hbase: Could not resolve dependencies for project
org.apache.hbase:hbase:pom:0.97.0-SNAPSHOT: Could not transfer artifact org.hamcrest:hamcrest-core:jar:1.3
from/to central (http://repo.maven.apache.org/maven2): Connection reset
cause : Could not resolve dependencies for project org.apache.hbase:hbase:pom:0.97.0-SNAPSHOT:
Could not transfer artifact org.hamcrest:hamcrest-core:jar:1.3 from/to central (http://repo.maven.apache.org/maven2):
Connection reset
Stack trace : 
org.apache.maven.lifecycle.LifecycleExecutionException: Failed to execute goal on project
hbase: Could not resolve dependencies for project org.apache.hbase:hbase:pom:0.97.0-SNAPSHOT:
Could not transfer artifact org.hamcrest:hamcrest-core:jar:1.3 from/to central (http://repo.maven.apache.org/maven2):
Connection reset
	at org.apache.maven.lifecycle.internal.LifecycleDependencyResolver.getDependencies(LifecycleDependencyResolver.java:210)
	at org.apache.maven.lifecycle.internal.LifecycleDependencyResolver.resolveProjectDependencies(LifecycleDependencyResolver.java:117)
	at org.apache.maven.lifecycle.internal.MojoExecutor.ensureDependenciesAreResolved(MojoExecutor.java:258)
	at org.apache.maven.lifecycle.internal.MojoExecutor.execute(MojoExecutor.java:201)
	at org.apache.maven.lifecycle.internal.MojoExecutor.execute(MojoExecutor.java:153)
	at org.apache.maven.lifecycle.internal.MojoExecutor.execute(MojoExecutor.java:145)
	at org.apache.maven.lifecycle.internal.LifecycleModuleBuilder.buildProject(LifecycleModuleBuilder.java:84)
	at org.apache.maven.lifecycle.internal.LifecycleModuleBuilder.buildProject(LifecycleModuleBuilder.java:59)
	at org.apache.maven.lifecycle.internal.LifecycleStarter.singleThreadedBuild(LifecycleStarter.java:183)
	at org.apache.maven.lifecycle.internal.LifecycleStarter.execute(LifecycleStarter.java:161)
	at org.apache.maven.DefaultMaven.doExecute(DefaultMaven.java:320)
	at org.apache.maven.DefaultMaven.execute(DefaultMaven.java:156)
	at org.jvnet.hudson.maven3.launcher.Maven3Launcher.main(Maven3Launcher.java:79)
	at sun.reflect.NativeMethodAccessorImpl.invoke0(Native Method)
	at sun.reflect.NativeMethodAccessorImpl.invoke(NativeMethodAccessorImpl.java:39)
	at sun.reflect.DelegatingMethodAccessorImpl.invoke(DelegatingMethodAccessorImpl.java:25)
	at java.lang.reflect.Method.invoke(Method.java:597)
	at org.codehaus.plexus.classworlds.launcher.Launcher.launchStandard(Launcher.java:329)
	at org.codehaus.plexus.classworlds.launcher.Launcher.launch(Launcher.java:239)
	at org.jvnet.hudson.maven3.agent.Maven3Main.launch(Maven3Main.java:158)
	at hudson.maven.Maven3Builder.call(Maven3Builder.java:100)
	at hudson.maven.Maven3Builder.call(Maven3Builder.java:66)
	at hudson.remoting.UserRequest.perform(UserRequest.java:118)
	at hudson.remoting.UserRequest.perform(UserRequest.java:48)
	at hudson.remoting.Request$2.run(Request.java:326)
	at hudson.remoting.InterceptingExecutorService$1.call(InterceptingExecutorService.java:72)
	at java.util.concurrent.FutureTask$Sync.innerRun(FutureTask.java:303)
	at java.util.concurrent.FutureTask.run(FutureTask.java:138)
	at java.util.concurrent.ThreadPoolExecutor$Worker.runTask(ThreadPoolExecutor.java:895)
	at java.util.concurrent.ThreadPoolExecutor$Worker.run(ThreadPoolExecutor.java:918)
	at java.lang.Thread.run(Thread.java:662)
Caused by: org.apache.maven.project.DependencyResolutionException: Could not resolve dependencies
for project org.apache.hbase:hbase:pom:0.97.0-SNAPSHOT: Could not transfer artifact org.hamcrest:hamcrest-core:jar:1.3
from/to central (http://repo.maven.apache.org/maven2): Connection reset
	at org.apache.maven.project.DefaultProjectDependenciesResolver.resolve(DefaultProjectDependenciesResolver.java:189)
	at org.apache.maven.lifecycle.internal.LifecycleDependencyResolver.getDependencies(LifecycleDependencyResolver.java:185)
	... 30 more
Caused by: org.sonatype.aether.resolution.DependencyResolutionException: Could not transfer
artifact org.hamcrest:hamcrest-core:jar:1.3 from/to central (http://repo.maven.apache.org/maven2):
Connection reset
	at org.sonatype.aether.impl.internal.DefaultRepositorySystem.resolveDependencies(DefaultRepositorySystem.java:375)
	at org.apache.maven.project.DefaultProjectDependenciesResolver.resolve(DefaultProjectDependenciesResolver.java:183)
	... 31 more
Caused by: org.sonatype.aether.resolution.ArtifactResolutionException: Could not transfer
artifact org.hamcrest:hamcrest-core:jar:1.3 from/to central (http://repo.maven.apache.org/maven2):
Connection reset
	at org.sonatype.aether.impl.internal.DefaultArtifactResolver.resolve(DefaultArtifactResolver.java:538)
	at org.sonatype.aether.impl.internal.DefaultArtifactResolver.resolveArtifacts(DefaultArtifactResolver.java:216)
	at org.sonatype.aether.impl.internal.DefaultRepositorySystem.resolveDependencies(DefaultRepositorySystem.java:358)
	... 32 more
Caused by: org.sonatype.aether.transfer.ArtifactTransferException: Could not transfer artifact
org.hamcrest:hamcrest-core:jar:1.3 from/to central (http://repo.maven.apache.org/maven2):
Connection reset
	at org.sonatype.aether.connector.wagon.WagonRepositoryConnector$4.wrap(WagonRepositoryConnector.java:951)
	at org.sonatype.aether.connector.wagon.WagonRepositoryConnector$4.wrap(WagonRepositoryConnector.java:941)
	at org.sonatype.aether.connector.wagon.WagonRepositoryConnector$GetTask.run(WagonRepositoryConnector.java:669)
	at org.sonatype.aether.util.concurrency.RunnableErrorForwarder$1.run(RunnableErrorForwarder.java:60)
	... 3 more
Caused by: org.apache.maven.wagon.TransferFailedException: Connection reset
	at org.apache.maven.wagon.shared.http4.AbstractHttpClientWagon.fillInputData(AbstractHttpClientWagon.java:799)
	at org.apache.maven.wagon.StreamWagon.getInputStream(StreamWagon.java:116)
	at org.apache.maven.wagon.StreamWagon.getIfNewer(StreamWagon.java:88)
	at org.apache.maven.wagon.StreamWagon.get(StreamWagon.java:61)
	at org.sonatype.aether.connector.wagon.WagonRepositoryConnector$GetTask.run(WagonRepositoryConnector.java:601)
	... 4 more
Caused by: java.net.SocketException: Connection reset
	at java.net.SocketInputStream.read(SocketInputStream.java:168)
	at org.apache.maven.wagon.providers.http.httpclient.impl.io.AbstractSessionInputBuffer.fillBuffer(AbstractSessionInputBuffer.java:149)
	at org.apache.maven.wagon.providers.http.httpclient.impl.io.SocketInputBuffer.fillBuffer(SocketInputBuffer.java:110)
	at org.apache.maven.wagon.providers.http.httpclient.impl.io.AbstractSessionInputBuffer.readLine(AbstractSessionInputBuffer.java:264)
	at org.apache.maven.wagon.providers.http.httpclient.impl.conn.DefaultResponseParser.parseHead(DefaultResponseParser.java:98)
	at org.apache.maven.wagon.providers.http.httpclient.impl.io.AbstractMessageParser.parse(AbstractMessageParser.java:252)
	at org.apache.maven.wagon.providers.http.httpclient.impl.AbstractHttpClientConnection.receiveResponseHeader(AbstractHttpClientConnection.java:281)
	at org.apache.maven.wagon.providers.http.httpclient.impl.conn.DefaultClientConnection.receiveResponseHeader(DefaultClientConnection.java:247)
	at org.apache.maven.wagon.providers.http.httpclient.impl.conn.AbstractClientConnAdapter.receiveResponseHeader(AbstractClientConnAdapter.java:219)
	at org.apache.maven.wagon.providers.http.httpclient.protocol.HttpRequestExecutor.doReceiveResponse(HttpRequestExecutor.java:298)
	at org.apache.maven.wagon.providers.http.httpclient.protocol.HttpRequestExecutor.execute(HttpRequestExecutor.java:125)
	at org.apache.maven.wagon.providers.http.httpclient.impl.client.DefaultRequestDirector.tryExecute(DefaultRequestDirector.java:645)
	at org.apache.maven.wagon.providers.http.httpclient.impl.client.DefaultRequestDirector.execute(DefaultRequestDirector.java:464)
	at org.apache.maven.wagon.providers.http.httpclient.impl.client.AbstractHttpClient.execute(AbstractHttpClient.java:820)
	at org.apache.maven.wagon.providers.http.httpclient.impl.client.AbstractHttpClient.execute(AbstractHttpClient.java:754)
	at org.apache.maven.wagon.shared.http4.AbstractHttpClientWagon.execute(AbstractHttpClientWagon.java:674)
	at org.apache.maven.wagon.shared.http4.AbstractHttpClientWagon.fillInputData(AbstractHttpClientWagon.java:793)
	... 8 more
channel stopped

Mime
View raw message