hbase-dev mailing list archives

Site index · List index
Message view « Date » · « Thread »
Top « Date » · « Thread »
From Apache Jenkins Server <jenk...@builds.apache.org>
Subject Build failed in Jenkins: hbase-0.95-on-hadoop2 #136
Date Wed, 19 Jun 2013 00:44:47 GMT
See <https://builds.apache.org/job/hbase-0.95-on-hadoop2/136/changes>

Changes:

[stack] HBASE-8453 TestImportExport failing again due to configuration issues -- REVERT

[sershe] HBASE-8665 bad compaction priority behavior in queue can cause store to be blocked

[stack] HBASE-8453 TestImportExport failing again due to configuration issues

------------------------------------------
[...truncated 24516 lines...]
Running org.apache.hadoop.hbase.client.TestRestoreSnapshotFromClient
Tests run: 3, Failures: 0, Errors: 0, Skipped: 0, Time elapsed: 217.958 sec
Forking command line: /bin/sh -c cd /home/hudson/jenkins-slave/workspace/hbase-0.95-on-hadoop2/0.95-on-hadoop2/hbase-server && /home/hudson/tools/java/jdk1.6.0_45-32/jre/bin/java -enableassertions -Xmx1900m -Djava.security.egd=file:/dev/./urandom -Djava.net.preferIPv4Stack=true -jar /home/hudson/jenkins-slave/workspace/hbase-0.95-on-hadoop2/0.95-on-hadoop2/hbase-server/target/surefire/surefirebooter1622098452631327032.jar /home/hudson/jenkins-slave/workspace/hbase-0.95-on-hadoop2/0.95-on-hadoop2/hbase-server/target/surefire/surefire6767212080269983792tmp /home/hudson/jenkins-slave/workspace/hbase-0.95-on-hadoop2/0.95-on-hadoop2/hbase-server/target/surefire/surefire_1935426983647633780915tmp
Running org.apache.hadoop.hbase.client.TestMetaScanner
Tests run: 2, Failures: 0, Errors: 0, Skipped: 0, Time elapsed: 61.165 sec
Forking command line: /bin/sh -c cd /home/hudson/jenkins-slave/workspace/hbase-0.95-on-hadoop2/0.95-on-hadoop2/hbase-server && /home/hudson/tools/java/jdk1.6.0_45-32/jre/bin/java -enableassertions -Xmx1900m -Djava.security.egd=file:/dev/./urandom -Djava.net.preferIPv4Stack=true -jar /home/hudson/jenkins-slave/workspace/hbase-0.95-on-hadoop2/0.95-on-hadoop2/hbase-server/target/surefire/surefirebooter4252574811157219531.jar /home/hudson/jenkins-slave/workspace/hbase-0.95-on-hadoop2/0.95-on-hadoop2/hbase-server/target/surefire/surefire5206328476311050557tmp /home/hudson/jenkins-slave/workspace/hbase-0.95-on-hadoop2/0.95-on-hadoop2/hbase-server/target/surefire/surefire_1948186436484041033062tmp
Running org.apache.hadoop.hbase.client.TestFromClientSide
Tests run: 61, Failures: 0, Errors: 0, Skipped: 3, Time elapsed: 209.637 sec
Forking command line: /bin/sh -c cd /home/hudson/jenkins-slave/workspace/hbase-0.95-on-hadoop2/0.95-on-hadoop2/hbase-server && /home/hudson/tools/java/jdk1.6.0_45-32/jre/bin/java -enableassertions -Xmx1900m -Djava.security.egd=file:/dev/./urandom -Djava.net.preferIPv4Stack=true -jar /home/hudson/jenkins-slave/workspace/hbase-0.95-on-hadoop2/0.95-on-hadoop2/hbase-server/target/surefire/surefirebooter3482115292673690559.jar /home/hudson/jenkins-slave/workspace/hbase-0.95-on-hadoop2/0.95-on-hadoop2/hbase-server/target/surefire/surefire3199222682592156454tmp /home/hudson/jenkins-slave/workspace/hbase-0.95-on-hadoop2/0.95-on-hadoop2/hbase-server/target/surefire/surefire_1952616860467427260189tmp
Running org.apache.hadoop.hbase.client.TestScannerTimeout
Tests run: 4, Failures: 0, Errors: 0, Skipped: 0, Time elapsed: 57.741 sec
Forking command line: /bin/sh -c cd /home/hudson/jenkins-slave/workspace/hbase-0.95-on-hadoop2/0.95-on-hadoop2/hbase-server && /home/hudson/tools/java/jdk1.6.0_45-32/jre/bin/java -enableassertions -Xmx1900m -Djava.security.egd=file:/dev/./urandom -Djava.net.preferIPv4Stack=true -jar /home/hudson/jenkins-slave/workspace/hbase-0.95-on-hadoop2/0.95-on-hadoop2/hbase-server/target/surefire/surefirebooter7967743480106755175.jar /home/hudson/jenkins-slave/workspace/hbase-0.95-on-hadoop2/0.95-on-hadoop2/hbase-server/target/surefire/surefire7008784058164787607tmp /home/hudson/jenkins-slave/workspace/hbase-0.95-on-hadoop2/0.95-on-hadoop2/hbase-server/target/surefire/surefire_1963611084495823721389tmp
Running org.apache.hadoop.hbase.client.TestScannersFromClientSide
Tests run: 20, Failures: 0, Errors: 0, Skipped: 0, Time elapsed: 48.94 sec
Forking command line: /bin/sh -c cd /home/hudson/jenkins-slave/workspace/hbase-0.95-on-hadoop2/0.95-on-hadoop2/hbase-server && /home/hudson/tools/java/jdk1.6.0_45-32/jre/bin/java -enableassertions -Xmx1900m -Djava.security.egd=file:/dev/./urandom -Djava.net.preferIPv4Stack=true -jar /home/hudson/jenkins-slave/workspace/hbase-0.95-on-hadoop2/0.95-on-hadoop2/hbase-server/target/surefire/surefirebooter638746312405969511.jar /home/hudson/jenkins-slave/workspace/hbase-0.95-on-hadoop2/0.95-on-hadoop2/hbase-server/target/surefire/surefire4017137344141696037tmp /home/hudson/jenkins-slave/workspace/hbase-0.95-on-hadoop2/0.95-on-hadoop2/hbase-server/target/surefire/surefire_197249708745932478733tmp
Running org.apache.hadoop.hbase.client.TestShell
Tests run: 1, Failures: 0, Errors: 0, Skipped: 0, Time elapsed: 131.028 sec
Forking command line: /bin/sh -c cd /home/hudson/jenkins-slave/workspace/hbase-0.95-on-hadoop2/0.95-on-hadoop2/hbase-server && /home/hudson/tools/java/jdk1.6.0_45-32/jre/bin/java -enableassertions -Xmx1900m -Djava.security.egd=file:/dev/./urandom -Djava.net.preferIPv4Stack=true -jar /home/hudson/jenkins-slave/workspace/hbase-0.95-on-hadoop2/0.95-on-hadoop2/hbase-server/target/surefire/surefirebooter1839478420892229401.jar /home/hudson/jenkins-slave/workspace/hbase-0.95-on-hadoop2/0.95-on-hadoop2/hbase-server/target/surefire/surefire3547222725043070867tmp /home/hudson/jenkins-slave/workspace/hbase-0.95-on-hadoop2/0.95-on-hadoop2/hbase-server/target/surefire/surefire_1988318844475663181875tmp
Running org.apache.hadoop.hbase.TestMultiVersions
Tests run: 3, Failures: 0, Errors: 0, Skipped: 0, Time elapsed: 33.21 sec
Forking command line: /bin/sh -c cd /home/hudson/jenkins-slave/workspace/hbase-0.95-on-hadoop2/0.95-on-hadoop2/hbase-server && /home/hudson/tools/java/jdk1.6.0_45-32/jre/bin/java -enableassertions -Xmx1900m -Djava.security.egd=file:/dev/./urandom -Djava.net.preferIPv4Stack=true -jar /home/hudson/jenkins-slave/workspace/hbase-0.95-on-hadoop2/0.95-on-hadoop2/hbase-server/target/surefire/surefirebooter4602120306626055348.jar /home/hudson/jenkins-slave/workspace/hbase-0.95-on-hadoop2/0.95-on-hadoop2/hbase-server/target/surefire/surefire2353775063053801098tmp /home/hudson/jenkins-slave/workspace/hbase-0.95-on-hadoop2/0.95-on-hadoop2/hbase-server/target/surefire/surefire_199133644108845791965tmp
Running org.apache.hadoop.hbase.thrift.TestThriftServerCmdLine
Tests run: 32, Failures: 0, Errors: 0, Skipped: 0, Time elapsed: 63.977 sec
Forking command line: /bin/sh -c cd /home/hudson/jenkins-slave/workspace/hbase-0.95-on-hadoop2/0.95-on-hadoop2/hbase-server && /home/hudson/tools/java/jdk1.6.0_45-32/jre/bin/java -enableassertions -Xmx1900m -Djava.security.egd=file:/dev/./urandom -Djava.net.preferIPv4Stack=true -jar /home/hudson/jenkins-slave/workspace/hbase-0.95-on-hadoop2/0.95-on-hadoop2/hbase-server/target/surefire/surefirebooter2075745768535918078.jar /home/hudson/jenkins-slave/workspace/hbase-0.95-on-hadoop2/0.95-on-hadoop2/hbase-server/target/surefire/surefire1730921464343553522tmp /home/hudson/jenkins-slave/workspace/hbase-0.95-on-hadoop2/0.95-on-hadoop2/hbase-server/target/surefire/surefire_2007723901847843269781tmp
Running org.apache.hadoop.hbase.client.TestCloneSnapshotFromClient
Tests run: 3, Failures: 0, Errors: 0, Skipped: 0, Time elapsed: 165.966 sec
Forking command line: /bin/sh -c cd /home/hudson/jenkins-slave/workspace/hbase-0.95-on-hadoop2/0.95-on-hadoop2/hbase-server && /home/hudson/tools/java/jdk1.6.0_45-32/jre/bin/java -enableassertions -Xmx1900m -Djava.security.egd=file:/dev/./urandom -Djava.net.preferIPv4Stack=true -jar /home/hudson/jenkins-slave/workspace/hbase-0.95-on-hadoop2/0.95-on-hadoop2/hbase-server/target/surefire/surefirebooter1561610508174785241.jar /home/hudson/jenkins-slave/workspace/hbase-0.95-on-hadoop2/0.95-on-hadoop2/hbase-server/target/surefire/surefire8129375234603906778tmp /home/hudson/jenkins-slave/workspace/hbase-0.95-on-hadoop2/0.95-on-hadoop2/hbase-server/target/surefire/surefire_2018892809144606176126tmp
Running org.apache.hadoop.hbase.thrift.TestThriftServer
Tests run: 1, Failures: 0, Errors: 0, Skipped: 0, Time elapsed: 81.564 sec
Forking command line: /bin/sh -c cd /home/hudson/jenkins-slave/workspace/hbase-0.95-on-hadoop2/0.95-on-hadoop2/hbase-server && /home/hudson/tools/java/jdk1.6.0_45-32/jre/bin/java -enableassertions -Xmx1900m -Djava.security.egd=file:/dev/./urandom -Djava.net.preferIPv4Stack=true -jar /home/hudson/jenkins-slave/workspace/hbase-0.95-on-hadoop2/0.95-on-hadoop2/hbase-server/target/surefire/surefirebooter3161058781648034699.jar /home/hudson/jenkins-slave/workspace/hbase-0.95-on-hadoop2/0.95-on-hadoop2/hbase-server/target/surefire/surefire7319762373347175282tmp /home/hudson/jenkins-slave/workspace/hbase-0.95-on-hadoop2/0.95-on-hadoop2/hbase-server/target/surefire/surefire_2025962394569278591626tmp
Running org.apache.hadoop.hbase.master.TestActiveMasterManager
Tests run: 2, Failures: 0, Errors: 0, Skipped: 0, Time elapsed: 1.762 sec
Forking command line: /bin/sh -c cd /home/hudson/jenkins-slave/workspace/hbase-0.95-on-hadoop2/0.95-on-hadoop2/hbase-server && /home/hudson/tools/java/jdk1.6.0_45-32/jre/bin/java -enableassertions -Xmx1900m -Djava.security.egd=file:/dev/./urandom -Djava.net.preferIPv4Stack=true -jar /home/hudson/jenkins-slave/workspace/hbase-0.95-on-hadoop2/0.95-on-hadoop2/hbase-server/target/surefire/surefirebooter3008217618570273541.jar /home/hudson/jenkins-slave/workspace/hbase-0.95-on-hadoop2/0.95-on-hadoop2/hbase-server/target/surefire/surefire4750125489580598627tmp /home/hudson/jenkins-slave/workspace/hbase-0.95-on-hadoop2/0.95-on-hadoop2/hbase-server/target/surefire/surefire_2035496114392572765520tmp
Running org.apache.hadoop.hbase.master.TestDeadServer
Tests run: 3, Failures: 0, Errors: 0, Skipped: 0, Time elapsed: 0.326 sec
Forking command line: /bin/sh -c cd /home/hudson/jenkins-slave/workspace/hbase-0.95-on-hadoop2/0.95-on-hadoop2/hbase-server && /home/hudson/tools/java/jdk1.6.0_45-32/jre/bin/java -enableassertions -Xmx1900m -Djava.security.egd=file:/dev/./urandom -Djava.net.preferIPv4Stack=true -jar /home/hudson/jenkins-slave/workspace/hbase-0.95-on-hadoop2/0.95-on-hadoop2/hbase-server/target/surefire/surefirebooter1229234135894646200.jar /home/hudson/jenkins-slave/workspace/hbase-0.95-on-hadoop2/0.95-on-hadoop2/hbase-server/target/surefire/surefire2006403164985102605tmp /home/hudson/jenkins-slave/workspace/hbase-0.95-on-hadoop2/0.95-on-hadoop2/hbase-server/target/surefire/surefire_204275241411521888867tmp
Running org.apache.hadoop.hbase.master.TestRegionPlacement
Tests run: 3, Failures: 0, Errors: 0, Skipped: 0, Time elapsed: 16.461 sec
Forking command line: /bin/sh -c cd /home/hudson/jenkins-slave/workspace/hbase-0.95-on-hadoop2/0.95-on-hadoop2/hbase-server && /home/hudson/tools/java/jdk1.6.0_45-32/jre/bin/java -enableassertions -Xmx1900m -Djava.security.egd=file:/dev/./urandom -Djava.net.preferIPv4Stack=true -jar /home/hudson/jenkins-slave/workspace/hbase-0.95-on-hadoop2/0.95-on-hadoop2/hbase-server/target/surefire/surefirebooter7523818463563521160.jar /home/hudson/jenkins-slave/workspace/hbase-0.95-on-hadoop2/0.95-on-hadoop2/hbase-server/target/surefire/surefire8211697980559649879tmp /home/hudson/jenkins-slave/workspace/hbase-0.95-on-hadoop2/0.95-on-hadoop2/hbase-server/target/surefire/surefire_2056430268449208223295tmp
Running org.apache.hadoop.hbase.master.TestMasterNoCluster
Tests run: 4, Failures: 0, Errors: 0, Skipped: 0, Time elapsed: 12.49 sec
Forking command line: /bin/sh -c cd /home/hudson/jenkins-slave/workspace/hbase-0.95-on-hadoop2/0.95-on-hadoop2/hbase-server && /home/hudson/tools/java/jdk1.6.0_45-32/jre/bin/java -enableassertions -Xmx1900m -Djava.security.egd=file:/dev/./urandom -Djava.net.preferIPv4Stack=true -jar /home/hudson/jenkins-slave/workspace/hbase-0.95-on-hadoop2/0.95-on-hadoop2/hbase-server/target/surefire/surefirebooter2896354523670227744.jar /home/hudson/jenkins-slave/workspace/hbase-0.95-on-hadoop2/0.95-on-hadoop2/hbase-server/target/surefire/surefire1382861041919844343tmp /home/hudson/jenkins-slave/workspace/hbase-0.95-on-hadoop2/0.95-on-hadoop2/hbase-server/target/surefire/surefire_2065466347472133108583tmp
Running org.apache.hadoop.hbase.master.TestRollingRestart
Tests run: 1, Failures: 0, Errors: 0, Skipped: 0, Time elapsed: 54.615 sec
Forking command line: /bin/sh -c cd /home/hudson/jenkins-slave/workspace/hbase-0.95-on-hadoop2/0.95-on-hadoop2/hbase-server && /home/hudson/tools/java/jdk1.6.0_45-32/jre/bin/java -enableassertions -Xmx1900m -Djava.security.egd=file:/dev/./urandom -Djava.net.preferIPv4Stack=true -jar /home/hudson/jenkins-slave/workspace/hbase-0.95-on-hadoop2/0.95-on-hadoop2/hbase-server/target/surefire/surefirebooter415689314470506825.jar /home/hudson/jenkins-slave/workspace/hbase-0.95-on-hadoop2/0.95-on-hadoop2/hbase-server/target/surefire/surefire6259547339545545209tmp /home/hudson/jenkins-slave/workspace/hbase-0.95-on-hadoop2/0.95-on-hadoop2/hbase-server/target/surefire/surefire_2078526341906395369304tmp
Running org.apache.hadoop.hbase.master.balancer.TestDefaultLoadBalancer
Tests run: 1, Failures: 0, Errors: 0, Skipped: 0, Time elapsed: 1.717 sec
Forking command line: /bin/sh -c cd /home/hudson/jenkins-slave/workspace/hbase-0.95-on-hadoop2/0.95-on-hadoop2/hbase-server && /home/hudson/tools/java/jdk1.6.0_45-32/jre/bin/java -enableassertions -Xmx1900m -Djava.security.egd=file:/dev/./urandom -Djava.net.preferIPv4Stack=true -jar /home/hudson/jenkins-slave/workspace/hbase-0.95-on-hadoop2/0.95-on-hadoop2/hbase-server/target/surefire/surefirebooter8871129739607851535.jar /home/hudson/jenkins-slave/workspace/hbase-0.95-on-hadoop2/0.95-on-hadoop2/hbase-server/target/surefire/surefire4410216348864912286tmp /home/hudson/jenkins-slave/workspace/hbase-0.95-on-hadoop2/0.95-on-hadoop2/hbase-server/target/surefire/surefire_20823199589242461126tmp
Running org.apache.hadoop.hbase.master.balancer.TestBaseLoadBalancer
Tests run: 3, Failures: 0, Errors: 0, Skipped: 0, Time elapsed: 0.804 sec
Forking command line: /bin/sh -c cd /home/hudson/jenkins-slave/workspace/hbase-0.95-on-hadoop2/0.95-on-hadoop2/hbase-server && /home/hudson/tools/java/jdk1.6.0_45-32/jre/bin/java -enableassertions -Xmx1900m -Djava.security.egd=file:/dev/./urandom -Djava.net.preferIPv4Stack=true -jar /home/hudson/jenkins-slave/workspace/hbase-0.95-on-hadoop2/0.95-on-hadoop2/hbase-server/target/surefire/surefirebooter673026493370149114.jar /home/hudson/jenkins-slave/workspace/hbase-0.95-on-hadoop2/0.95-on-hadoop2/hbase-server/target/surefire/surefire5807222826636956602tmp /home/hudson/jenkins-slave/workspace/hbase-0.95-on-hadoop2/0.95-on-hadoop2/hbase-server/target/surefire/surefire_2092123714889080211964tmp
Running org.apache.hadoop.hbase.master.TestMasterMetrics
Tests run: 2, Failures: 0, Errors: 0, Skipped: 0, Time elapsed: 26.087 sec
Forking command line: /bin/sh -c cd /home/hudson/jenkins-slave/workspace/hbase-0.95-on-hadoop2/0.95-on-hadoop2/hbase-server && /home/hudson/tools/java/jdk1.6.0_45-32/jre/bin/java -enableassertions -Xmx1900m -Djava.security.egd=file:/dev/./urandom -Djava.net.preferIPv4Stack=true -jar /home/hudson/jenkins-slave/workspace/hbase-0.95-on-hadoop2/0.95-on-hadoop2/hbase-server/target/surefire/surefirebooter8630082311196391175.jar /home/hudson/jenkins-slave/workspace/hbase-0.95-on-hadoop2/0.95-on-hadoop2/hbase-server/target/surefire/surefire4985010031281426534tmp /home/hudson/jenkins-slave/workspace/hbase-0.95-on-hadoop2/0.95-on-hadoop2/hbase-server/target/surefire/surefire_2103380242047234572683tmp
Running org.apache.hadoop.hbase.master.TestMasterFileSystem
Tests run: 2, Failures: 0, Errors: 0, Skipped: 0, Time elapsed: 14.753 sec
Forking command line: /bin/sh -c cd /home/hudson/jenkins-slave/workspace/hbase-0.95-on-hadoop2/0.95-on-hadoop2/hbase-server && /home/hudson/tools/java/jdk1.6.0_45-32/jre/bin/java -enableassertions -Xmx1900m -Djava.security.egd=file:/dev/./urandom -Djava.net.preferIPv4Stack=true -jar /home/hudson/jenkins-slave/workspace/hbase-0.95-on-hadoop2/0.95-on-hadoop2/hbase-server/target/surefire/surefirebooter2853433849636836192.jar /home/hudson/jenkins-slave/workspace/hbase-0.95-on-hadoop2/0.95-on-hadoop2/hbase-server/target/surefire/surefire2914155153065242034tmp /home/hudson/jenkins-slave/workspace/hbase-0.95-on-hadoop2/0.95-on-hadoop2/hbase-server/target/surefire/surefire_2112543022692484163431tmp
Running org.apache.hadoop.hbase.client.TestMultiParallel
Tests run: 11, Failures: 0, Errors: 0, Skipped: 0, Time elapsed: 198.896 sec
Forking command line: /bin/sh -c cd /home/hudson/jenkins-slave/workspace/hbase-0.95-on-hadoop2/0.95-on-hadoop2/hbase-server && /home/hudson/tools/java/jdk1.6.0_45-32/jre/bin/java -enableassertions -Xmx1900m -Djava.security.egd=file:/dev/./urandom -Djava.net.preferIPv4Stack=true -jar /home/hudson/jenkins-slave/workspace/hbase-0.95-on-hadoop2/0.95-on-hadoop2/hbase-server/target/surefire/surefirebooter6021146651775638954.jar /home/hudson/jenkins-slave/workspace/hbase-0.95-on-hadoop2/0.95-on-hadoop2/hbase-server/target/surefire/surefire4087190547709085532tmp /home/hudson/jenkins-slave/workspace/hbase-0.95-on-hadoop2/0.95-on-hadoop2/hbase-server/target/surefire/surefire_2123383785676071134512tmp
Running org.apache.hadoop.hbase.master.TestZKBasedOpenCloseRegion
Tests run: 4, Failures: 0, Errors: 0, Skipped: 0, Time elapsed: 24.152 sec
Forking command line: /bin/sh -c cd /home/hudson/jenkins-slave/workspace/hbase-0.95-on-hadoop2/0.95-on-hadoop2/hbase-server && /home/hudson/tools/java/jdk1.6.0_45-32/jre/bin/java -enableassertions -Xmx1900m -Djava.security.egd=file:/dev/./urandom -Djava.net.preferIPv4Stack=true -jar /home/hudson/jenkins-slave/workspace/hbase-0.95-on-hadoop2/0.95-on-hadoop2/hbase-server/target/surefire/surefirebooter7941742670088392485.jar /home/hudson/jenkins-slave/workspace/hbase-0.95-on-hadoop2/0.95-on-hadoop2/hbase-server/target/surefire/surefire396359084706574516tmp /home/hudson/jenkins-slave/workspace/hbase-0.95-on-hadoop2/0.95-on-hadoop2/hbase-server/target/surefire/surefire_2131733705421910362831tmp
Running org.apache.hadoop.hbase.master.handler.TestCreateTableHandler
Tests run: 2, Failures: 0, Errors: 0, Skipped: 0, Time elapsed: 24.557 sec
Forking command line: /bin/sh -c cd /home/hudson/jenkins-slave/workspace/hbase-0.95-on-hadoop2/0.95-on-hadoop2/hbase-server && /home/hudson/tools/java/jdk1.6.0_45-32/jre/bin/java -enableassertions -Xmx1900m -Djava.security.egd=file:/dev/./urandom -Djava.net.preferIPv4Stack=true -jar /home/hudson/jenkins-slave/workspace/hbase-0.95-on-hadoop2/0.95-on-hadoop2/hbase-server/target/surefire/surefirebooter4277809731560869618.jar /home/hudson/jenkins-slave/workspace/hbase-0.95-on-hadoop2/0.95-on-hadoop2/hbase-server/target/surefire/surefire2533627300850748808tmp /home/hudson/jenkins-slave/workspace/hbase-0.95-on-hadoop2/0.95-on-hadoop2/hbase-server/target/surefire/surefire_2144476334385288219371tmp
Running org.apache.hadoop.hbase.master.handler.TestTableDescriptorModification
Tests run: 3, Failures: 0, Errors: 0, Skipped: 0, Time elapsed: 22.882 sec
Forking command line: /bin/sh -c cd /home/hudson/jenkins-slave/workspace/hbase-0.95-on-hadoop2/0.95-on-hadoop2/hbase-server && /home/hudson/tools/java/jdk1.6.0_45-32/jre/bin/java -enableassertions -Xmx1900m -Djava.security.egd=file:/dev/./urandom -Djava.net.preferIPv4Stack=true -jar /home/hudson/jenkins-slave/workspace/hbase-0.95-on-hadoop2/0.95-on-hadoop2/hbase-server/target/surefire/surefirebooter7011588777115517577.jar /home/hudson/jenkins-slave/workspace/hbase-0.95-on-hadoop2/0.95-on-hadoop2/hbase-server/target/surefire/surefire4986076203197580813tmp /home/hudson/jenkins-slave/workspace/hbase-0.95-on-hadoop2/0.95-on-hadoop2/hbase-server/target/surefire/surefire_215507719102418682439tmp
Running org.apache.hadoop.hbase.master.handler.TestTableDeleteFamilyHandler
Tests run: 1, Failures: 0, Errors: 0, Skipped: 0, Time elapsed: 33.061 sec
Forking command line: /bin/sh -c cd /home/hudson/jenkins-slave/workspace/hbase-0.95-on-hadoop2/0.95-on-hadoop2/hbase-server && /home/hudson/tools/java/jdk1.6.0_45-32/jre/bin/java -enableassertions -Xmx1900m -Djava.security.egd=file:/dev/./urandom -Djava.net.preferIPv4Stack=true -jar /home/hudson/jenkins-slave/workspace/hbase-0.95-on-hadoop2/0.95-on-hadoop2/hbase-server/target/surefire/surefirebooter3366219855122275716.jar /home/hudson/jenkins-slave/workspace/hbase-0.95-on-hadoop2/0.95-on-hadoop2/hbase-server/target/surefire/surefire2510093963614880417tmp /home/hudson/jenkins-slave/workspace/hbase-0.95-on-hadoop2/0.95-on-hadoop2/hbase-server/target/surefire/surefire_2164983450609811505236tmp
Running org.apache.hadoop.hbase.master.TestMasterTransitions
Tests run: 3, Failures: 0, Errors: 0, Skipped: 3, Time elapsed: 16.863 sec
Forking command line: /bin/sh -c cd /home/hudson/jenkins-slave/workspace/hbase-0.95-on-hadoop2/0.95-on-hadoop2/hbase-server && /home/hudson/tools/java/jdk1.6.0_45-32/jre/bin/java -enableassertions -Xmx1900m -Djava.security.egd=file:/dev/./urandom -Djava.net.preferIPv4Stack=true -jar /home/hudson/jenkins-slave/workspace/hbase-0.95-on-hadoop2/0.95-on-hadoop2/hbase-server/target/surefire/surefirebooter1872247966340200584.jar /home/hudson/jenkins-slave/workspace/hbase-0.95-on-hadoop2/0.95-on-hadoop2/hbase-server/target/surefire/surefire2889311763330953893tmp /home/hudson/jenkins-slave/workspace/hbase-0.95-on-hadoop2/0.95-on-hadoop2/hbase-server/target/surefire/surefire_2175784050010978457938tmp
Running org.apache.hadoop.hbase.master.TestOpenedRegionHandler
Tests run: 2, Failures: 0, Errors: 0, Skipped: 0, Time elapsed: 16.064 sec
Forking command line: /bin/sh -c cd /home/hudson/jenkins-slave/workspace/hbase-0.95-on-hadoop2/0.95-on-hadoop2/hbase-server && /home/hudson/tools/java/jdk1.6.0_45-32/jre/bin/java -enableassertions -Xmx1900m -Djava.security.egd=file:/dev/./urandom -Djava.net.preferIPv4Stack=true -jar /home/hudson/jenkins-slave/workspace/hbase-0.95-on-hadoop2/0.95-on-hadoop2/hbase-server/target/surefire/surefirebooter7420931386497139459.jar /home/hudson/jenkins-slave/workspace/hbase-0.95-on-hadoop2/0.95-on-hadoop2/hbase-server/target/surefire/surefire849441339380834407tmp /home/hudson/jenkins-slave/workspace/hbase-0.95-on-hadoop2/0.95-on-hadoop2/hbase-server/target/surefire/surefire_2181867280922581406018tmp
Running org.apache.hadoop.hbase.master.TestMaster
Tests run: 4, Failures: 0, Errors: 0, Skipped: 0, Time elapsed: 23.608 sec
Forking command line: /bin/sh -c cd /home/hudson/jenkins-slave/workspace/hbase-0.95-on-hadoop2/0.95-on-hadoop2/hbase-server && /home/hudson/tools/java/jdk1.6.0_45-32/jre/bin/java -enableassertions -Xmx1900m -Djava.security.egd=file:/dev/./urandom -Djava.net.preferIPv4Stack=true -jar /home/hudson/jenkins-slave/workspace/hbase-0.95-on-hadoop2/0.95-on-hadoop2/hbase-server/target/surefire/surefirebooter6627575585546420097.jar /home/hudson/jenkins-slave/workspace/hbase-0.95-on-hadoop2/0.95-on-hadoop2/hbase-server/target/surefire/surefire7908606037741874756tmp /home/hudson/jenkins-slave/workspace/hbase-0.95-on-hadoop2/0.95-on-hadoop2/hbase-server/target/surefire/surefire_2192614078432131372812tmp
Running org.apache.hadoop.hbase.master.snapshot.TestSnapshotFileCache
Tests run: 4, Failures: 0, Errors: 0, Skipped: 0, Time elapsed: 9.478 sec
Forking command line: /bin/sh -c cd /home/hudson/jenkins-slave/workspace/hbase-0.95-on-hadoop2/0.95-on-hadoop2/hbase-server && /home/hudson/tools/java/jdk1.6.0_45-32/jre/bin/java -enableassertions -Xmx1900m -Djava.security.egd=file:/dev/./urandom -Djava.net.preferIPv4Stack=true -jar /home/hudson/jenkins-slave/workspace/hbase-0.95-on-hadoop2/0.95-on-hadoop2/hbase-server/target/surefire/surefirebooter4190399016872786629.jar /home/hudson/jenkins-slave/workspace/hbase-0.95-on-hadoop2/0.95-on-hadoop2/hbase-server/target/surefire/surefire6123646715145512593tmp /home/hudson/jenkins-slave/workspace/hbase-0.95-on-hadoop2/0.95-on-hadoop2/hbase-server/target/surefire/surefire_2207503603481414961502tmp
Running org.apache.hadoop.hbase.master.TestMasterMetricsWrapper
Tests run: 1, Failures: 0, Errors: 0, Skipped: 0, Time elapsed: 10.699 sec
Forking command line: /bin/sh -c cd /home/hudson/jenkins-slave/workspace/hbase-0.95-on-hadoop2/0.95-on-hadoop2/hbase-server && /home/hudson/tools/java/jdk1.6.0_45-32/jre/bin/java -enableassertions -Xmx1900m -Djava.security.egd=file:/dev/./urandom -Djava.net.preferIPv4Stack=true -jar /home/hudson/jenkins-slave/workspace/hbase-0.95-on-hadoop2/0.95-on-hadoop2/hbase-server/target/surefire/surefirebooter1802168733723407525.jar /home/hudson/jenkins-slave/workspace/hbase-0.95-on-hadoop2/0.95-on-hadoop2/hbase-server/target/surefire/surefire631836300338215443tmp /home/hudson/jenkins-slave/workspace/hbase-0.95-on-hadoop2/0.95-on-hadoop2/hbase-server/target/surefire/surefire_2215522543391795303112tmp
Running org.apache.hadoop.hbase.master.TestMasterRestartAfterDisablingTable
Tests run: 1, Failures: 0, Errors: 0, Skipped: 0, Time elapsed: 14.675 sec
Forking command line: /bin/sh -c cd /home/hudson/jenkins-slave/workspace/hbase-0.95-on-hadoop2/0.95-on-hadoop2/hbase-server && /home/hudson/tools/java/jdk1.6.0_45-32/jre/bin/java -enableassertions -Xmx1900m -Djava.security.egd=file:/dev/./urandom -Djava.net.preferIPv4Stack=true -jar /home/hudson/jenkins-slave/workspace/hbase-0.95-on-hadoop2/0.95-on-hadoop2/hbase-server/target/surefire/surefirebooter905671444973835886.jar /home/hudson/jenkins-slave/workspace/hbase-0.95-on-hadoop2/0.95-on-hadoop2/hbase-server/target/surefire/surefire8205353332620742tmp /home/hudson/jenkins-slave/workspace/hbase-0.95-on-hadoop2/0.95-on-hadoop2/hbase-server/target/surefire/surefire_2224848729719062925922tmp
Running org.apache.hadoop.hbase.master.TestAssignmentManagerOnCluster
Tests run: 9, Failures: 0, Errors: 0, Skipped: 0, Time elapsed: 43.375 sec
Forking command line: /bin/sh -c cd /home/hudson/jenkins-slave/workspace/hbase-0.95-on-hadoop2/0.95-on-hadoop2/hbase-server && /home/hudson/tools/java/jdk1.6.0_45-32/jre/bin/java -enableassertions -Xmx1900m -Djava.security.egd=file:/dev/./urandom -Djava.net.preferIPv4Stack=true -jar /home/hudson/jenkins-slave/workspace/hbase-0.95-on-hadoop2/0.95-on-hadoop2/hbase-server/target/surefire/surefirebooter8678008349257520619.jar /home/hudson/jenkins-slave/workspace/hbase-0.95-on-hadoop2/0.95-on-hadoop2/hbase-server/target/surefire/surefire6397644956673311903tmp /home/hudson/jenkins-slave/workspace/hbase-0.95-on-hadoop2/0.95-on-hadoop2/hbase-server/target/surefire/surefire_2232981717491619849134tmp
Running org.apache.hadoop.hbase.master.TestAssignmentManager
Tests run: 15, Failures: 0, Errors: 0, Skipped: 0, Time elapsed: 5.409 sec
Forking command line: /bin/sh -c cd /home/hudson/jenkins-slave/workspace/hbase-0.95-on-hadoop2/0.95-on-hadoop2/hbase-server && /home/hudson/tools/java/jdk1.6.0_45-32/jre/bin/java -enableassertions -Xmx1900m -Djava.security.egd=file:/dev/./urandom -Djava.net.preferIPv4Stack=true -jar /home/hudson/jenkins-slave/workspace/hbase-0.95-on-hadoop2/0.95-on-hadoop2/hbase-server/target/surefire/surefirebooter8555121070916912415.jar /home/hudson/jenkins-slave/workspace/hbase-0.95-on-hadoop2/0.95-on-hadoop2/hbase-server/target/surefire/surefire6022619826251635751tmp /home/hudson/jenkins-slave/workspace/hbase-0.95-on-hadoop2/0.95-on-hadoop2/hbase-server/target/surefire/surefire_2244832238594092915261tmp
Running org.apache.hadoop.hbase.client.TestAdmin
Tests run: 43, Failures: 0, Errors: 0, Skipped: 0, Time elapsed: 455.597 sec
Forking command line: /bin/sh -c cd /home/hudson/jenkins-slave/workspace/hbase-0.95-on-hadoop2/0.95-on-hadoop2/hbase-server && /home/hudson/tools/java/jdk1.6.0_45-32/jre/bin/java -enableassertions -Xmx1900m -Djava.security.egd=file:/dev/./urandom -Djava.net.preferIPv4Stack=true -jar /home/hudson/jenkins-slave/workspace/hbase-0.95-on-hadoop2/0.95-on-hadoop2/hbase-server/target/surefire/surefirebooter2775384521081751648.jar /home/hudson/jenkins-slave/workspace/hbase-0.95-on-hadoop2/0.95-on-hadoop2/hbase-server/target/surefire/surefire3513885598782484536tmp /home/hudson/jenkins-slave/workspace/hbase-0.95-on-hadoop2/0.95-on-hadoop2/hbase-server/target/surefire/surefire_2258308496797770904844tmp
Running org.apache.hadoop.hbase.master.TestMasterStatusServlet
Tests run: 4, Failures: 0, Errors: 0, Skipped: 0, Time elapsed: 1.669 sec
Forking command line: /bin/sh -c cd /home/hudson/jenkins-slave/workspace/hbase-0.95-on-hadoop2/0.95-on-hadoop2/hbase-server && /home/hudson/tools/java/jdk1.6.0_45-32/jre/bin/java -enableassertions -Xmx1900m -Djava.security.egd=file:/dev/./urandom -Djava.net.preferIPv4Stack=true -jar /home/hudson/jenkins-slave/workspace/hbase-0.95-on-hadoop2/0.95-on-hadoop2/hbase-server/target/surefire/surefirebooter5693191712257306512.jar /home/hudson/jenkins-slave/workspace/hbase-0.95-on-hadoop2/0.95-on-hadoop2/hbase-server/target/surefire/surefire734331395521927161tmp /home/hudson/jenkins-slave/workspace/hbase-0.95-on-hadoop2/0.95-on-hadoop2/hbase-server/target/surefire/surefire_2262200528625420342255tmp
Running org.apache.hadoop.hbase.master.TestHMasterRPCException
Tests run: 1, Failures: 0, Errors: 0, Skipped: 0, Time elapsed: 2.575 sec
Forking command line: /bin/sh -c cd /home/hudson/jenkins-slave/workspace/hbase-0.95-on-hadoop2/0.95-on-hadoop2/hbase-server && /home/hudson/tools/java/jdk1.6.0_45-32/jre/bin/java -enableassertions -Xmx1900m -Djava.security.egd=file:/dev/./urandom -Djava.net.preferIPv4Stack=true -jar /home/hudson/jenkins-slave/workspace/hbase-0.95-on-hadoop2/0.95-on-hadoop2/hbase-server/target/surefire/surefirebooter73608928230519889.jar /home/hudson/jenkins-slave/workspace/hbase-0.95-on-hadoop2/0.95-on-hadoop2/hbase-server/target/surefire/surefire5182668043330885181tmp /home/hudson/jenkins-slave/workspace/hbase-0.95-on-hadoop2/0.95-on-hadoop2/hbase-server/target/surefire/surefire_2273365611603890392152tmp
Running org.apache.hadoop.hbase.master.TestSplitLogManager
Tests run: 13, Failures: 0, Errors: 0, Skipped: 0, Time elapsed: 87.49 sec
Forking command line: /bin/sh -c cd /home/hudson/jenkins-slave/workspace/hbase-0.95-on-hadoop2/0.95-on-hadoop2/hbase-server && /home/hudson/tools/java/jdk1.6.0_45-32/jre/bin/java -enableassertions -Xmx1900m -Djava.security.egd=file:/dev/./urandom -Djava.net.preferIPv4Stack=true -jar /home/hudson/jenkins-slave/workspace/hbase-0.95-on-hadoop2/0.95-on-hadoop2/hbase-server/target/surefire/surefirebooter6931069497277102474.jar /home/hudson/jenkins-slave/workspace/hbase-0.95-on-hadoop2/0.95-on-hadoop2/hbase-server/target/surefire/surefire745151366374490848tmp /home/hudson/jenkins-slave/workspace/hbase-0.95-on-hadoop2/0.95-on-hadoop2/hbase-server/target/surefire/surefire_2286549658637433944056tmp
Running org.apache.hadoop.hbase.master.TestMasterShutdown
Tests run: 2, Failures: 0, Errors: 0, Skipped: 0, Time elapsed: 19.755 sec
Forking command line: /bin/sh -c cd /home/hudson/jenkins-slave/workspace/hbase-0.95-on-hadoop2/0.95-on-hadoop2/hbase-server && /home/hudson/tools/java/jdk1.6.0_45-32/jre/bin/java -enableassertions -Xmx1900m -Djava.security.egd=file:/dev/./urandom -Djava.net.preferIPv4Stack=true -jar /home/hudson/jenkins-slave/workspace/hbase-0.95-on-hadoop2/0.95-on-hadoop2/hbase-server/target/surefire/surefirebooter6404044507324185987.jar /home/hudson/jenkins-slave/workspace/hbase-0.95-on-hadoop2/0.95-on-hadoop2/hbase-server/target/surefire/surefire8318298273250963982tmp /home/hudson/jenkins-slave/workspace/hbase-0.95-on-hadoop2/0.95-on-hadoop2/hbase-server/target/surefire/surefire_2297399902399421718962tmp
Running org.apache.hadoop.hbase.master.balancer.TestStochasticLoadBalancer
Tests run: 12, Failures: 0, Errors: 0, Skipped: 0, Time elapsed: 192.025 sec
Forking command line: /bin/sh -c cd /home/hudson/jenkins-slave/workspace/hbase-0.95-on-hadoop2/0.95-on-hadoop2/hbase-server && /home/hudson/tools/java/jdk1.6.0_45-32/jre/bin/java -enableassertions -Xmx1900m -Djava.security.egd=file:/dev/./urandom -Djava.net.preferIPv4Stack=true -jar /home/hudson/jenkins-slave/workspace/hbase-0.95-on-hadoop2/0.95-on-hadoop2/hbase-server/target/surefire/surefirebooter4425282877297471858.jar /home/hudson/jenkins-slave/workspace/hbase-0.95-on-hadoop2/0.95-on-hadoop2/hbase-server/target/surefire/surefire2497060682485861620tmp /home/hudson/jenkins-slave/workspace/hbase-0.95-on-hadoop2/0.95-on-hadoop2/hbase-server/target/surefire/surefire_2302753891111395914418tmp
Running org.apache.hadoop.hbase.master.cleaner.TestHFileCleaner
Tests run: 3, Failures: 0, Errors: 0, Skipped: 0, Time elapsed: 8.499 sec
Forking command line: /bin/sh -c cd /home/hudson/jenkins-slave/workspace/hbase-0.95-on-hadoop2/0.95-on-hadoop2/hbase-server && /home/hudson/tools/java/jdk1.6.0_45-32/jre/bin/java -enableassertions -Xmx1900m -Djava.security.egd=file:/dev/./urandom -Djava.net.preferIPv4Stack=true -jar /home/hudson/jenkins-slave/workspace/hbase-0.95-on-hadoop2/0.95-on-hadoop2/hbase-server/target/surefire/surefirebooter8451128810535846830.jar /home/hudson/jenkins-slave/workspace/hbase-0.95-on-hadoop2/0.95-on-hadoop2/hbase-server/target/surefire/surefire6982125237328238777tmp /home/hudson/jenkins-slave/workspace/hbase-0.95-on-hadoop2/0.95-on-hadoop2/hbase-server/target/surefire/surefire_2311655081052615969301tmp
Running org.apache.hadoop.hbase.master.cleaner.TestLogsCleaner
Tests run: 1, Failures: 0, Errors: 0, Skipped: 0, Time elapsed: 11.908 sec
Forking command line: /bin/sh -c cd /home/hudson/jenkins-slave/workspace/hbase-0.95-on-hadoop2/0.95-on-hadoop2/hbase-server && /home/hudson/tools/java/jdk1.6.0_45-32/jre/bin/java -enableassertions -Xmx1900m -Djava.security.egd=file:/dev/./urandom -Djava.net.preferIPv4Stack=true -jar /home/hudson/jenkins-slave/workspace/hbase-0.95-on-hadoop2/0.95-on-hadoop2/hbase-server/target/surefire/surefirebooter3450902412676887482.jar /home/hudson/jenkins-slave/workspace/hbase-0.95-on-hadoop2/0.95-on-hadoop2/hbase-server/target/surefire/surefire3795840707497313192tmp /home/hudson/jenkins-slave/workspace/hbase-0.95-on-hadoop2/0.95-on-hadoop2/hbase-server/target/surefire/surefire_2329153121303275904023tmp
Running org.apache.hadoop.hbase.master.TestClusterStatusPublisher
Tests run: 3, Failures: 0, Errors: 0, Skipped: 0, Time elapsed: 0.315 sec
Forking command line: /bin/sh -c cd /home/hudson/jenkins-slave/workspace/hbase-0.95-on-hadoop2/0.95-on-hadoop2/hbase-server && /home/hudson/tools/java/jdk1.6.0_45-32/jre/bin/java -enableassertions -Xmx1900m -Djava.security.egd=file:/dev/./urandom -Djava.net.preferIPv4Stack=true -jar /home/hudson/jenkins-slave/workspace/hbase-0.95-on-hadoop2/0.95-on-hadoop2/hbase-server/target/surefire/surefirebooter3600399584742148891.jar /home/hudson/jenkins-slave/workspace/hbase-0.95-on-hadoop2/0.95-on-hadoop2/hbase-server/target/surefire/surefire4643350054645879883tmp /home/hudson/jenkins-slave/workspace/hbase-0.95-on-hadoop2/0.95-on-hadoop2/hbase-server/target/surefire/surefire_233424419641075486431tmp
Running org.apache.hadoop.hbase.master.TestMasterFailover
Tests run: 4, Failures: 0, Errors: 0, Skipped: 0, Time elapsed: 55.149 sec
Forking command line: /bin/sh -c cd /home/hudson/jenkins-slave/workspace/hbase-0.95-on-hadoop2/0.95-on-hadoop2/hbase-server && /home/hudson/tools/java/jdk1.6.0_45-32/jre/bin/java -enableassertions -Xmx1900m -Djava.security.egd=file:/dev/./urandom -Djava.net.preferIPv4Stack=true -jar /home/hudson/jenkins-slave/workspace/hbase-0.95-on-hadoop2/0.95-on-hadoop2/hbase-server/target/surefire/surefirebooter7933963030376366171.jar /home/hudson/jenkins-slave/workspace/hbase-0.95-on-hadoop2/0.95-on-hadoop2/hbase-server/target/surefire/surefire3627116950421546532tmp /home/hudson/jenkins-slave/workspace/hbase-0.95-on-hadoop2/0.95-on-hadoop2/hbase-server/target/surefire/surefire_2343785953609449997952tmp
Running org.apache.hadoop.hbase.master.TestMasterFailoverBalancerPersistence
Tests run: 1, Failures: 0, Errors: 0, Skipped: 0, Time elapsed: 17.996 sec
Forking command line: /bin/sh -c cd /home/hudson/jenkins-slave/workspace/hbase-0.95-on-hadoop2/0.95-on-hadoop2/hbase-server && /home/hudson/tools/java/jdk1.6.0_45-32/jre/bin/java -enableassertions -Xmx1900m -Djava.security.egd=file:/dev/./urandom -Djava.net.preferIPv4Stack=true -jar /home/hudson/jenkins-slave/workspace/hbase-0.95-on-hadoop2/0.95-on-hadoop2/hbase-server/target/surefire/surefirebooter6038375627810766829.jar /home/hudson/jenkins-slave/workspace/hbase-0.95-on-hadoop2/0.95-on-hadoop2/hbase-server/target/surefire/surefire7603406870875848353tmp /home/hudson/jenkins-slave/workspace/hbase-0.95-on-hadoop2/0.95-on-hadoop2/hbase-server/target/surefire/surefire_23560429218019330822tmp
Running org.apache.hadoop.hbase.master.cleaner.TestSnapshotFromMaster
Tests run: 4, Failures: 0, Errors: 0, Skipped: 0, Time elapsed: 29.777 sec
Forking command line: /bin/sh -c cd /home/hudson/jenkins-slave/workspace/hbase-0.95-on-hadoop2/0.95-on-hadoop2/hbase-server && /home/hudson/tools/java/jdk1.6.0_45-32/jre/bin/java -enableassertions -Xmx1900m -Djava.security.egd=file:/dev/./urandom -Djava.net.preferIPv4Stack=true -jar /home/hudson/jenkins-slave/workspace/hbase-0.95-on-hadoop2/0.95-on-hadoop2/hbase-server/target/surefire/surefirebooter3712678905893541804.jar /home/hudson/jenkins-slave/workspace/hbase-0.95-on-hadoop2/0.95-on-hadoop2/hbase-server/target/surefire/surefire2410615307685429737tmp /home/hudson/jenkins-slave/workspace/hbase-0.95-on-hadoop2/0.95-on-hadoop2/hbase-server/target/surefire/surefire_2364786433171992077168tmp
Running org.apache.hadoop.hbase.master.TestRestartCluster
Tests run: 2, Failures: 0, Errors: 0, Skipped: 0, Time elapsed: 35.085 sec
Forking command line: /bin/sh -c cd /home/hudson/jenkins-slave/workspace/hbase-0.95-on-hadoop2/0.95-on-hadoop2/hbase-server && /home/hudson/tools/java/jdk1.6.0_45-32/jre/bin/java -enableassertions -Xmx1900m -Djava.security.egd=file:/dev/./urandom -Djava.net.preferIPv4Stack=true -jar /home/hudson/jenkins-slave/workspace/hbase-0.95-on-hadoop2/0.95-on-hadoop2/hbase-server/target/surefire/surefirebooter1945768769412998627.jar /home/hudson/jenkins-slave/workspace/hbase-0.95-on-hadoop2/0.95-on-hadoop2/hbase-server/target/surefire/surefire5352260270221680909tmp /home/hudson/jenkins-slave/workspace/hbase-0.95-on-hadoop2/0.95-on-hadoop2/hbase-server/target/surefire/surefire_2374912563866771825520tmp
Running org.apache.hadoop.hbase.TestRegionRebalancing
Tests run: 2, Failures: 0, Errors: 0, Skipped: 0, Time elapsed: 45.196 sec
Forking command line: /bin/sh -c cd /home/hudson/jenkins-slave/workspace/hbase-0.95-on-hadoop2/0.95-on-hadoop2/hbase-server && /home/hudson/tools/java/jdk1.6.0_45-32/jre/bin/java -enableassertions -Xmx1900m -Djava.security.egd=file:/dev/./urandom -Djava.net.preferIPv4Stack=true -jar /home/hudson/jenkins-slave/workspace/hbase-0.95-on-hadoop2/0.95-on-hadoop2/hbase-server/target/surefire/surefirebooter702566059813327248.jar /home/hudson/jenkins-slave/workspace/hbase-0.95-on-hadoop2/0.95-on-hadoop2/hbase-server/target/surefire/surefire2582194145055031292tmp /home/hudson/jenkins-slave/workspace/hbase-0.95-on-hadoop2/0.95-on-hadoop2/hbase-server/target/surefire/surefire_2382031267926380761034tmp
Running org.apache.hadoop.hbase.TestZooKeeper
Tests run: 10, Failures: 0, Errors: 0, Skipped: 0, Time elapsed: 29.834 sec
Running org.apache.hadoop.hbase.ipc.TestProtoBufRpc
Tests run: 1, Failures: 0, Errors: 0, Skipped: 0, Time elapsed: 1.61 sec
Forking command line: /bin/sh -c cd /home/hudson/jenkins-slave/workspace/hbase-0.95-on-hadoop2/0.95-on-hadoop2/hbase-server && /home/hudson/tools/java/jdk1.6.0_45-32/jre/bin/java -enableassertions -Xmx1900m -Djava.security.egd=file:/dev/./urandom -Djava.net.preferIPv4Stack=true -jar /home/hudson/jenkins-slave/workspace/hbase-0.95-on-hadoop2/0.95-on-hadoop2/hbase-server/target/surefire/surefirebooter4902633452806738768.jar /home/hudson/jenkins-slave/workspace/hbase-0.95-on-hadoop2/0.95-on-hadoop2/hbase-server/target/surefire/surefire4495331480200748241tmp /home/hudson/jenkins-slave/workspace/hbase-0.95-on-hadoop2/0.95-on-hadoop2/hbase-server/target/surefire/surefire_2396734990166175638035tmp
Forking command line: /bin/sh -c cd /home/hudson/jenkins-slave/workspace/hbase-0.95-on-hadoop2/0.95-on-hadoop2/hbase-server && /home/hudson/tools/java/jdk1.6.0_45-32/jre/bin/java -enableassertions -Xmx1900m -Djava.security.egd=file:/dev/./urandom -Djava.net.preferIPv4Stack=true -jar /home/hudson/jenkins-slave/workspace/hbase-0.95-on-hadoop2/0.95-on-hadoop2/hbase-server/target/surefire/surefirebooter461027003272853784.jar /home/hudson/jenkins-slave/workspace/hbase-0.95-on-hadoop2/0.95-on-hadoop2/hbase-server/target/surefire/surefire7050484879393843580tmp /home/hudson/jenkins-slave/workspace/hbase-0.95-on-hadoop2/0.95-on-hadoop2/hbase-server/target/surefire/surefire_2406809899246127802764tmp
Running org.apache.hadoop.hbase.ipc.TestHBaseClient
Tests run: 1, Failures: 0, Errors: 0, Skipped: 0, Time elapsed: 0.332 sec
Forking command line: /bin/sh -c cd /home/hudson/jenkins-slave/workspace/hbase-0.95-on-hadoop2/0.95-on-hadoop2/hbase-server && /home/hudson/tools/java/jdk1.6.0_45-32/jre/bin/java -enableassertions -Xmx1900m -Djava.security.egd=file:/dev/./urandom -Djava.net.preferIPv4Stack=true -jar /home/hudson/jenkins-slave/workspace/hbase-0.95-on-hadoop2/0.95-on-hadoop2/hbase-server/target/surefire/surefirebooter6080107232450073003.jar /home/hudson/jenkins-slave/workspace/hbase-0.95-on-hadoop2/0.95-on-hadoop2/hbase-server/target/surefire/surefire5716834371279214838tmp /home/hudson/jenkins-slave/workspace/hbase-0.95-on-hadoop2/0.95-on-hadoop2/hbase-server/target/surefire/surefire_2415611500425290754740tmp
Running org.apache.hadoop.hbase.ipc.TestDelayedRpc
Tests run: 4, Failures: 0, Errors: 0, Skipped: 0, Time elapsed: 4.005 sec
Forking command line: /bin/sh -c cd /home/hudson/jenkins-slave/workspace/hbase-0.95-on-hadoop2/0.95-on-hadoop2/hbase-server && /home/hudson/tools/java/jdk1.6.0_45-32/jre/bin/java -enableassertions -Xmx1900m -Djava.security.egd=file:/dev/./urandom -Djava.net.preferIPv4Stack=true -jar /home/hudson/jenkins-slave/workspace/hbase-0.95-on-hadoop2/0.95-on-hadoop2/hbase-server/target/surefire/surefirebooter2077288388581429621.jar /home/hudson/jenkins-slave/workspace/hbase-0.95-on-hadoop2/0.95-on-hadoop2/hbase-server/target/surefire/surefire2243113944500072096tmp /home/hudson/jenkins-slave/workspace/hbase-0.95-on-hadoop2/0.95-on-hadoop2/hbase-server/target/surefire/surefire_242429214947468195172tmp
Running org.apache.hadoop.hbase.thrift2.TestThriftHBaseServiceHandler
Tests run: 12, Failures: 0, Errors: 0, Skipped: 0, Time elapsed: 16.305 sec
Forking command line: /bin/sh -c cd /home/hudson/jenkins-slave/workspace/hbase-0.95-on-hadoop2/0.95-on-hadoop2/hbase-server && /home/hudson/tools/java/jdk1.6.0_45-32/jre/bin/java -enableassertions -Xmx1900m -Djava.security.egd=file:/dev/./urandom -Djava.net.preferIPv4Stack=true -jar /home/hudson/jenkins-slave/workspace/hbase-0.95-on-hadoop2/0.95-on-hadoop2/hbase-server/target/surefire/surefirebooter1137111810028481417.jar /home/hudson/jenkins-slave/workspace/hbase-0.95-on-hadoop2/0.95-on-hadoop2/hbase-server/target/surefire/surefire7201964531551346557tmp /home/hudson/jenkins-slave/workspace/hbase-0.95-on-hadoop2/0.95-on-hadoop2/hbase-server/target/surefire/surefire_2434428292671274646459tmp
Running org.apache.hadoop.hbase.TestInfoServers
Tests run: 3, Failures: 0, Errors: 0, Skipped: 0, Time elapsed: 16.661 sec
Forking command line: /bin/sh -c cd /home/hudson/jenkins-slave/workspace/hbase-0.95-on-hadoop2/0.95-on-hadoop2/hbase-server && /home/hudson/tools/java/jdk1.6.0_45-32/jre/bin/java -enableassertions -Xmx1900m -Djava.security.egd=file:/dev/./urandom -Djava.net.preferIPv4Stack=true -jar /home/hudson/jenkins-slave/workspace/hbase-0.95-on-hadoop2/0.95-on-hadoop2/hbase-server/target/surefire/surefirebooter4753643700339230395.jar /home/hudson/jenkins-slave/workspace/hbase-0.95-on-hadoop2/0.95-on-hadoop2/hbase-server/target/surefire/surefire2422343823317113055tmp /home/hudson/jenkins-slave/workspace/hbase-0.95-on-hadoop2/0.95-on-hadoop2/hbase-server/target/surefire/surefire_2442459847299931462tmp
Running org.apache.hadoop.hbase.procedure.TestZKProcedureControllers
Tests run: 4, Failures: 0, Errors: 0, Skipped: 0, Time elapsed: 3.023 sec
Forking command line: /bin/sh -c cd /home/hudson/jenkins-slave/workspace/hbase-0.95-on-hadoop2/0.95-on-hadoop2/hbase-server && /home/hudson/tools/java/jdk1.6.0_45-32/jre/bin/java -enableassertions -Xmx1900m -Djava.security.egd=file:/dev/./urandom -Djava.net.preferIPv4Stack=true -jar /home/hudson/jenkins-slave/workspace/hbase-0.95-on-hadoop2/0.95-on-hadoop2/hbase-server/target/surefire/surefirebooter8629548623168736074.jar /home/hudson/jenkins-slave/workspace/hbase-0.95-on-hadoop2/0.95-on-hadoop2/hbase-server/target/surefire/surefire7523499705625651399tmp /home/hudson/jenkins-slave/workspace/hbase-0.95-on-hadoop2/0.95-on-hadoop2/hbase-server/target/surefire/surefire_245990834289455735934tmp
Running org.apache.hadoop.hbase.procedure.TestZKProcedure
Tests run: 4, Failures: 0, Errors: 0, Skipped: 0, Time elapsed: 3.168 sec
Running org.apache.hadoop.hbase.master.TestTableLockManager
Tests run: 5, Failures: 0, Errors: 0, Skipped: 0, Time elapsed: 205.897 sec
Running org.apache.hadoop.hbase.TestAcidGuarantees
Tests run: 3, Failures: 0, Errors: 0, Skipped: 0, Time elapsed: 91.28 sec
Running org.apache.hadoop.hbase.TestIOFencing
Tests run: 2, Failures: 0, Errors: 0, Skipped: 0, Time elapsed: 94.056 sec

Results :

Failed tests:   testCopyTable(org.apache.hadoop.hbase.mapreduce.TestCopyTable): expected:<0> but was:<1>
  testWALPlayer(org.apache.hadoop.hbase.mapreduce.TestWALPlayer): expected:<0> but was:<1>
  testExcludeAllFromMinorCompaction(org.apache.hadoop.hbase.mapreduce.TestHFileOutputFormat)
  testSimpleCase(org.apache.hadoop.hbase.mapreduce.TestImportExport)

Tests in error: 
  testReadLockExcludesWriters(org.apache.hadoop.hbase.zookeeper.lock.TestZKInterProcessReadWriteLock): test timed out after 3000 milliseconds
  testCorrectnessWhenMasterFailOver(org.apache.hadoop.hbase.regionserver.TestRSKilledWhenMasterInitializing): test timed out after 120000 milliseconds

Tests run: 1445, Failures: 4, Errors: 2, Skipped: 14

[INFO]                                                                         
[INFO] ------------------------------------------------------------------------
[INFO] Skipping HBase
[INFO] This project has been banned from the build due to previous failures.
[INFO] ------------------------------------------------------------------------
[INFO] ------------------------------------------------------------------------
[INFO] Reactor Summary:
[INFO] 
[INFO] HBase ............................................. SUCCESS [11.287s]
[INFO] HBase - Common .................................... SUCCESS [27.943s]
[INFO] HBase - Protocol .................................. SUCCESS [15.815s]
[INFO] HBase - Client .................................... SUCCESS [9.524s]
[INFO] HBase - Prefix Tree ............................... SUCCESS [3.756s]
[INFO] HBase - Hadoop Compatibility ...................... SUCCESS [5.429s]
[INFO] HBase - Hadoop Two Compatibility .................. SUCCESS [3.804s]
[INFO] HBase - Server .................................... FAILURE [1:07:59.608s]
[INFO] HBase - Integration Tests ......................... SKIPPED
[INFO] HBase - Examples .................................. SKIPPED
[INFO] HBase - Assembly .................................. SKIPPED
[INFO] ------------------------------------------------------------------------
[INFO] BUILD FAILURE
[INFO] ------------------------------------------------------------------------
[INFO] Total time: 1:09:22.050s
[INFO] Finished at: Wed Jun 19 00:43:08 UTC 2013
[INFO] Final Memory: 112M/396M
[INFO] ------------------------------------------------------------------------
[ERROR] Failed to execute goal org.apache.maven.plugins:maven-surefire-plugin:2.12-TRUNK-HBASE-2:test (secondPartTestsExecution) on project hbase-server: Failure or timeout -> [Help 1]
org.apache.maven.lifecycle.LifecycleExecutionException: Failed to execute goal org.apache.maven.plugins:maven-surefire-plugin:2.12-TRUNK-HBASE-2:test (secondPartTestsExecution) on project hbase-server: Failure or timeout
	at org.apache.maven.lifecycle.internal.MojoExecutor.execute(MojoExecutor.java:217)
	at org.apache.maven.lifecycle.internal.MojoExecutor.execute(MojoExecutor.java:153)
	at org.apache.maven.lifecycle.internal.MojoExecutor.execute(MojoExecutor.java:145)
	at org.apache.maven.lifecycle.internal.LifecycleModuleBuilder.buildProject(LifecycleModuleBuilder.java:84)
	at org.apache.maven.lifecycle.internal.LifecycleModuleBuilder.buildProject(LifecycleModuleBuilder.java:59)
	at org.apache.maven.lifecycle.internal.LifecycleStarter.singleThreadedBuild(LifecycleStarter.java:183)
	at org.apache.maven.lifecycle.internal.LifecycleStarter.execute(LifecycleStarter.java:161)
	at org.apache.maven.DefaultMaven.doExecute(DefaultMaven.java:320)
	at org.apache.maven.DefaultMaven.execute(DefaultMaven.java:156)
	at org.apache.maven.cli.MavenCli.execute(MavenCli.java:537)
	at org.apache.maven.cli.MavenCli.doMain(MavenCli.java:196)
	at org.apache.maven.cli.MavenCli.main(MavenCli.java:141)
	at sun.reflect.NativeMethodAccessorImpl.invoke0(Native Method)
	at sun.reflect.NativeMethodAccessorImpl.invoke(NativeMethodAccessorImpl.java:39)
	at sun.reflect.DelegatingMethodAccessorImpl.invoke(DelegatingMethodAccessorImpl.java:25)
	at java.lang.reflect.Method.invoke(Method.java:597)
	at org.codehaus.plexus.classworlds.launcher.Launcher.launchEnhanced(Launcher.java:290)
	at org.codehaus.plexus.classworlds.launcher.Launcher.launch(Launcher.java:230)
	at org.codehaus.plexus.classworlds.launcher.Launcher.mainWithExitCode(Launcher.java:409)
	at org.codehaus.plexus.classworlds.launcher.Launcher.main(Launcher.java:352)
Caused by: org.apache.maven.plugin.MojoExecutionException: Failure or timeout
	at org.apache.maven.plugin.surefire.SurefirePlugin.assertNoFailureOrTimeout(SurefirePlugin.java:643)
	at org.apache.maven.plugin.surefire.SurefirePlugin.handleSummary(SurefirePlugin.java:624)
	at org.apache.maven.plugin.surefire.AbstractSurefireMojo.executeAfterPreconditionsChecked(AbstractSurefireMojo.java:137)
	at org.apache.maven.plugin.surefire.AbstractSurefireMojo.execute(AbstractSurefireMojo.java:98)
	at org.apache.maven.plugin.DefaultBuildPluginManager.executeMojo(DefaultBuildPluginManager.java:101)
	at org.apache.maven.lifecycle.internal.MojoExecutor.execute(MojoExecutor.java:209)
	... 19 more
[ERROR] 
[ERROR] 
[ERROR] For more information about the errors and possible solutions, please read the following articles:
[ERROR] [Help 1] http://cwiki.apache.org/confluence/display/MAVEN/MojoExecutionException
[ERROR] 
[ERROR] After correcting the problems, you can resume the build with the command
[ERROR]   mvn <goals> -rf :hbase-server
Build step 'Invoke top-level Maven targets' marked build as failure
Archiving artifacts
Recording test results
Updating HBASE-8665
Updating HBASE-8453

Mime
View raw message