hbase-dev mailing list archives

Site index · List index
Message view « Date » · « Thread »
Top « Date » · « Thread »
From Apache Jenkins Server <jenk...@builds.apache.org>
Subject Build failed in Jenkins: hbase-0.95 #255
Date Thu, 20 Jun 2013 09:15:11 GMT
See <https://builds.apache.org/job/hbase-0.95/255/changes>

Changes:

[Gary Helmling] Fix up RPC handling

------------------------------------------
[...truncated 3967 lines...]
Running org.apache.hadoop.hbase.master.TestMasterMetrics
Tests run: 2, Failures: 0, Errors: 0, Skipped: 0, Time elapsed: 9.546 sec
Running org.apache.hadoop.hbase.master.TestMasterNoCluster
Tests run: 4, Failures: 0, Errors: 0, Skipped: 0, Time elapsed: 10.238 sec
Java HotSpot(TM) 64-Bit Server VM warning: Insufficient space for shared memory file:
   /tmp/hsperfdata_jenkins/30041
Try using the -Djava.io.tmpdir= option to select an alternate temp location.
Java HotSpot(TM) 64-Bit Server VM warning: Insufficient space for shared memory file:
   /tmp/hsperfdata_jenkins/30058
Try using the -Djava.io.tmpdir= option to select an alternate temp location.
Running org.apache.hadoop.hbase.master.balancer.TestDefaultLoadBalancer
Tests run: 1, Failures: 0, Errors: 0, Skipped: 0, Time elapsed: 1.549 sec
Java HotSpot(TM) 64-Bit Server VM warning: Insufficient space for shared memory file:
   /tmp/hsperfdata_jenkins/30093
Try using the -Djava.io.tmpdir= option to select an alternate temp location.
Running org.apache.hadoop.hbase.master.balancer.TestBaseLoadBalancer
Tests run: 3, Failures: 0, Errors: 0, Skipped: 0, Time elapsed: 0.552 sec
Java HotSpot(TM) 64-Bit Server VM warning: Insufficient space for shared memory file:
   /tmp/hsperfdata_jenkins/30123
Try using the -Djava.io.tmpdir= option to select an alternate temp location.
Running org.apache.hadoop.hbase.master.TestZKBasedOpenCloseRegion
Tests run: 4, Failures: 0, Errors: 0, Skipped: 0, Time elapsed: 20.69 sec
Java HotSpot(TM) 64-Bit Server VM warning: Insufficient space for shared memory file:
   /tmp/hsperfdata_jenkins/31014
Try using the -Djava.io.tmpdir= option to select an alternate temp location.
Running org.apache.hadoop.hbase.master.TestMasterFileSystem
Tests run: 2, Failures: 0, Errors: 0, Skipped: 0, Time elapsed: 11.704 sec
Java HotSpot(TM) 64-Bit Server VM warning: Insufficient space for shared memory file:
   /tmp/hsperfdata_jenkins/31237
Try using the -Djava.io.tmpdir= option to select an alternate temp location.
Running org.apache.hadoop.hbase.master.handler.TestTableDeleteFamilyHandler
Tests run: 1, Failures: 0, Errors: 0, Skipped: 0, Time elapsed: 45.559 sec
Java HotSpot(TM) 64-Bit Server VM warning: Insufficient space for shared memory file:
   /tmp/hsperfdata_jenkins/32491
Try using the -Djava.io.tmpdir= option to select an alternate temp location.
Running org.apache.hadoop.hbase.master.handler.TestCreateTableHandler
Tests run: 2, Failures: 0, Errors: 0, Skipped: 0, Time elapsed: 25.163 sec
Java HotSpot(TM) 64-Bit Server VM warning: Insufficient space for shared memory file:
   /tmp/hsperfdata_jenkins/536
Try using the -Djava.io.tmpdir= option to select an alternate temp location.
Running org.apache.hadoop.hbase.master.balancer.TestStochasticLoadBalancer
Tests run: 12, Failures: 0, Errors: 0, Skipped: 0, Time elapsed: 126.91 sec
Java HotSpot(TM) 64-Bit Server VM warning: Insufficient space for shared memory file:
   /tmp/hsperfdata_jenkins/854
Try using the -Djava.io.tmpdir= option to select an alternate temp location.
Running org.apache.hadoop.hbase.master.handler.TestTableDescriptorModification
Tests run: 3, Failures: 0, Errors: 0, Skipped: 0, Time elapsed: 23.282 sec
Java HotSpot(TM) 64-Bit Server VM warning: Insufficient space for shared memory file:
   /tmp/hsperfdata_jenkins/1005
Try using the -Djava.io.tmpdir= option to select an alternate temp location.
Running org.apache.hadoop.hbase.master.TestMasterTransitions
Tests run: 3, Failures: 0, Errors: 0, Skipped: 3, Time elapsed: 19.415 sec
Java HotSpot(TM) 64-Bit Server VM warning: Insufficient space for shared memory file:
   /tmp/hsperfdata_jenkins/2286
Try using the -Djava.io.tmpdir= option to select an alternate temp location.
Running org.apache.hadoop.hbase.master.TestMaster
Tests run: 4, Failures: 0, Errors: 0, Skipped: 0, Time elapsed: 25.803 sec
Java HotSpot(TM) 64-Bit Server VM warning: Insufficient space for shared memory file:
   /tmp/hsperfdata_jenkins/2315
Try using the -Djava.io.tmpdir= option to select an alternate temp location.
Running org.apache.hadoop.hbase.master.snapshot.TestSnapshotFileCache
Tests run: 4, Failures: 0, Errors: 0, Skipped: 0, Time elapsed: 5.919 sec
Running org.apache.hadoop.hbase.master.TestOpenedRegionHandler
Tests run: 2, Failures: 0, Errors: 0, Skipped: 0, Time elapsed: 16.093 sec
Java HotSpot(TM) 64-Bit Server VM warning: Insufficient space for shared memory file:
   /tmp/hsperfdata_jenkins/2697
Try using the -Djava.io.tmpdir= option to select an alternate temp location.
Java HotSpot(TM) 64-Bit Server VM warning: Insufficient space for shared memory file:
   /tmp/hsperfdata_jenkins/2855
Try using the -Djava.io.tmpdir= option to select an alternate temp location.
Running org.apache.hadoop.hbase.master.TestSplitLogManager
Tests run: 13, Failures: 0, Errors: 0, Skipped: 0, Time elapsed: 85.508 sec
Java HotSpot(TM) 64-Bit Server VM warning: Insufficient space for shared memory file:
   /tmp/hsperfdata_jenkins/3965
Try using the -Djava.io.tmpdir= option to select an alternate temp location.
Running org.apache.hadoop.hbase.master.TestAssignmentManagerOnCluster
Tests run: 9, Failures: 0, Errors: 0, Skipped: 0, Time elapsed: 49.151 sec
Java HotSpot(TM) 64-Bit Server VM warning: Insufficient space for shared memory file:
   /tmp/hsperfdata_jenkins/4054
Try using the -Djava.io.tmpdir= option to select an alternate temp location.
Running org.apache.hadoop.hbase.master.TestMasterMetricsWrapper
Tests run: 1, Failures: 0, Errors: 0, Skipped: 0, Time elapsed: 18.668 sec
Java HotSpot(TM) 64-Bit Server VM warning: Insufficient space for shared memory file:
   /tmp/hsperfdata_jenkins/4758
Try using the -Djava.io.tmpdir= option to select an alternate temp location.
Running org.apache.hadoop.hbase.master.TestMasterRestartAfterDisablingTable
Tests run: 1, Failures: 0, Errors: 0, Skipped: 0, Time elapsed: 22.984 sec
Java HotSpot(TM) 64-Bit Server VM warning: Insufficient space for shared memory file:
   /tmp/hsperfdata_jenkins/5169
Try using the -Djava.io.tmpdir= option to select an alternate temp location.
Running org.apache.hadoop.hbase.master.TestAssignmentManager
Tests run: 15, Failures: 0, Errors: 0, Skipped: 0, Time elapsed: 4.672 sec
Java HotSpot(TM) 64-Bit Server VM warning: Insufficient space for shared memory file:
   /tmp/hsperfdata_jenkins/5462
Try using the -Djava.io.tmpdir= option to select an alternate temp location.
Running org.apache.hadoop.hbase.master.TestTableLockManager
Tests run: 5, Failures: 0, Errors: 0, Skipped: 0, Time elapsed: 184.627 sec
Java HotSpot(TM) 64-Bit Server VM warning: Insufficient space for shared memory file:
   /tmp/hsperfdata_jenkins/12798
Try using the -Djava.io.tmpdir= option to select an alternate temp location.
Running org.apache.hadoop.hbase.master.TestMasterStatusServlet
Tests run: 4, Failures: 0, Errors: 0, Skipped: 0, Time elapsed: 2.17 sec
Java HotSpot(TM) 64-Bit Server VM warning: Insufficient space for shared memory file:
   /tmp/hsperfdata_jenkins/13043
Try using the -Djava.io.tmpdir= option to select an alternate temp location.
Running org.apache.hadoop.hbase.master.TestHMasterRPCException
Tests run: 1, Failures: 0, Errors: 0, Skipped: 0, Time elapsed: 3.18 sec
Java HotSpot(TM) 64-Bit Server VM warning: Insufficient space for shared memory file:
   /tmp/hsperfdata_jenkins/13249
Try using the -Djava.io.tmpdir= option to select an alternate temp location.
Running org.apache.hadoop.hbase.master.TestMasterFailover
Tests run: 4, Failures: 0, Errors: 0, Skipped: 0, Time elapsed: 98.813 sec
Java HotSpot(TM) 64-Bit Server VM warning: Insufficient space for shared memory file:
   /tmp/hsperfdata_jenkins/18057
Try using the -Djava.io.tmpdir= option to select an alternate temp location.
Running org.apache.hadoop.hbase.master.TestMasterShutdown
Tests run: 2, Failures: 0, Errors: 0, Skipped: 0, Time elapsed: 45.529 sec
Java HotSpot(TM) 64-Bit Server VM warning: Insufficient space for shared memory file:
   /tmp/hsperfdata_jenkins/19917
Try using the -Djava.io.tmpdir= option to select an alternate temp location.
Running org.apache.hadoop.hbase.master.cleaner.TestHFileCleaner
Tests run: 3, Failures: 0, Errors: 0, Skipped: 0, Time elapsed: 14.509 sec
Java HotSpot(TM) 64-Bit Server VM warning: Insufficient space for shared memory file:
   /tmp/hsperfdata_jenkins/21142
Try using the -Djava.io.tmpdir= option to select an alternate temp location.
Running org.apache.hadoop.hbase.master.cleaner.TestLogsCleaner
Tests run: 1, Failures: 0, Errors: 0, Skipped: 0, Time elapsed: 14.45 sec
Java HotSpot(TM) 64-Bit Server VM warning: Insufficient space for shared memory file:
   /tmp/hsperfdata_jenkins/21559
Try using the -Djava.io.tmpdir= option to select an alternate temp location.
Running org.apache.hadoop.hbase.master.cleaner.TestSnapshotFromMaster
Tests run: 4, Failures: 0, Errors: 0, Skipped: 0, Time elapsed: 53.115 sec
Java HotSpot(TM) 64-Bit Server VM warning: Insufficient space for shared memory file:
   /tmp/hsperfdata_jenkins/24442
Try using the -Djava.io.tmpdir= option to select an alternate temp location.
Running org.apache.hadoop.hbase.master.TestClusterStatusPublisher
Tests run: 3, Failures: 0, Errors: 0, Skipped: 0, Time elapsed: 0.341 sec
Java HotSpot(TM) 64-Bit Server VM warning: Insufficient space for shared memory file:
   /tmp/hsperfdata_jenkins/24472
Try using the -Djava.io.tmpdir= option to select an alternate temp location.
Running org.apache.hadoop.hbase.master.TestMasterFailoverBalancerPersistence
Tests run: 1, Failures: 0, Errors: 0, Skipped: 0, Time elapsed: 18.3 sec
Java HotSpot(TM) 64-Bit Server VM warning: Insufficient space for shared memory file:
   /tmp/hsperfdata_jenkins/24988
Try using the -Djava.io.tmpdir= option to select an alternate temp location.
Running org.apache.hadoop.hbase.master.TestRestartCluster
Tests run: 2, Failures: 0, Errors: 0, Skipped: 0, Time elapsed: 56.51 sec
Java HotSpot(TM) 64-Bit Server VM warning: Insufficient space for shared memory file:
   /tmp/hsperfdata_jenkins/28114
Try using the -Djava.io.tmpdir= option to select an alternate temp location.
Running org.apache.hadoop.hbase.TestRegionRebalancing
Tests run: 2, Failures: 0, Errors: 0, Skipped: 0, Time elapsed: 68.692 sec
Java HotSpot(TM) 64-Bit Server VM warning: Insufficient space for shared memory file:
   /tmp/hsperfdata_jenkins/924
Try using the -Djava.io.tmpdir= option to select an alternate temp location.
Running org.apache.hadoop.hbase.TestAcidGuarantees
Tests run: 3, Failures: 0, Errors: 0, Skipped: 0, Time elapsed: 108.926 sec
Java HotSpot(TM) 64-Bit Server VM warning: Insufficient space for shared memory file:
   /tmp/hsperfdata_jenkins/9958
Try using the -Djava.io.tmpdir= option to select an alternate temp location.
Running org.apache.hadoop.hbase.TestZooKeeper
Tests run: 10, Failures: 0, Errors: 0, Skipped: 0, Time elapsed: 28.1 sec
Java HotSpot(TM) 64-Bit Server VM warning: Insufficient space for shared memory file:
   /tmp/hsperfdata_jenkins/10810
Try using the -Djava.io.tmpdir= option to select an alternate temp location.
Running org.apache.hadoop.hbase.ipc.TestProtoBufRpc
Tests run: 1, Failures: 0, Errors: 0, Skipped: 0, Time elapsed: 1.533 sec
Java HotSpot(TM) 64-Bit Server VM warning: Insufficient space for shared memory file:
   /tmp/hsperfdata_jenkins/10875
Try using the -Djava.io.tmpdir= option to select an alternate temp location.
Running org.apache.hadoop.hbase.ipc.TestDelayedRpc
Tests run: 4, Failures: 0, Errors: 0, Skipped: 0, Time elapsed: 3.548 sec
Java HotSpot(TM) 64-Bit Server VM warning: Insufficient space for shared memory file:
   /tmp/hsperfdata_jenkins/11013
Try using the -Djava.io.tmpdir= option to select an alternate temp location.
Running org.apache.hadoop.hbase.ipc.TestHBaseClient
Tests run: 1, Failures: 0, Errors: 0, Skipped: 0, Time elapsed: 0.283 sec
Java HotSpot(TM) 64-Bit Server VM warning: Insufficient space for shared memory file:
   /tmp/hsperfdata_jenkins/11040
Try using the -Djava.io.tmpdir= option to select an alternate temp location.
Running org.apache.hadoop.hbase.master.TestDistributedLogSplitting
Tests run: 14, Failures: 0, Errors: 0, Skipped: 0, Time elapsed: 713.959 sec
Java HotSpot(TM) 64-Bit Server VM warning: Insufficient space for shared memory file:
   /tmp/hsperfdata_jenkins/11397
Try using the -Djava.io.tmpdir= option to select an alternate temp location.
Running org.apache.hadoop.hbase.thrift2.TestThriftHBaseServiceHandler
Tests run: 12, Failures: 0, Errors: 0, Skipped: 0, Time elapsed: 16.035 sec
Java HotSpot(TM) 64-Bit Server VM warning: Insufficient space for shared memory file:
   /tmp/hsperfdata_jenkins/11479
Try using the -Djava.io.tmpdir= option to select an alternate temp location.
Running org.apache.hadoop.hbase.TestInfoServers
Tests run: 3, Failures: 0, Errors: 0, Skipped: 0, Time elapsed: 15.308 sec
Java HotSpot(TM) 64-Bit Server VM warning: Insufficient space for shared memory file:
   /tmp/hsperfdata_jenkins/11936
Try using the -Djava.io.tmpdir= option to select an alternate temp location.
Running org.apache.hadoop.hbase.procedure.TestZKProcedureControllers
Tests run: 4, Failures: 0, Errors: 0, Skipped: 0, Time elapsed: 2.787 sec
Java HotSpot(TM) 64-Bit Server VM warning: Insufficient space for shared memory file:
   /tmp/hsperfdata_jenkins/11984
Try using the -Djava.io.tmpdir= option to select an alternate temp location.
Running org.apache.hadoop.hbase.procedure.TestZKProcedure
Tests run: 4, Failures: 0, Errors: 0, Skipped: 0, Time elapsed: 2.579 sec
Running org.apache.hadoop.hbase.TestIOFencing
Tests run: 2, Failures: 0, Errors: 0, Skipped: 0, Time elapsed: 85.476 sec

Results :

Tests in error: 
  testRunShellTests(org.apache.hadoop.hbase.client.TestShell): java.lang.ExceptionInInitializerError

Tests run: 1484, Failures: 0, Errors: 1, Skipped: 14

[INFO] ------------------------------------------------------------------------
[INFO] Reactor Summary:
[INFO] 
[INFO] HBase ............................................. SUCCESS [6.667s]
[INFO] HBase - Common .................................... SUCCESS [23.703s]
[INFO] HBase - Protocol .................................. SUCCESS [9.365s]
[INFO] HBase - Client .................................... SUCCESS [13.834s]
[INFO] HBase - Prefix Tree ............................... SUCCESS [3.289s]
[INFO] HBase - Hadoop Compatibility ...................... SUCCESS [5.509s]
[INFO] HBase - Hadoop One Compatibility .................. SUCCESS [2.080s]
[INFO] HBase - Server .................................... FAILURE [2:03:13.625s]
[INFO] HBase - Integration Tests ......................... SKIPPED
[INFO] HBase - Examples .................................. SKIPPED
[INFO] HBase - Assembly .................................. SKIPPED
[INFO] ------------------------------------------------------------------------
[INFO] BUILD FAILURE
[INFO] ------------------------------------------------------------------------
[INFO] Total time: 2:04:18.787s
[INFO] Finished at: Thu Jun 20 09:14:12 UTC 2013
[INFO] Final Memory: 34M/985M
[INFO] ------------------------------------------------------------------------
[ERROR] Failed to execute goal org.apache.maven.plugins:maven-surefire-plugin:2.12-TRUNK-HBASE-2:test
(secondPartTestsExecution) on project hbase-server: There are test failures.
[ERROR] 
[ERROR] Please refer to /home/hudson/jenkins-slave/workspace/hbase-0.95/0.95/hbase-server/target/surefire-reports
for the individual test results.
[ERROR] -> [Help 1]
[ERROR] 
[ERROR] To see the full stack trace of the errors, re-run Maven with the -e switch.
[ERROR] Re-run Maven using the -X switch to enable full debug logging.
[ERROR] 
[ERROR] For more information about the errors and possible solutions, please read the following
articles:
[ERROR] [Help 1] http://cwiki.apache.org/confluence/display/MAVEN/MojoFailureException
[ERROR] 
[ERROR] After correcting the problems, you can resume the build with the command
[ERROR]   mvn <goals> -rf :hbase-server
Build step 'Invoke top-level Maven targets' marked build as failure
Archiving artifacts
Recording test results

Mime
View raw message