hbase-dev mailing list archives

Site index · List index
Message view « Date » · « Thread »
Top « Date » · « Thread »
From apurt...@apache.org
Subject Build failed in Jenkins: HBase-0.94-Security #192
Date Mon, 03 Jun 2013 00:03:00 GMT
See <http://54.241.6.143/job/HBase-0.94-Security/192/>

------------------------------------------
[...truncated 1728 lines...]
A         src/packages/rpm/init.d/hbase-regionserver
A         src/packages/rpm/init.d/hbase-master
A         src/packages/rpm/spec
A         src/packages/rpm/spec/conf-pseudo.spec
A         src/packages/rpm/spec/hbase.spec
A         bin
AU        bin/hbase-daemons.sh
AU        bin/hbase
A         bin/get-active-master.rb
AU        bin/start-hbase.sh
A         bin/hirb.rb
A         bin/region_status.rb
AU        bin/hbase-daemon.sh
A         bin/region_mover.rb
A         bin/hbase-config.sh
AU        bin/local-regionservers.sh
AU        bin/zookeepers.sh
AU        bin/local-master-backup.sh
AU        bin/rolling-restart.sh
AU        bin/graceful_stop.sh
AU        bin/regionservers.sh
AU        bin/master-backup.sh
A         bin/replication
A         bin/replication/copy_tables_desc.rb
A         bin/hbase-jruby
AU        bin/stop-hbase.sh
A         dev-support
AU        dev-support/smart-apply-patch.sh
AU        dev-support/test-util.sh
AU        dev-support/findHangingTest.sh
AU        dev-support/test-patch.sh
A         dev-support/test-patch.properties
AU        dev-support/hbasetests.sh
A         .arcconfig
A         pom.xml
A         README.txt
 U        .
At revision 1488810
no change for https://svn.apache.org/repos/asf/hbase/branches/0.94 since the previous build
[HBase-0.94-Security] $ /bin/bash -xe /tmp/hudson2899790761032984351.sh
+ uname -a
Linux ip-10-197-20-158 3.4.36-39.44.amzn1.x86_64 #1 SMP Tue Mar 19 05:24:46 UTC 2013 x86_64
x86_64 x86_64 GNU/Linux
+ ulimit -a
core file size          (blocks, -c) 0
data seg size           (kbytes, -d) unlimited
scheduling priority             (-e) 0
file size               (blocks, -f) unlimited
pending signals                 (-i) 119688
max locked memory       (kbytes, -l) 64
max memory size         (kbytes, -m) unlimited
open files                      (-n) 65536
pipe size            (512 bytes, -p) 8
POSIX message queues     (bytes, -q) 819200
real-time priority              (-r) 0
stack size              (kbytes, -s) 8192
cpu time               (seconds, -t) unlimited
max user processes              (-u) 65536
virtual memory          (kbytes, -v) unlimited
file locks                      (-x) unlimited
+ mvn -version
Apache Maven 3.0.4 (r1232337; 2012-01-17 08:44:56+0000)
Maven home: /opt/maven
Java version: 1.6.0_43, vendor: Sun Microsystems Inc.
Java home: /usr/java/jdk1.6.0_43/jre
Default locale: en_US, platform encoding: UTF-8
OS name: "linux", version: "3.4.36-39.44.amzn1.x86_64", arch: "amd64", family: "unix"
Parsing POMs
Downloaded artifact https://repository.apache.org/content/repositories/releases/org/apache/apache/8/apache-8.pom
[HBase-0.94-Security] $ /usr/java/default/bin/java -Xmx3g -XX:MaxPermSize=768m -cp /home/ec2-user/jenkins/maven3-agent.jar:/opt/maven/boot/plexus-classworlds-2.4.jar
org.jvnet.hudson.maven3.agent.Maven3Main /opt/maven /tmp/slave.jar /home/ec2-user/jenkins/maven3-interceptor.jar
46290
<===[JENKINS REMOTING CAPACITY]===>   channel started
log4j:WARN No appenders could be found for logger (org.apache.commons.beanutils.converters.BooleanConverter).
log4j:WARN Please initialize the log4j system properly.
Executing Maven:  -B -f <http://54.241.6.143/job/HBase-0.94-Security/ws/pom.xml> -Dmaven.repo.local=/home/ec2-user/jenkins/maven-repositories/0
-e -PrunAllTests -Dmaven.test.redirectTestOutputToFile=true -DskipITs -Prelease -Psecurity
site install assembly:single
[INFO] Error stacktraces are turned on.
[INFO] Scanning for projects...
Downloading: http://people.apache.org/~garyh/mvn/org/apache/maven/plugins/maven-remote-resources-plugin/1.1/maven-remote-resources-plugin-1.1.pom
Downloading: http://repo.maven.apache.org/maven2/org/apache/maven/plugins/maven-remote-resources-plugin/1.1/maven-remote-resources-plugin-1.1.pom
Downloaded: http://repo.maven.apache.org/maven2/org/apache/maven/plugins/maven-remote-resources-plugin/1.1/maven-remote-resources-plugin-1.1.pom
(12 KB at 38.2 KB/sec)
Downloading: http://people.apache.org/~garyh/mvn/org/apache/maven/plugins/maven-plugins/14/maven-plugins-14.pom
Downloading: http://repo.maven.apache.org/maven2/org/apache/maven/plugins/maven-plugins/14/maven-plugins-14.pom
Downloaded: http://repo.maven.apache.org/maven2/org/apache/maven/plugins/maven-plugins/14/maven-plugins-14.pom
(13 KB at 284.7 KB/sec)
Downloading: http://people.apache.org/~garyh/mvn/org/apache/maven/maven-parent/13/maven-parent-13.pom
Downloading: http://repo.maven.apache.org/maven2/org/apache/maven/maven-parent/13/maven-parent-13.pom
Downloaded: http://repo.maven.apache.org/maven2/org/apache/maven/maven-parent/13/maven-parent-13.pom
(23 KB at 789.4 KB/sec)
Downloading: http://people.apache.org/~garyh/mvn/org/apache/apache/6/apache-6.pom
Downloading: http://repo.maven.apache.org/maven2/org/apache/apache/6/apache-6.pom
Downloaded: http://repo.maven.apache.org/maven2/org/apache/apache/6/apache-6.pom (13 KB at
543.3 KB/sec)
Downloading: http://people.apache.org/~garyh/mvn/org/apache/maven/plugins/maven-remote-resources-plugin/1.1/maven-remote-resources-plugin-1.1.jar
Downloading: http://repo.maven.apache.org/maven2/org/apache/maven/plugins/maven-remote-resources-plugin/1.1/maven-remote-resources-plugin-1.1.jar
Downloaded: http://repo.maven.apache.org/maven2/org/apache/maven/plugins/maven-remote-resources-plugin/1.1/maven-remote-resources-plugin-1.1.jar
(61 KB at 1377.5 KB/sec)
Downloading: http://people.apache.org/~garyh/mvn/org/apache/maven/plugins/maven-site-plugin/3.2/maven-site-plugin-3.2.pom
Downloading: http://repo.maven.apache.org/maven2/org/apache/maven/plugins/maven-site-plugin/3.2/maven-site-plugin-3.2.pom
Downloaded: http://repo.maven.apache.org/maven2/org/apache/maven/plugins/maven-site-plugin/3.2/maven-site-plugin-3.2.pom
(20 KB at 182.9 KB/sec)
Downloading: http://people.apache.org/~garyh/mvn/org/apache/maven/plugins/maven-plugins/23/maven-plugins-23.pom
Downloading: http://repo.maven.apache.org/maven2/org/apache/maven/plugins/maven-plugins/23/maven-plugins-23.pom
Downloaded: http://repo.maven.apache.org/maven2/org/apache/maven/plugins/maven-plugins/23/maven-plugins-23.pom
(9 KB at 449.1 KB/sec)
Downloading: http://people.apache.org/~garyh/mvn/org/apache/maven/maven-parent/22/maven-parent-22.pom
Downloading: http://repo.maven.apache.org/maven2/org/apache/maven/maven-parent/22/maven-parent-22.pom
Downloaded: http://repo.maven.apache.org/maven2/org/apache/maven/maven-parent/22/maven-parent-22.pom
(30 KB at 726.1 KB/sec)
Downloading: http://people.apache.org/~garyh/mvn/org/apache/apache/11/apache-11.pom
Downloading: http://repo.maven.apache.org/maven2/org/apache/apache/11/apache-11.pom
Downloaded: http://repo.maven.apache.org/maven2/org/apache/apache/11/apache-11.pom (15 KB
at 688.8 KB/sec)
Downloading: http://people.apache.org/~garyh/mvn/org/apache/maven/plugins/maven-site-plugin/3.2/maven-site-plugin-3.2.jar
Downloading: http://repo.maven.apache.org/maven2/org/apache/maven/plugins/maven-site-plugin/3.2/maven-site-plugin-3.2.jar
Downloaded: http://repo.maven.apache.org/maven2/org/apache/maven/plugins/maven-site-plugin/3.2/maven-site-plugin-3.2.jar
(119 KB at 1128.3 KB/sec)
Downloading: http://people.apache.org/~garyh/mvn/org/apache/avro/avro-maven-plugin/1.5.3/avro-maven-plugin-1.5.3.pom
Downloading: http://repo.maven.apache.org/maven2/org/apache/avro/avro-maven-plugin/1.5.3/avro-maven-plugin-1.5.3.pom
Downloaded: http://repo.maven.apache.org/maven2/org/apache/avro/avro-maven-plugin/1.5.3/avro-maven-plugin-1.5.3.pom
(3 KB at 28.5 KB/sec)
Downloading: http://people.apache.org/~garyh/mvn/org/apache/avro/avro-parent/1.5.3/avro-parent-1.5.3.pom
Downloading: http://repo.maven.apache.org/maven2/org/apache/avro/avro-parent/1.5.3/avro-parent-1.5.3.pom
Downloaded: http://repo.maven.apache.org/maven2/org/apache/avro/avro-parent/1.5.3/avro-parent-1.5.3.pom
(15 KB at 690.2 KB/sec)
Downloading: http://people.apache.org/~garyh/mvn/org/apache/apache/8/apache-8.pom
Downloading: http://repo.maven.apache.org/maven2/org/apache/apache/8/apache-8.pom
Downloaded: http://repo.maven.apache.org/maven2/org/apache/apache/8/apache-8.pom (0 B at 0.0
KB/sec)
Downloading: http://people.apache.org/~garyh/mvn/org/apache/avro/avro-maven-plugin/1.5.3/avro-maven-plugin-1.5.3.jar
Downloading: http://repo.maven.apache.org/maven2/org/apache/avro/avro-maven-plugin/1.5.3/avro-maven-plugin-1.5.3.jar
Downloaded: http://repo.maven.apache.org/maven2/org/apache/avro/avro-maven-plugin/1.5.3/avro-maven-plugin-1.5.3.jar
(19 KB at 151.6 KB/sec)
Downloading: http://people.apache.org/~garyh/mvn/org/codehaus/mojo/xml-maven-plugin/1.0-beta-3/xml-maven-plugin-1.0-beta-3.pom
Downloading: http://repo.maven.apache.org/maven2/org/codehaus/mojo/xml-maven-plugin/1.0-beta-3/xml-maven-plugin-1.0-beta-3.pom
Downloaded: http://repo.maven.apache.org/maven2/org/codehaus/mojo/xml-maven-plugin/1.0-beta-3/xml-maven-plugin-1.0-beta-3.pom
(6 KB at 44.0 KB/sec)
Downloading: http://people.apache.org/~garyh/mvn/org/codehaus/mojo/mojo-parent/21/mojo-parent-21.pom
Downloading: http://repo.maven.apache.org/maven2/org/codehaus/mojo/mojo-parent/21/mojo-parent-21.pom
Downloaded: http://repo.maven.apache.org/maven2/org/codehaus/mojo/mojo-parent/21/mojo-parent-21.pom
(19 KB at 245.6 KB/sec)
Downloading: http://people.apache.org/~garyh/mvn/org/codehaus/mojo/xml-maven-plugin/1.0-beta-3/xml-maven-plugin-1.0-beta-3.jar
Downloading: http://repo.maven.apache.org/maven2/org/codehaus/mojo/xml-maven-plugin/1.0-beta-3/xml-maven-plugin-1.0-beta-3.jar
Downloaded: http://repo.maven.apache.org/maven2/org/codehaus/mojo/xml-maven-plugin/1.0-beta-3/xml-maven-plugin-1.0-beta-3.jar
(31 KB at 113.9 KB/sec)
Downloading: http://people.apache.org/~garyh/mvn/com/agilejava/docbkx/docbkx-maven-plugin/2.0.13/docbkx-maven-plugin-2.0.13.pom
Downloading: http://repo.maven.apache.org/maven2/com/agilejava/docbkx/docbkx-maven-plugin/2.0.13/docbkx-maven-plugin-2.0.13.pom
Downloaded: http://repo.maven.apache.org/maven2/com/agilejava/docbkx/docbkx-maven-plugin/2.0.13/docbkx-maven-plugin-2.0.13.pom
(9 KB at 86.9 KB/sec)
Downloading: http://people.apache.org/~garyh/mvn/com/agilejava/docbkx/docbkx/2.0.13/docbkx-2.0.13.pom
Downloading: http://repo.maven.apache.org/maven2/com/agilejava/docbkx/docbkx/2.0.13/docbkx-2.0.13.pom
Downloaded: http://repo.maven.apache.org/maven2/com/agilejava/docbkx/docbkx/2.0.13/docbkx-2.0.13.pom
(6 KB at 35.5 KB/sec)
Downloading: http://people.apache.org/~garyh/mvn/com/agilejava/docbkx/docbkx-maven-plugin/2.0.13/docbkx-maven-plugin-2.0.13.jar
Downloading: http://repo.maven.apache.org/maven2/com/agilejava/docbkx/docbkx-maven-plugin/2.0.13/docbkx-maven-plugin-2.0.13.jar
Downloaded: http://repo.maven.apache.org/maven2/com/agilejava/docbkx/docbkx-maven-plugin/2.0.13/docbkx-maven-plugin-2.0.13.jar
(267 KB at 4515.3 KB/sec)
Downloading: http://people.apache.org/~garyh/mvn/org/apache/maven/plugins/maven-assembly-plugin/2.2-beta-5/maven-assembly-plugin-2.2-beta-5.pom
Downloading: http://repo.maven.apache.org/maven2/org/apache/maven/plugins/maven-assembly-plugin/2.2-beta-5/maven-assembly-plugin-2.2-beta-5.pom
Downloaded: http://repo.maven.apache.org/maven2/org/apache/maven/plugins/maven-assembly-plugin/2.2-beta-5/maven-assembly-plugin-2.2-beta-5.pom
(15 KB at 704.9 KB/sec)
Downloading: http://people.apache.org/~garyh/mvn/org/apache/maven/plugins/maven-plugins/16/maven-plugins-16.pom
Downloading: http://repo.maven.apache.org/maven2/org/apache/maven/plugins/maven-plugins/16/maven-plugins-16.pom
Downloaded: http://repo.maven.apache.org/maven2/org/apache/maven/plugins/maven-plugins/16/maven-plugins-16.pom
(13 KB at 702.5 KB/sec)
Downloading: http://people.apache.org/~garyh/mvn/org/apache/maven/maven-parent/15/maven-parent-15.pom
Downloading: http://repo.maven.apache.org/maven2/org/apache/maven/maven-parent/15/maven-parent-15.pom
Downloaded: http://repo.maven.apache.org/maven2/org/apache/maven/maven-parent/15/maven-parent-15.pom
(24 KB at 1065.5 KB/sec)
Downloading: http://people.apache.org/~garyh/mvn/org/apache/maven/plugins/maven-assembly-plugin/2.2-beta-5/maven-assembly-plugin-2.2-beta-5.jar
Downloading: http://repo.maven.apache.org/maven2/org/apache/maven/plugins/maven-assembly-plugin/2.2-beta-5/maven-assembly-plugin-2.2-beta-5.jar
Downloaded: http://repo.maven.apache.org/maven2/org/apache/maven/plugins/maven-assembly-plugin/2.2-beta-5/maven-assembly-plugin-2.2-beta-5.jar
(204 KB at 5665.8 KB/sec)
[INFO] Downloading: http://people.apache.org/~garyh/mvn/org/apache/maven/plugins/maven-failsafe-plugin/2.12-TRUNK-HBASE-2/maven-failsafe-plugin-2.12-TRUNK-HBASE-2.pom
                                                                        
[INFO] ------------------------------------------------------------------------
[INFO] Building HBase 0.94.8
[INFO] ------------------------------------------------------------------------
Downloading: http://repo.maven.apache.org/maven2/org/apache/maven/plugins/maven-failsafe-plugin/2.12-TRUNK-HBASE-2/maven-failsafe-plugin-2.12-TRUNK-HBASE-2.pom
[INFO] ------------------------------------------------------------------------
[INFO] BUILD FAILURE
[INFO] ------------------------------------------------------------------------
[INFO] Total time: 26:22.688s
[INFO] Finished at: Mon Jun 03 00:02:53 UTC 2013
[INFO] Final Memory: 7M/224M
[INFO] ------------------------------------------------------------------------
[JENKINS] Archiving <http://54.241.6.143/job/HBase-0.94-Security/ws/pom.xml> to /var/lib/jenkins/jobs/HBase-0.94-Security/modules/org.apache.hbase$hbase/builds/2013-06-02_23-36-25/archive/org.apache.hbase/hbase/0.94.8/hbase-0.94.8.pom
Waiting for Jenkins to finish collecting data
mavenExecutionResult exceptions not empty
message : Plugin org.apache.maven.plugins:maven-failsafe-plugin:2.12-TRUNK-HBASE-2 or one
of its dependencies could not be resolved: Failed to read artifact descriptor for org.apache.maven.plugins:maven-failsafe-plugin:jar:2.12-TRUNK-HBASE-2
cause : Failed to read artifact descriptor for org.apache.maven.plugins:maven-failsafe-plugin:jar:2.12-TRUNK-HBASE-2
Stack trace : 
org.apache.maven.plugin.PluginResolutionException: Plugin org.apache.maven.plugins:maven-failsafe-plugin:2.12-TRUNK-HBASE-2
or one of its dependencies could not be resolved: Failed to read artifact descriptor for org.apache.maven.plugins:maven-failsafe-plugin:jar:2.12-TRUNK-HBASE-2
	at org.apache.maven.plugin.internal.DefaultPluginDependenciesResolver.resolve(DefaultPluginDependenciesResolver.java:129)
	at org.apache.maven.plugin.internal.DefaultMavenPluginManager.getPluginDescriptor(DefaultMavenPluginManager.java:142)
	at org.apache.maven.plugin.internal.DefaultMavenPluginManager.getMojoDescriptor(DefaultMavenPluginManager.java:261)
	at org.apache.maven.plugin.DefaultBuildPluginManager.getMojoDescriptor(DefaultBuildPluginManager.java:185)
	at org.apache.maven.lifecycle.internal.DefaultLifecycleExecutionPlanCalculator.calculateLifecycleMappings(DefaultLifecycleExecutionPlanCalculator.java:280)
	at org.apache.maven.lifecycle.internal.DefaultLifecycleExecutionPlanCalculator.calculateMojoExecutions(DefaultLifecycleExecutionPlanCalculator.java:193)
	at org.apache.maven.lifecycle.internal.DefaultLifecycleExecutionPlanCalculator.calculateExecutionPlan(DefaultLifecycleExecutionPlanCalculator.java:112)
	at org.apache.maven.lifecycle.internal.DefaultLifecycleExecutionPlanCalculator.calculateExecutionPlan(DefaultLifecycleExecutionPlanCalculator.java:129)
	at org.apache.maven.lifecycle.internal.BuilderCommon.resolveBuildPlan(BuilderCommon.java:92)
	at org.apache.maven.lifecycle.internal.LifecycleModuleBuilder.buildProject(LifecycleModuleBuilder.java:81)
	at org.apache.maven.lifecycle.internal.LifecycleModuleBuilder.buildProject(LifecycleModuleBuilder.java:59)
	at org.apache.maven.lifecycle.internal.LifecycleStarter.singleThreadedBuild(LifecycleStarter.java:183)
	at org.apache.maven.lifecycle.internal.LifecycleStarter.execute(LifecycleStarter.java:161)
	at org.apache.maven.DefaultMaven.doExecute(DefaultMaven.java:320)
	at org.apache.maven.DefaultMaven.execute(DefaultMaven.java:156)
	at org.jvnet.hudson.maven3.launcher.Maven3Launcher.main(Maven3Launcher.java:79)
	at sun.reflect.NativeMethodAccessorImpl.invoke0(Native Method)
	at sun.reflect.NativeMethodAccessorImpl.invoke(NativeMethodAccessorImpl.java:39)
	at sun.reflect.DelegatingMethodAccessorImpl.invoke(DelegatingMethodAccessorImpl.java:25)
	at java.lang.reflect.Method.invoke(Method.java:597)
	at org.codehaus.plexus.classworlds.launcher.Launcher.launchStandard(Launcher.java:329)
	at org.codehaus.plexus.classworlds.launcher.Launcher.launch(Launcher.java:239)
	at org.jvnet.hudson.maven3.agent.Maven3Main.launch(Maven3Main.java:158)
	at hudson.maven.Maven3Builder.call(Maven3Builder.java:100)
	at hudson.maven.Maven3Builder.call(Maven3Builder.java:66)
	at hudson.remoting.UserRequest.perform(UserRequest.java:118)
	at hudson.remoting.UserRequest.perform(UserRequest.java:48)
	at hudson.remoting.Request$2.run(Request.java:326)
	at hudson.remoting.InterceptingExecutorService$1.call(InterceptingExecutorService.java:72)
	at java.util.concurrent.FutureTask$Sync.innerRun(FutureTask.java:303)
	at java.util.concurrent.FutureTask.run(FutureTask.java:138)
	at java.util.concurrent.ThreadPoolExecutor$Worker.runTask(ThreadPoolExecutor.java:895)
	at java.util.concurrent.ThreadPoolExecutor$Worker.run(ThreadPoolExecutor.java:918)
	at java.lang.Thread.run(Thread.java:662)
Caused by: org.sonatype.aether.resolution.ArtifactDescriptorException: Failed to read artifact
descriptor for org.apache.maven.plugins:maven-failsafe-plugin:jar:2.12-TRUNK-HBASE-2
	at org.apache.maven.repository.internal.DefaultArtifactDescriptorReader.loadPom(DefaultArtifactDescriptorReader.java:296)
	at org.apache.maven.repository.internal.DefaultArtifactDescriptorReader.readArtifactDescriptor(DefaultArtifactDescriptorReader.java:186)
	at org.sonatype.aether.impl.internal.DefaultRepositorySystem.readArtifactDescriptor(DefaultRepositorySystem.java:279)
	at org.apache.maven.plugin.internal.DefaultPluginDependenciesResolver.resolve(DefaultPluginDependenciesResolver.java:115)
	... 33 more
Caused by: org.sonatype.aether.resolution.ArtifactResolutionException: Could not transfer
artifact org.apache.maven.plugins:maven-failsafe-plugin:pom:2.12-TRUNK-HBASE-2 from/to ghelmling.testing
(http://people.apache.org/~garyh/mvn/): Connection to http://people.apache.org refused
	at org.sonatype.aether.impl.internal.DefaultArtifactResolver.resolve(DefaultArtifactResolver.java:538)
	at org.sonatype.aether.impl.internal.DefaultArtifactResolver.resolveArtifacts(DefaultArtifactResolver.java:216)
	at org.sonatype.aether.impl.internal.DefaultArtifactResolver.resolveArtifact(DefaultArtifactResolver.java:193)
	at org.apache.maven.repository.internal.DefaultArtifactDescriptorReader.loadPom(DefaultArtifactDescriptorReader.java:281)
	... 36 more
Caused by: org.sonatype.aether.transfer.ArtifactTransferException: Could not transfer artifact
org.apache.maven.plugins:maven-failsafe-plugin:pom:2.12-TRUNK-HBASE-2 from/to ghelmling.testing
(http://people.apache.org/~garyh/mvn/): Connection to http://people.apache.org refused
	at org.sonatype.aether.connector.wagon.WagonRepositoryConnector$4.wrap(WagonRepositoryConnector.java:951)
	at org.sonatype.aether.connector.wagon.WagonRepositoryConnector$4.wrap(WagonRepositoryConnector.java:941)
	at org.sonatype.aether.connector.wagon.WagonRepositoryConnector$GetTask.run(WagonRepositoryConnector.java:669)
	at org.sonatype.aether.util.concurrency.RunnableErrorForwarder$1.run(RunnableErrorForwarder.java:60)
	... 3 more
Caused by: org.apache.maven.wagon.TransferFailedException: Connection to http://people.apache.org
refused
	at org.apache.maven.wagon.shared.http4.AbstractHttpClientWagon.fillInputData(AbstractHttpClientWagon.java:799)
	at org.apache.maven.wagon.StreamWagon.getInputStream(StreamWagon.java:116)
	at org.apache.maven.wagon.StreamWagon.getIfNewer(StreamWagon.java:88)
	at org.apache.maven.wagon.StreamWagon.get(StreamWagon.java:61)
	at org.sonatype.aether.connector.wagon.WagonRepositoryConnector$GetTask.run(WagonRepositoryConnector.java:601)
	... 4 more
Caused by: org.apache.maven.wagon.providers.http.httpclient.conn.HttpHostConnectException:
Connection to http://people.apache.org refused
	at org.apache.maven.wagon.providers.http.httpclient.impl.conn.DefaultClientConnectionOperator.openConnection(DefaultClientConnectionOperator.java:158)
	at org.apache.maven.wagon.providers.http.httpclient.impl.conn.AbstractPoolEntry.open(AbstractPoolEntry.java:149)
	at org.apache.maven.wagon.providers.http.httpclient.impl.conn.AbstractPooledConnAdapter.open(AbstractPooledConnAdapter.java:121)
	at org.apache.maven.wagon.providers.http.httpclient.impl.client.DefaultRequestDirector.tryConnect(DefaultRequestDirector.java:573)
	at org.apache.maven.wagon.providers.http.httpclient.impl.client.DefaultRequestDirector.execute(DefaultRequestDirector.java:425)
	at org.apache.maven.wagon.providers.http.httpclient.impl.client.AbstractHttpClient.execute(AbstractHttpClient.java:820)
	at org.apache.maven.wagon.providers.http.httpclient.impl.client.AbstractHttpClient.execute(AbstractHttpClient.java:754)
	at org.apache.maven.wagon.shared.http4.AbstractHttpClientWagon.execute(AbstractHttpClientWagon.java:674)
	at org.apache.maven.wagon.shared.http4.AbstractHttpClientWagon.fillInputData(AbstractHttpClientWagon.java:793)
	... 8 more
Caused by: java.net.ConnectException: Connection timed out
	at java.net.PlainSocketImpl.socketConnect(Native Method)
	at java.net.PlainSocketImpl.doConnect(PlainSocketImpl.java:351)
	at java.net.PlainSocketImpl.connectToAddress(PlainSocketImpl.java:213)
	at java.net.PlainSocketImpl.connect(PlainSocketImpl.java:200)
	at java.net.SocksSocketImpl.connect(SocksSocketImpl.java:366)
	at java.net.Socket.connect(Socket.java:529)
	at org.apache.maven.wagon.providers.http.httpclient.conn.scheme.PlainSocketFactory.connectSocket(PlainSocketFactory.java:123)
	at org.apache.maven.wagon.providers.http.httpclient.impl.conn.DefaultClientConnectionOperator.openConnection(DefaultClientConnectionOperator.java:148)
	... 16 more
channel stopped
Archiving artifacts

Mime
View raw message