hbase-dev mailing list archives

Site index · List index
Message view « Date » · « Thread »
Top « Date » · « Thread »
From Apache Jenkins Server <jenk...@builds.apache.org>
Subject Build failed in Jenkins: hbase-0.95-on-hadoop2 #132
Date Sat, 15 Jun 2013 00:00:27 GMT
See <https://builds.apache.org/job/hbase-0.95-on-hadoop2/132/changes>

Changes:

[mbertozzi] HBASE-8742 HTableDescriptor Properties not preserved when cloning

------------------------------------------
[...truncated 24510 lines...]
Running org.apache.hadoop.hbase.rest.TestGzipFilter
Tests run: 2, Failures: 0, Errors: 0, Skipped: 0, Time elapsed: 9.161 sec
Forking command line: /bin/sh -c cd /x1/jenkins/jenkins-slave/workspace/hbase-0.95-on-hadoop2/0.95-on-hadoop2/hbase-server && /x1/jenkins/tools/java/jdk1.6.0_45-32/jre/bin/java -enableassertions -Xmx1900m -Djava.security.egd=file:/dev/./urandom -Djava.net.preferIPv4Stack=true -jar /x1/jenkins/jenkins-slave/workspace/hbase-0.95-on-hadoop2/0.95-on-hadoop2/hbase-server/target/surefire/surefirebooter1742590821207121145.jar /x1/jenkins/jenkins-slave/workspace/hbase-0.95-on-hadoop2/0.95-on-hadoop2/hbase-server/target/surefire/surefire6181219432191579103tmp /x1/jenkins/jenkins-slave/workspace/hbase-0.95-on-hadoop2/0.95-on-hadoop2/hbase-server/target/surefire/surefire_1937751370506898348600tmp
Running org.apache.hadoop.hbase.rest.TestTableResource
Tests run: 8, Failures: 0, Errors: 0, Skipped: 0, Time elapsed: 21.395 sec
Forking command line: /bin/sh -c cd /x1/jenkins/jenkins-slave/workspace/hbase-0.95-on-hadoop2/0.95-on-hadoop2/hbase-server && /x1/jenkins/tools/java/jdk1.6.0_45-32/jre/bin/java -enableassertions -Xmx1900m -Djava.security.egd=file:/dev/./urandom -Djava.net.preferIPv4Stack=true -jar /x1/jenkins/jenkins-slave/workspace/hbase-0.95-on-hadoop2/0.95-on-hadoop2/hbase-server/target/surefire/surefirebooter760332895406926857.jar /x1/jenkins/jenkins-slave/workspace/hbase-0.95-on-hadoop2/0.95-on-hadoop2/hbase-server/target/surefire/surefire7822897393350092613tmp /x1/jenkins/jenkins-slave/workspace/hbase-0.95-on-hadoop2/0.95-on-hadoop2/hbase-server/target/surefire/surefire_1947991324868508511312tmp
Running org.apache.hadoop.hbase.rest.TestRowResource
Tests run: 12, Failures: 0, Errors: 0, Skipped: 0, Time elapsed: 12.353 sec
Forking command line: /bin/sh -c cd /x1/jenkins/jenkins-slave/workspace/hbase-0.95-on-hadoop2/0.95-on-hadoop2/hbase-server && /x1/jenkins/tools/java/jdk1.6.0_45-32/jre/bin/java -enableassertions -Xmx1900m -Djava.security.egd=file:/dev/./urandom -Djava.net.preferIPv4Stack=true -jar /x1/jenkins/jenkins-slave/workspace/hbase-0.95-on-hadoop2/0.95-on-hadoop2/hbase-server/target/surefire/surefirebooter5705943859565395377.jar /x1/jenkins/jenkins-slave/workspace/hbase-0.95-on-hadoop2/0.95-on-hadoop2/hbase-server/target/surefire/surefire7912553026996613066tmp /x1/jenkins/jenkins-slave/workspace/hbase-0.95-on-hadoop2/0.95-on-hadoop2/hbase-server/target/surefire/surefire_1954936498782246725856tmp
Running org.apache.hadoop.hbase.rest.TestVersionResource
Tests run: 7, Failures: 0, Errors: 0, Skipped: 0, Time elapsed: 8.42 sec
Forking command line: /bin/sh -c cd /x1/jenkins/jenkins-slave/workspace/hbase-0.95-on-hadoop2/0.95-on-hadoop2/hbase-server && /x1/jenkins/tools/java/jdk1.6.0_45-32/jre/bin/java -enableassertions -Xmx1900m -Djava.security.egd=file:/dev/./urandom -Djava.net.preferIPv4Stack=true -jar /x1/jenkins/jenkins-slave/workspace/hbase-0.95-on-hadoop2/0.95-on-hadoop2/hbase-server/target/surefire/surefirebooter1725608232908621512.jar /x1/jenkins/jenkins-slave/workspace/hbase-0.95-on-hadoop2/0.95-on-hadoop2/hbase-server/target/surefire/surefire4445521459514350888tmp /x1/jenkins/jenkins-slave/workspace/hbase-0.95-on-hadoop2/0.95-on-hadoop2/hbase-server/target/surefire/surefire_1963905422869287691956tmp
Running org.apache.hadoop.hbase.rest.TestStatusResource
Tests run: 2, Failures: 0, Errors: 0, Skipped: 0, Time elapsed: 8.215 sec
Forking command line: /bin/sh -c cd /x1/jenkins/jenkins-slave/workspace/hbase-0.95-on-hadoop2/0.95-on-hadoop2/hbase-server && /x1/jenkins/tools/java/jdk1.6.0_45-32/jre/bin/java -enableassertions -Xmx1900m -Djava.security.egd=file:/dev/./urandom -Djava.net.preferIPv4Stack=true -jar /x1/jenkins/jenkins-slave/workspace/hbase-0.95-on-hadoop2/0.95-on-hadoop2/hbase-server/target/surefire/surefirebooter7763188880753794762.jar /x1/jenkins/jenkins-slave/workspace/hbase-0.95-on-hadoop2/0.95-on-hadoop2/hbase-server/target/surefire/surefire5349853426604735106tmp /x1/jenkins/jenkins-slave/workspace/hbase-0.95-on-hadoop2/0.95-on-hadoop2/hbase-server/target/surefire/surefire_1973462841981203224361tmp
Running org.apache.hadoop.hbase.rest.TestScannerResource
Tests run: 5, Failures: 0, Errors: 0, Skipped: 0, Time elapsed: 24.463 sec
Forking command line: /bin/sh -c cd /x1/jenkins/jenkins-slave/workspace/hbase-0.95-on-hadoop2/0.95-on-hadoop2/hbase-server && /x1/jenkins/tools/java/jdk1.6.0_45-32/jre/bin/java -enableassertions -Xmx1900m -Djava.security.egd=file:/dev/./urandom -Djava.net.preferIPv4Stack=true -jar /x1/jenkins/jenkins-slave/workspace/hbase-0.95-on-hadoop2/0.95-on-hadoop2/hbase-server/target/surefire/surefirebooter8009514113289576714.jar /x1/jenkins/jenkins-slave/workspace/hbase-0.95-on-hadoop2/0.95-on-hadoop2/hbase-server/target/surefire/surefire5117729479173317343tmp /x1/jenkins/jenkins-slave/workspace/hbase-0.95-on-hadoop2/0.95-on-hadoop2/hbase-server/target/surefire/surefire_1987910542343546941202tmp
Running org.apache.hadoop.hbase.rest.TestScannersWithFilters
Tests run: 10, Failures: 0, Errors: 0, Skipped: 0, Time elapsed: 13.312 sec
Forking command line: /bin/sh -c cd /x1/jenkins/jenkins-slave/workspace/hbase-0.95-on-hadoop2/0.95-on-hadoop2/hbase-server && /x1/jenkins/tools/java/jdk1.6.0_45-32/jre/bin/java -enableassertions -Xmx1900m -Djava.security.egd=file:/dev/./urandom -Djava.net.preferIPv4Stack=true -jar /x1/jenkins/jenkins-slave/workspace/hbase-0.95-on-hadoop2/0.95-on-hadoop2/hbase-server/target/surefire/surefirebooter7351479555625295031.jar /x1/jenkins/jenkins-slave/workspace/hbase-0.95-on-hadoop2/0.95-on-hadoop2/hbase-server/target/surefire/surefire3017590699842346065tmp /x1/jenkins/jenkins-slave/workspace/hbase-0.95-on-hadoop2/0.95-on-hadoop2/hbase-server/target/surefire/surefire_1995847658730649566926tmp
Running org.apache.hadoop.hbase.trace.TestHTraceHooks
Tests run: 1, Failures: 0, Errors: 0, Skipped: 0, Time elapsed: 8.532 sec
Forking command line: /bin/sh -c cd /x1/jenkins/jenkins-slave/workspace/hbase-0.95-on-hadoop2/0.95-on-hadoop2/hbase-server && /x1/jenkins/tools/java/jdk1.6.0_45-32/jre/bin/java -enableassertions -Xmx1900m -Djava.security.egd=file:/dev/./urandom -Djava.net.preferIPv4Stack=true -jar /x1/jenkins/jenkins-slave/workspace/hbase-0.95-on-hadoop2/0.95-on-hadoop2/hbase-server/target/surefire/surefirebooter5767761014098537794.jar /x1/jenkins/jenkins-slave/workspace/hbase-0.95-on-hadoop2/0.95-on-hadoop2/hbase-server/target/surefire/surefire5397307909433009755tmp /x1/jenkins/jenkins-slave/workspace/hbase-0.95-on-hadoop2/0.95-on-hadoop2/hbase-server/target/surefire/surefire_2005867787655586340567tmp
Running org.apache.hadoop.hbase.io.hfile.TestHFileSeek
Tests run: 1, Failures: 0, Errors: 0, Skipped: 0, Time elapsed: 3.621 sec
Forking command line: /bin/sh -c cd /x1/jenkins/jenkins-slave/workspace/hbase-0.95-on-hadoop2/0.95-on-hadoop2/hbase-server && /x1/jenkins/tools/java/jdk1.6.0_45-32/jre/bin/java -enableassertions -Xmx1900m -Djava.security.egd=file:/dev/./urandom -Djava.net.preferIPv4Stack=true -jar /x1/jenkins/jenkins-slave/workspace/hbase-0.95-on-hadoop2/0.95-on-hadoop2/hbase-server/target/surefire/surefirebooter2930618146880024210.jar /x1/jenkins/jenkins-slave/workspace/hbase-0.95-on-hadoop2/0.95-on-hadoop2/hbase-server/target/surefire/surefire3505951144422373362tmp /x1/jenkins/jenkins-slave/workspace/hbase-0.95-on-hadoop2/0.95-on-hadoop2/hbase-server/target/surefire/surefire_2012750847349576408640tmp
Running org.apache.hadoop.hbase.io.hfile.TestHFileBlockIndex
Tests run: 10, Failures: 0, Errors: 0, Skipped: 0, Time elapsed: 8.167 sec
Forking command line: /bin/sh -c cd /x1/jenkins/jenkins-slave/workspace/hbase-0.95-on-hadoop2/0.95-on-hadoop2/hbase-server && /x1/jenkins/tools/java/jdk1.6.0_45-32/jre/bin/java -enableassertions -Xmx1900m -Djava.security.egd=file:/dev/./urandom -Djava.net.preferIPv4Stack=true -jar /x1/jenkins/jenkins-slave/workspace/hbase-0.95-on-hadoop2/0.95-on-hadoop2/hbase-server/target/surefire/surefirebooter1972914572376065491.jar /x1/jenkins/jenkins-slave/workspace/hbase-0.95-on-hadoop2/0.95-on-hadoop2/hbase-server/target/surefire/surefire6079540745363723644tmp /x1/jenkins/jenkins-slave/workspace/hbase-0.95-on-hadoop2/0.95-on-hadoop2/hbase-server/target/surefire/surefire_2021446564695793665013tmp
Running org.apache.hadoop.hbase.io.hfile.TestHFilePerformance
Tests run: 1, Failures: 0, Errors: 0, Skipped: 0, Time elapsed: 4.515 sec
Forking command line: /bin/sh -c cd /x1/jenkins/jenkins-slave/workspace/hbase-0.95-on-hadoop2/0.95-on-hadoop2/hbase-server && /x1/jenkins/tools/java/jdk1.6.0_45-32/jre/bin/java -enableassertions -Xmx1900m -Djava.security.egd=file:/dev/./urandom -Djava.net.preferIPv4Stack=true -jar /x1/jenkins/jenkins-slave/workspace/hbase-0.95-on-hadoop2/0.95-on-hadoop2/hbase-server/target/surefire/surefirebooter6243036603226752024.jar /x1/jenkins/jenkins-slave/workspace/hbase-0.95-on-hadoop2/0.95-on-hadoop2/hbase-server/target/surefire/surefire6818082515378590601tmp /x1/jenkins/jenkins-slave/workspace/hbase-0.95-on-hadoop2/0.95-on-hadoop2/hbase-server/target/surefire/surefire_2032401591304587744812tmp
Running org.apache.hadoop.hbase.io.hfile.TestForceCacheImportantBlocks
Tests run: 2, Failures: 0, Errors: 0, Skipped: 0, Time elapsed: 19.897 sec
Forking command line: /bin/sh -c cd /x1/jenkins/jenkins-slave/workspace/hbase-0.95-on-hadoop2/0.95-on-hadoop2/hbase-server && /x1/jenkins/tools/java/jdk1.6.0_45-32/jre/bin/java -enableassertions -Xmx1900m -Djava.security.egd=file:/dev/./urandom -Djava.net.preferIPv4Stack=true -jar /x1/jenkins/jenkins-slave/workspace/hbase-0.95-on-hadoop2/0.95-on-hadoop2/hbase-server/target/surefire/surefirebooter3000944486373332521.jar /x1/jenkins/jenkins-slave/workspace/hbase-0.95-on-hadoop2/0.95-on-hadoop2/hbase-server/target/surefire/surefire5431672997699855186tmp /x1/jenkins/jenkins-slave/workspace/hbase-0.95-on-hadoop2/0.95-on-hadoop2/hbase-server/target/surefire/surefire_2041319017649999060809tmp
Running org.apache.hadoop.hbase.security.access.TestAccessController
Tests run: 37, Failures: 0, Errors: 0, Skipped: 0, Time elapsed: 125.1 sec
Forking command line: /bin/sh -c cd /x1/jenkins/jenkins-slave/workspace/hbase-0.95-on-hadoop2/0.95-on-hadoop2/hbase-server && /x1/jenkins/tools/java/jdk1.6.0_45-32/jre/bin/java -enableassertions -Xmx1900m -Djava.security.egd=file:/dev/./urandom -Djava.net.preferIPv4Stack=true -jar /x1/jenkins/jenkins-slave/workspace/hbase-0.95-on-hadoop2/0.95-on-hadoop2/hbase-server/target/surefire/surefirebooter1176207538459959999.jar /x1/jenkins/jenkins-slave/workspace/hbase-0.95-on-hadoop2/0.95-on-hadoop2/hbase-server/target/surefire/surefire8111691474507898750tmp /x1/jenkins/jenkins-slave/workspace/hbase-0.95-on-hadoop2/0.95-on-hadoop2/hbase-server/target/surefire/surefire_205829778662924918010tmp
Running org.apache.hadoop.hbase.io.hfile.TestCacheOnWrite
Tests run: 36, Failures: 0, Errors: 0, Skipped: 0, Time elapsed: 32.425 sec
Forking command line: /bin/sh -c cd /x1/jenkins/jenkins-slave/workspace/hbase-0.95-on-hadoop2/0.95-on-hadoop2/hbase-server && /x1/jenkins/tools/java/jdk1.6.0_45-32/jre/bin/java -enableassertions -Xmx1900m -Djava.security.egd=file:/dev/./urandom -Djava.net.preferIPv4Stack=true -jar /x1/jenkins/jenkins-slave/workspace/hbase-0.95-on-hadoop2/0.95-on-hadoop2/hbase-server/target/surefire/surefirebooter1212842812499220295.jar /x1/jenkins/jenkins-slave/workspace/hbase-0.95-on-hadoop2/0.95-on-hadoop2/hbase-server/target/surefire/surefire282723343469713370tmp /x1/jenkins/jenkins-slave/workspace/hbase-0.95-on-hadoop2/0.95-on-hadoop2/hbase-server/target/surefire/surefire_2067866944458269413308tmp
Running org.apache.hadoop.hbase.io.hfile.slab.TestSlabCache
Tests run: 7, Failures: 0, Errors: 0, Skipped: 0, Time elapsed: 16.875 sec
Forking command line: /bin/sh -c cd /x1/jenkins/jenkins-slave/workspace/hbase-0.95-on-hadoop2/0.95-on-hadoop2/hbase-server && /x1/jenkins/tools/java/jdk1.6.0_45-32/jre/bin/java -enableassertions -Xmx1900m -Djava.security.egd=file:/dev/./urandom -Djava.net.preferIPv4Stack=true -jar /x1/jenkins/jenkins-slave/workspace/hbase-0.95-on-hadoop2/0.95-on-hadoop2/hbase-server/target/surefire/surefirebooter1208172980547823420.jar /x1/jenkins/jenkins-slave/workspace/hbase-0.95-on-hadoop2/0.95-on-hadoop2/hbase-server/target/surefire/surefire3712105536981554007tmp /x1/jenkins/jenkins-slave/workspace/hbase-0.95-on-hadoop2/0.95-on-hadoop2/hbase-server/target/surefire/surefire_2071922136676117843559tmp
Running org.apache.hadoop.hbase.io.TestFileLink
Tests run: 3, Failures: 0, Errors: 0, Skipped: 0, Time elapsed: 16.582 sec
Forking command line: /bin/sh -c cd /x1/jenkins/jenkins-slave/workspace/hbase-0.95-on-hadoop2/0.95-on-hadoop2/hbase-server && /x1/jenkins/tools/java/jdk1.6.0_45-32/jre/bin/java -enableassertions -Xmx1900m -Djava.security.egd=file:/dev/./urandom -Djava.net.preferIPv4Stack=true -jar /x1/jenkins/jenkins-slave/workspace/hbase-0.95-on-hadoop2/0.95-on-hadoop2/hbase-server/target/surefire/surefirebooter8964978821524058248.jar /x1/jenkins/jenkins-slave/workspace/hbase-0.95-on-hadoop2/0.95-on-hadoop2/hbase-server/target/surefire/surefire7974746229470684875tmp /x1/jenkins/jenkins-slave/workspace/hbase-0.95-on-hadoop2/0.95-on-hadoop2/hbase-server/target/surefire/surefire_2086678171703917651255tmp
Running org.apache.hadoop.hbase.io.hfile.slab.TestSingleSizeCache
Tests run: 5, Failures: 0, Errors: 0, Skipped: 0, Time elapsed: 25.666 sec
Forking command line: /bin/sh -c cd /x1/jenkins/jenkins-slave/workspace/hbase-0.95-on-hadoop2/0.95-on-hadoop2/hbase-server && /x1/jenkins/tools/java/jdk1.6.0_45-32/jre/bin/java -enableassertions -Xmx1900m -Djava.security.egd=file:/dev/./urandom -Djava.net.preferIPv4Stack=true -jar /x1/jenkins/jenkins-slave/workspace/hbase-0.95-on-hadoop2/0.95-on-hadoop2/hbase-server/target/surefire/surefirebooter1313227404570456914.jar /x1/jenkins/jenkins-slave/workspace/hbase-0.95-on-hadoop2/0.95-on-hadoop2/hbase-server/target/surefire/surefire3503491750742360709tmp /x1/jenkins/jenkins-slave/workspace/hbase-0.95-on-hadoop2/0.95-on-hadoop2/hbase-server/target/surefire/surefire_2098415108000529541473tmp
Running org.apache.hadoop.hbase.io.hfile.TestHFileBlock
Tests run: 14, Failures: 0, Errors: 0, Skipped: 0, Time elapsed: 49.654 sec
Forking command line: /bin/sh -c cd /x1/jenkins/jenkins-slave/workspace/hbase-0.95-on-hadoop2/0.95-on-hadoop2/hbase-server && /x1/jenkins/tools/java/jdk1.6.0_45-32/jre/bin/java -enableassertions -Xmx1900m -Djava.security.egd=file:/dev/./urandom -Djava.net.preferIPv4Stack=true -jar /x1/jenkins/jenkins-slave/workspace/hbase-0.95-on-hadoop2/0.95-on-hadoop2/hbase-server/target/surefire/surefirebooter1859662365980028799.jar /x1/jenkins/jenkins-slave/workspace/hbase-0.95-on-hadoop2/0.95-on-hadoop2/hbase-server/target/surefire/surefire3837771346341482454tmp /x1/jenkins/jenkins-slave/workspace/hbase-0.95-on-hadoop2/0.95-on-hadoop2/hbase-server/target/surefire/surefire_2108926496921701565047tmp
Running org.apache.hadoop.hbase.io.hfile.TestScannerSelectionUsingTTL
Tests run: 6, Failures: 0, Errors: 0, Skipped: 0, Time elapsed: 62.131 sec
Forking command line: /bin/sh -c cd /x1/jenkins/jenkins-slave/workspace/hbase-0.95-on-hadoop2/0.95-on-hadoop2/hbase-server && /x1/jenkins/tools/java/jdk1.6.0_45-32/jre/bin/java -enableassertions -Xmx1900m -Djava.security.egd=file:/dev/./urandom -Djava.net.preferIPv4Stack=true -jar /x1/jenkins/jenkins-slave/workspace/hbase-0.95-on-hadoop2/0.95-on-hadoop2/hbase-server/target/surefire/surefirebooter7349718861676009414.jar /x1/jenkins/jenkins-slave/workspace/hbase-0.95-on-hadoop2/0.95-on-hadoop2/hbase-server/target/surefire/surefire7119271271526246541tmp /x1/jenkins/jenkins-slave/workspace/hbase-0.95-on-hadoop2/0.95-on-hadoop2/hbase-server/target/surefire/surefire_2115617649361926092005tmp
Running org.apache.hadoop.hbase.io.encoding.TestBufferedDataBlockEncoder
Tests run: 1, Failures: 0, Errors: 0, Skipped: 0, Time elapsed: 18.752 sec
Forking command line: /bin/sh -c cd /x1/jenkins/jenkins-slave/workspace/hbase-0.95-on-hadoop2/0.95-on-hadoop2/hbase-server && /x1/jenkins/tools/java/jdk1.6.0_45-32/jre/bin/java -enableassertions -Xmx1900m -Djava.security.egd=file:/dev/./urandom -Djava.net.preferIPv4Stack=true -jar /x1/jenkins/jenkins-slave/workspace/hbase-0.95-on-hadoop2/0.95-on-hadoop2/hbase-server/target/surefire/surefirebooter3800214990605929852.jar /x1/jenkins/jenkins-slave/workspace/hbase-0.95-on-hadoop2/0.95-on-hadoop2/hbase-server/target/surefire/surefire8092348599796053233tmp /x1/jenkins/jenkins-slave/workspace/hbase-0.95-on-hadoop2/0.95-on-hadoop2/hbase-server/target/surefire/surefire_2122156954602909873340tmp
Running org.apache.hadoop.hbase.io.encoding.TestEncodedSeekers
Tests run: 10, Failures: 0, Errors: 0, Skipped: 0, Time elapsed: 32.54 sec
Forking command line: /bin/sh -c cd /x1/jenkins/jenkins-slave/workspace/hbase-0.95-on-hadoop2/0.95-on-hadoop2/hbase-server && /x1/jenkins/tools/java/jdk1.6.0_45-32/jre/bin/java -enableassertions -Xmx1900m -Djava.security.egd=file:/dev/./urandom -Djava.net.preferIPv4Stack=true -jar /x1/jenkins/jenkins-slave/workspace/hbase-0.95-on-hadoop2/0.95-on-hadoop2/hbase-server/target/surefire/surefirebooter2738143570653976254.jar /x1/jenkins/jenkins-slave/workspace/hbase-0.95-on-hadoop2/0.95-on-hadoop2/hbase-server/target/surefire/surefire7264676389522619940tmp /x1/jenkins/jenkins-slave/workspace/hbase-0.95-on-hadoop2/0.95-on-hadoop2/hbase-server/target/surefire/surefire_2137900999270675474435tmp
Running org.apache.hadoop.hbase.TestRegionRebalancing
Tests run: 2, Failures: 0, Errors: 0, Skipped: 0, Time elapsed: 23.374 sec
Forking command line: /bin/sh -c cd /x1/jenkins/jenkins-slave/workspace/hbase-0.95-on-hadoop2/0.95-on-hadoop2/hbase-server && /x1/jenkins/tools/java/jdk1.6.0_45-32/jre/bin/java -enableassertions -Xmx1900m -Djava.security.egd=file:/dev/./urandom -Djava.net.preferIPv4Stack=true -jar /x1/jenkins/jenkins-slave/workspace/hbase-0.95-on-hadoop2/0.95-on-hadoop2/hbase-server/target/surefire/surefirebooter2875750969228949151.jar /x1/jenkins/jenkins-slave/workspace/hbase-0.95-on-hadoop2/0.95-on-hadoop2/hbase-server/target/surefire/surefire689629960300993511tmp /x1/jenkins/jenkins-slave/workspace/hbase-0.95-on-hadoop2/0.95-on-hadoop2/hbase-server/target/surefire/surefire_2142994788292109968136tmp
Running org.apache.hadoop.hbase.io.encoding.TestLoadAndSwitchEncodeOnDisk
Tests run: 1, Failures: 0, Errors: 0, Skipped: 0, Time elapsed: 34.93 sec
Forking command line: /bin/sh -c cd /x1/jenkins/jenkins-slave/workspace/hbase-0.95-on-hadoop2/0.95-on-hadoop2/hbase-server && /x1/jenkins/tools/java/jdk1.6.0_45-32/jre/bin/java -enableassertions -Xmx1900m -Djava.security.egd=file:/dev/./urandom -Djava.net.preferIPv4Stack=true -jar /x1/jenkins/jenkins-slave/workspace/hbase-0.95-on-hadoop2/0.95-on-hadoop2/hbase-server/target/surefire/surefirebooter7379403123262125457.jar /x1/jenkins/jenkins-slave/workspace/hbase-0.95-on-hadoop2/0.95-on-hadoop2/hbase-server/target/surefire/surefire4805931234143913698tmp /x1/jenkins/jenkins-slave/workspace/hbase-0.95-on-hadoop2/0.95-on-hadoop2/hbase-server/target/surefire/surefire_2156879652156036142125tmp
Running org.apache.hadoop.hbase.mapred.TestTableInputFormat
Tests run: 10, Failures: 0, Errors: 0, Skipped: 0, Time elapsed: 18.415 sec
Forking command line: /bin/sh -c cd /x1/jenkins/jenkins-slave/workspace/hbase-0.95-on-hadoop2/0.95-on-hadoop2/hbase-server && /x1/jenkins/tools/java/jdk1.6.0_45-32/jre/bin/java -enableassertions -Xmx1900m -Djava.security.egd=file:/dev/./urandom -Djava.net.preferIPv4Stack=true -jar /x1/jenkins/jenkins-slave/workspace/hbase-0.95-on-hadoop2/0.95-on-hadoop2/hbase-server/target/surefire/surefirebooter1046585218009267758.jar /x1/jenkins/jenkins-slave/workspace/hbase-0.95-on-hadoop2/0.95-on-hadoop2/hbase-server/target/surefire/surefire2241397034799867864tmp /x1/jenkins/jenkins-slave/workspace/hbase-0.95-on-hadoop2/0.95-on-hadoop2/hbase-server/target/surefire/surefire_2161395961171819679185tmp
Running org.apache.hadoop.hbase.io.encoding.TestDataBlockEncoders
Tests run: 12, Failures: 0, Errors: 0, Skipped: 0, Time elapsed: 88.892 sec
Forking command line: /bin/sh -c cd /x1/jenkins/jenkins-slave/workspace/hbase-0.95-on-hadoop2/0.95-on-hadoop2/hbase-server && /x1/jenkins/tools/java/jdk1.6.0_45-32/jre/bin/java -enableassertions -Xmx1900m -Djava.security.egd=file:/dev/./urandom -Djava.net.preferIPv4Stack=true -jar /x1/jenkins/jenkins-slave/workspace/hbase-0.95-on-hadoop2/0.95-on-hadoop2/hbase-server/target/surefire/surefirebooter6674955143133128030.jar /x1/jenkins/jenkins-slave/workspace/hbase-0.95-on-hadoop2/0.95-on-hadoop2/hbase-server/target/surefire/surefire3575610290432496118tmp /x1/jenkins/jenkins-slave/workspace/hbase-0.95-on-hadoop2/0.95-on-hadoop2/hbase-server/target/surefire/surefire_217674686806182803676tmp
Running org.apache.hadoop.hbase.mapred.TestTableMapReduce
Tests run: 1, Failures: 0, Errors: 0, Skipped: 0, Time elapsed: 41.877 sec
Forking command line: /bin/sh -c cd /x1/jenkins/jenkins-slave/workspace/hbase-0.95-on-hadoop2/0.95-on-hadoop2/hbase-server && /x1/jenkins/tools/java/jdk1.6.0_45-32/jre/bin/java -enableassertions -Xmx1900m -Djava.security.egd=file:/dev/./urandom -Djava.net.preferIPv4Stack=true -jar /x1/jenkins/jenkins-slave/workspace/hbase-0.95-on-hadoop2/0.95-on-hadoop2/hbase-server/target/surefire/surefirebooter5321964855234384507.jar /x1/jenkins/jenkins-slave/workspace/hbase-0.95-on-hadoop2/0.95-on-hadoop2/hbase-server/target/surefire/surefire8520658417835130857tmp /x1/jenkins/jenkins-slave/workspace/hbase-0.95-on-hadoop2/0.95-on-hadoop2/hbase-server/target/surefire/surefire_2184811077767525122943tmp
Running org.apache.hadoop.hbase.replication.TestReplicationDisableInactivePeer
Tests run: 1, Failures: 0, Errors: 0, Skipped: 0, Time elapsed: 32.743 sec
Forking command line: /bin/sh -c cd /x1/jenkins/jenkins-slave/workspace/hbase-0.95-on-hadoop2/0.95-on-hadoop2/hbase-server && /x1/jenkins/tools/java/jdk1.6.0_45-32/jre/bin/java -enableassertions -Xmx1900m -Djava.security.egd=file:/dev/./urandom -Djava.net.preferIPv4Stack=true -jar /x1/jenkins/jenkins-slave/workspace/hbase-0.95-on-hadoop2/0.95-on-hadoop2/hbase-server/target/surefire/surefirebooter1757419523773295053.jar /x1/jenkins/jenkins-slave/workspace/hbase-0.95-on-hadoop2/0.95-on-hadoop2/hbase-server/target/surefire/surefire7359007347152772814tmp /x1/jenkins/jenkins-slave/workspace/hbase-0.95-on-hadoop2/0.95-on-hadoop2/hbase-server/target/surefire/surefire_2191734336617977742258tmp
Running org.apache.hadoop.hbase.replication.TestReplicationZookeeper
Tests run: 4, Failures: 0, Errors: 0, Skipped: 0, Time elapsed: 0.954 sec
Forking command line: /bin/sh -c cd /x1/jenkins/jenkins-slave/workspace/hbase-0.95-on-hadoop2/0.95-on-hadoop2/hbase-server && /x1/jenkins/tools/java/jdk1.6.0_45-32/jre/bin/java -enableassertions -Xmx1900m -Djava.security.egd=file:/dev/./urandom -Djava.net.preferIPv4Stack=true -jar /x1/jenkins/jenkins-slave/workspace/hbase-0.95-on-hadoop2/0.95-on-hadoop2/hbase-server/target/surefire/surefirebooter6585330942109726580.jar /x1/jenkins/jenkins-slave/workspace/hbase-0.95-on-hadoop2/0.95-on-hadoop2/hbase-server/target/surefire/surefire99438615332954092tmp /x1/jenkins/jenkins-slave/workspace/hbase-0.95-on-hadoop2/0.95-on-hadoop2/hbase-server/target/surefire/surefire_2202841855259841969324tmp
Running org.apache.hadoop.hbase.replication.regionserver.TestReplicationSink
Tests run: 5, Failures: 0, Errors: 0, Skipped: 0, Time elapsed: 11.567 sec
Forking command line: /bin/sh -c cd /x1/jenkins/jenkins-slave/workspace/hbase-0.95-on-hadoop2/0.95-on-hadoop2/hbase-server && /x1/jenkins/tools/java/jdk1.6.0_45-32/jre/bin/java -enableassertions -Xmx1900m -Djava.security.egd=file:/dev/./urandom -Djava.net.preferIPv4Stack=true -jar /x1/jenkins/jenkins-slave/workspace/hbase-0.95-on-hadoop2/0.95-on-hadoop2/hbase-server/target/surefire/surefirebooter4375075395522790566.jar /x1/jenkins/jenkins-slave/workspace/hbase-0.95-on-hadoop2/0.95-on-hadoop2/hbase-server/target/surefire/surefire375545072990654657tmp /x1/jenkins/jenkins-slave/workspace/hbase-0.95-on-hadoop2/0.95-on-hadoop2/hbase-server/target/surefire/surefire_2218584087930465844409tmp
Running org.apache.hadoop.hbase.replication.regionserver.TestReplicationSourceManager
Tests run: 3, Failures: 0, Errors: 0, Skipped: 0, Time elapsed: 1.784 sec
Forking command line: /bin/sh -c cd /x1/jenkins/jenkins-slave/workspace/hbase-0.95-on-hadoop2/0.95-on-hadoop2/hbase-server && /x1/jenkins/tools/java/jdk1.6.0_45-32/jre/bin/java -enableassertions -Xmx1900m -Djava.security.egd=file:/dev/./urandom -Djava.net.preferIPv4Stack=true -jar /x1/jenkins/jenkins-slave/workspace/hbase-0.95-on-hadoop2/0.95-on-hadoop2/hbase-server/target/surefire/surefirebooter4061338233256055378.jar /x1/jenkins/jenkins-slave/workspace/hbase-0.95-on-hadoop2/0.95-on-hadoop2/hbase-server/target/surefire/surefire3613298592851719084tmp /x1/jenkins/jenkins-slave/workspace/hbase-0.95-on-hadoop2/0.95-on-hadoop2/hbase-server/target/surefire/surefire_2225512956153969113162tmp
Running org.apache.hadoop.hbase.replication.TestReplicationSource
Tests run: 1, Failures: 0, Errors: 0, Skipped: 0, Time elapsed: 3.286 sec
Forking command line: /bin/sh -c cd /x1/jenkins/jenkins-slave/workspace/hbase-0.95-on-hadoop2/0.95-on-hadoop2/hbase-server && /x1/jenkins/tools/java/jdk1.6.0_45-32/jre/bin/java -enableassertions -Xmx1900m -Djava.security.egd=file:/dev/./urandom -Djava.net.preferIPv4Stack=true -jar /x1/jenkins/jenkins-slave/workspace/hbase-0.95-on-hadoop2/0.95-on-hadoop2/hbase-server/target/surefire/surefirebooter9155658704414612407.jar /x1/jenkins/jenkins-slave/workspace/hbase-0.95-on-hadoop2/0.95-on-hadoop2/hbase-server/target/surefire/surefire6179503451276018807tmp /x1/jenkins/jenkins-slave/workspace/hbase-0.95-on-hadoop2/0.95-on-hadoop2/hbase-server/target/surefire/surefire_2238630620836846978811tmp
Running org.apache.hadoop.hbase.replication.TestMultiSlaveReplication
Tests run: 1, Failures: 0, Errors: 0, Skipped: 0, Time elapsed: 24.436 sec
Forking command line: /bin/sh -c cd /x1/jenkins/jenkins-slave/workspace/hbase-0.95-on-hadoop2/0.95-on-hadoop2/hbase-server && /x1/jenkins/tools/java/jdk1.6.0_45-32/jre/bin/java -enableassertions -Xmx1900m -Djava.security.egd=file:/dev/./urandom -Djava.net.preferIPv4Stack=true -jar /x1/jenkins/jenkins-slave/workspace/hbase-0.95-on-hadoop2/0.95-on-hadoop2/hbase-server/target/surefire/surefirebooter1202676476398600843.jar /x1/jenkins/jenkins-slave/workspace/hbase-0.95-on-hadoop2/0.95-on-hadoop2/hbase-server/target/surefire/surefire8124436105651470016tmp /x1/jenkins/jenkins-slave/workspace/hbase-0.95-on-hadoop2/0.95-on-hadoop2/hbase-server/target/surefire/surefire_224134396125407742266tmp
Running org.apache.hadoop.hbase.replication.TestReplicationStateZKImpl
Tests run: 3, Failures: 0, Errors: 0, Skipped: 0, Time elapsed: 1.872 sec
Forking command line: /bin/sh -c cd /x1/jenkins/jenkins-slave/workspace/hbase-0.95-on-hadoop2/0.95-on-hadoop2/hbase-server && /x1/jenkins/tools/java/jdk1.6.0_45-32/jre/bin/java -enableassertions -Xmx1900m -Djava.security.egd=file:/dev/./urandom -Djava.net.preferIPv4Stack=true -jar /x1/jenkins/jenkins-slave/workspace/hbase-0.95-on-hadoop2/0.95-on-hadoop2/hbase-server/target/surefire/surefirebooter2333607339442582318.jar /x1/jenkins/jenkins-slave/workspace/hbase-0.95-on-hadoop2/0.95-on-hadoop2/hbase-server/target/surefire/surefire4153830773691284320tmp /x1/jenkins/jenkins-slave/workspace/hbase-0.95-on-hadoop2/0.95-on-hadoop2/hbase-server/target/surefire/surefire_2254650851543454955016tmp
Running org.apache.hadoop.hbase.io.encoding.TestChangingEncoding
Tests run: 4, Failures: 0, Errors: 0, Skipped: 0, Time elapsed: 159.616 sec
Forking command line: /bin/sh -c cd /x1/jenkins/jenkins-slave/workspace/hbase-0.95-on-hadoop2/0.95-on-hadoop2/hbase-server && /x1/jenkins/tools/java/jdk1.6.0_45-32/jre/bin/java -enableassertions -Xmx1900m -Djava.security.egd=file:/dev/./urandom -Djava.net.preferIPv4Stack=true -jar /x1/jenkins/jenkins-slave/workspace/hbase-0.95-on-hadoop2/0.95-on-hadoop2/hbase-server/target/surefire/surefirebooter4775728167151497940.jar /x1/jenkins/jenkins-slave/workspace/hbase-0.95-on-hadoop2/0.95-on-hadoop2/hbase-server/target/surefire/surefire8032191180212882751tmp /x1/jenkins/jenkins-slave/workspace/hbase-0.95-on-hadoop2/0.95-on-hadoop2/hbase-server/target/surefire/surefire_2265834234813131717890tmp
Running org.apache.hadoop.hbase.replication.TestReplicationQueueFailoverCompressed
Tests run: 1, Failures: 0, Errors: 0, Skipped: 0, Time elapsed: 89.545 sec
Forking command line: /bin/sh -c cd /x1/jenkins/jenkins-slave/workspace/hbase-0.95-on-hadoop2/0.95-on-hadoop2/hbase-server && /x1/jenkins/tools/java/jdk1.6.0_45-32/jre/bin/java -enableassertions -Xmx1900m -Djava.security.egd=file:/dev/./urandom -Djava.net.preferIPv4Stack=true -jar /x1/jenkins/jenkins-slave/workspace/hbase-0.95-on-hadoop2/0.95-on-hadoop2/hbase-server/target/surefire/surefirebooter7596733340724585465.jar /x1/jenkins/jenkins-slave/workspace/hbase-0.95-on-hadoop2/0.95-on-hadoop2/hbase-server/target/surefire/surefire7351799067865872979tmp /x1/jenkins/jenkins-slave/workspace/hbase-0.95-on-hadoop2/0.95-on-hadoop2/hbase-server/target/surefire/surefire_2276102067085860626801tmp
Running org.apache.hadoop.hbase.replication.TestMasterReplication
Tests run: 2, Failures: 0, Errors: 0, Skipped: 0, Time elapsed: 38.143 sec
Forking command line: /bin/sh -c cd /x1/jenkins/jenkins-slave/workspace/hbase-0.95-on-hadoop2/0.95-on-hadoop2/hbase-server && /x1/jenkins/tools/java/jdk1.6.0_45-32/jre/bin/java -enableassertions -Xmx1900m -Djava.security.egd=file:/dev/./urandom -Djava.net.preferIPv4Stack=true -jar /x1/jenkins/jenkins-slave/workspace/hbase-0.95-on-hadoop2/0.95-on-hadoop2/hbase-server/target/surefire/surefirebooter6904344634978158085.jar /x1/jenkins/jenkins-slave/workspace/hbase-0.95-on-hadoop2/0.95-on-hadoop2/hbase-server/target/surefire/surefire4089747279121291370tmp /x1/jenkins/jenkins-slave/workspace/hbase-0.95-on-hadoop2/0.95-on-hadoop2/hbase-server/target/surefire/surefire_2286530214001598712179tmp
Running org.apache.hadoop.hbase.util.TestFSTableDescriptors
Tests run: 12, Failures: 0, Errors: 0, Skipped: 0, Time elapsed: 1.448 sec
Forking command line: /bin/sh -c cd /x1/jenkins/jenkins-slave/workspace/hbase-0.95-on-hadoop2/0.95-on-hadoop2/hbase-server && /x1/jenkins/tools/java/jdk1.6.0_45-32/jre/bin/java -enableassertions -Xmx1900m -Djava.security.egd=file:/dev/./urandom -Djava.net.preferIPv4Stack=true -jar /x1/jenkins/jenkins-slave/workspace/hbase-0.95-on-hadoop2/0.95-on-hadoop2/hbase-server/target/surefire/surefirebooter1999791401471622214.jar /x1/jenkins/jenkins-slave/workspace/hbase-0.95-on-hadoop2/0.95-on-hadoop2/hbase-server/target/surefire/surefire2270248202297855483tmp /x1/jenkins/jenkins-slave/workspace/hbase-0.95-on-hadoop2/0.95-on-hadoop2/hbase-server/target/surefire/surefire_2296633145930935058777tmp
Running org.apache.hadoop.hbase.util.TestMergeTool
Tests run: 1, Failures: 0, Errors: 0, Skipped: 0, Time elapsed: 15.472 sec
Forking command line: /bin/sh -c cd /x1/jenkins/jenkins-slave/workspace/hbase-0.95-on-hadoop2/0.95-on-hadoop2/hbase-server && /x1/jenkins/tools/java/jdk1.6.0_45-32/jre/bin/java -enableassertions -Xmx1900m -Djava.security.egd=file:/dev/./urandom -Djava.net.preferIPv4Stack=true -jar /x1/jenkins/jenkins-slave/workspace/hbase-0.95-on-hadoop2/0.95-on-hadoop2/hbase-server/target/surefire/surefirebooter6207389815231533528.jar /x1/jenkins/jenkins-slave/workspace/hbase-0.95-on-hadoop2/0.95-on-hadoop2/hbase-server/target/surefire/surefire5011126907654130982tmp /x1/jenkins/jenkins-slave/workspace/hbase-0.95-on-hadoop2/0.95-on-hadoop2/hbase-server/target/surefire/surefire_2308865637880406996451tmp
Running org.apache.hadoop.hbase.replication.TestReplicationQueueFailover
Tests run: 1, Failures: 0, Errors: 0, Skipped: 0, Time elapsed: 100.74 sec
Forking command line: /bin/sh -c cd /x1/jenkins/jenkins-slave/workspace/hbase-0.95-on-hadoop2/0.95-on-hadoop2/hbase-server && /x1/jenkins/tools/java/jdk1.6.0_45-32/jre/bin/java -enableassertions -Xmx1900m -Djava.security.egd=file:/dev/./urandom -Djava.net.preferIPv4Stack=true -jar /x1/jenkins/jenkins-slave/workspace/hbase-0.95-on-hadoop2/0.95-on-hadoop2/hbase-server/target/surefire/surefirebooter7259885149292952213.jar /x1/jenkins/jenkins-slave/workspace/hbase-0.95-on-hadoop2/0.95-on-hadoop2/hbase-server/target/surefire/surefire7154230752840369332tmp /x1/jenkins/jenkins-slave/workspace/hbase-0.95-on-hadoop2/0.95-on-hadoop2/hbase-server/target/surefire/surefire_2315242641592609635092tmp
Running org.apache.hadoop.hbase.util.TestIdLock
Tests run: 1, Failures: 0, Errors: 0, Skipped: 0, Time elapsed: 15.381 sec
Forking command line: /bin/sh -c cd /x1/jenkins/jenkins-slave/workspace/hbase-0.95-on-hadoop2/0.95-on-hadoop2/hbase-server && /x1/jenkins/tools/java/jdk1.6.0_45-32/jre/bin/java -enableassertions -Xmx1900m -Djava.security.egd=file:/dev/./urandom -Djava.net.preferIPv4Stack=true -jar /x1/jenkins/jenkins-slave/workspace/hbase-0.95-on-hadoop2/0.95-on-hadoop2/hbase-server/target/surefire/surefirebooter8703359381146472329.jar /x1/jenkins/jenkins-slave/workspace/hbase-0.95-on-hadoop2/0.95-on-hadoop2/hbase-server/target/surefire/surefire1698523506585611506tmp /x1/jenkins/jenkins-slave/workspace/hbase-0.95-on-hadoop2/0.95-on-hadoop2/hbase-server/target/surefire/surefire_2328445242392707867566tmp
Running org.apache.hadoop.hbase.util.TestMergeTable
Tests run: 1, Failures: 0, Errors: 0, Skipped: 0, Time elapsed: 19.976 sec
Forking command line: /bin/sh -c cd /x1/jenkins/jenkins-slave/workspace/hbase-0.95-on-hadoop2/0.95-on-hadoop2/hbase-server && /x1/jenkins/tools/java/jdk1.6.0_45-32/jre/bin/java -enableassertions -Xmx1900m -Djava.security.egd=file:/dev/./urandom -Djava.net.preferIPv4Stack=true -jar /x1/jenkins/jenkins-slave/workspace/hbase-0.95-on-hadoop2/0.95-on-hadoop2/hbase-server/target/surefire/surefirebooter3346360921995481493.jar /x1/jenkins/jenkins-slave/workspace/hbase-0.95-on-hadoop2/0.95-on-hadoop2/hbase-server/target/surefire/surefire4840422231213155828tmp /x1/jenkins/jenkins-slave/workspace/hbase-0.95-on-hadoop2/0.95-on-hadoop2/hbase-server/target/surefire/surefire_2333550836310674102415tmp
Running org.apache.hadoop.hbase.replication.TestReplicationSmallTests
Tests run: 8, Failures: 0, Errors: 0, Skipped: 0, Time elapsed: 74.687 sec
Forking command line: /bin/sh -c cd /x1/jenkins/jenkins-slave/workspace/hbase-0.95-on-hadoop2/0.95-on-hadoop2/hbase-server && /x1/jenkins/tools/java/jdk1.6.0_45-32/jre/bin/java -enableassertions -Xmx1900m -Djava.security.egd=file:/dev/./urandom -Djava.net.preferIPv4Stack=true -jar /x1/jenkins/jenkins-slave/workspace/hbase-0.95-on-hadoop2/0.95-on-hadoop2/hbase-server/target/surefire/surefirebooter8185207110661484309.jar /x1/jenkins/jenkins-slave/workspace/hbase-0.95-on-hadoop2/0.95-on-hadoop2/hbase-server/target/surefire/surefire1058053861986955855tmp /x1/jenkins/jenkins-slave/workspace/hbase-0.95-on-hadoop2/0.95-on-hadoop2/hbase-server/target/surefire/surefire_2341069634981190621283tmp
Running org.apache.hadoop.hbase.util.TestFSUtils
Tests run: 7, Failures: 0, Errors: 0, Skipped: 0, Time elapsed: 9.477 sec
Forking command line: /bin/sh -c cd /x1/jenkins/jenkins-slave/workspace/hbase-0.95-on-hadoop2/0.95-on-hadoop2/hbase-server && /x1/jenkins/tools/java/jdk1.6.0_45-32/jre/bin/java -enableassertions -Xmx1900m -Djava.security.egd=file:/dev/./urandom -Djava.net.preferIPv4Stack=true -jar /x1/jenkins/jenkins-slave/workspace/hbase-0.95-on-hadoop2/0.95-on-hadoop2/hbase-server/target/surefire/surefirebooter8598945495601210984.jar /x1/jenkins/jenkins-slave/workspace/hbase-0.95-on-hadoop2/0.95-on-hadoop2/hbase-server/target/surefire/surefire7127757030797466105tmp /x1/jenkins/jenkins-slave/workspace/hbase-0.95-on-hadoop2/0.95-on-hadoop2/hbase-server/target/surefire/surefire_2356070063139418515444tmp
Running org.apache.hadoop.hbase.util.TestRegionSplitter
Tests run: 5, Failures: 0, Errors: 0, Skipped: 0, Time elapsed: 11.853 sec
Forking command line: /bin/sh -c cd /x1/jenkins/jenkins-slave/workspace/hbase-0.95-on-hadoop2/0.95-on-hadoop2/hbase-server && /x1/jenkins/tools/java/jdk1.6.0_45-32/jre/bin/java -enableassertions -Xmx1900m -Djava.security.egd=file:/dev/./urandom -Djava.net.preferIPv4Stack=true -jar /x1/jenkins/jenkins-slave/workspace/hbase-0.95-on-hadoop2/0.95-on-hadoop2/hbase-server/target/surefire/surefirebooter7110075572457578475.jar /x1/jenkins/jenkins-slave/workspace/hbase-0.95-on-hadoop2/0.95-on-hadoop2/hbase-server/target/surefire/surefire1438034943995729385tmp /x1/jenkins/jenkins-slave/workspace/hbase-0.95-on-hadoop2/0.95-on-hadoop2/hbase-server/target/surefire/surefire_2367486207934067295853tmp
Running org.apache.hadoop.hbase.util.TestProcessBasedCluster
Tests run: 1, Failures: 0, Errors: 0, Skipped: 0, Time elapsed: 0.438 sec
Forking command line: /bin/sh -c cd /x1/jenkins/jenkins-slave/workspace/hbase-0.95-on-hadoop2/0.95-on-hadoop2/hbase-server && /x1/jenkins/tools/java/jdk1.6.0_45-32/jre/bin/java -enableassertions -Xmx1900m -Djava.security.egd=file:/dev/./urandom -Djava.net.preferIPv4Stack=true -jar /x1/jenkins/jenkins-slave/workspace/hbase-0.95-on-hadoop2/0.95-on-hadoop2/hbase-server/target/surefire/surefirebooter4613302857666824809.jar /x1/jenkins/jenkins-slave/workspace/hbase-0.95-on-hadoop2/0.95-on-hadoop2/hbase-server/target/surefire/surefire2624564397978025936tmp /x1/jenkins/jenkins-slave/workspace/hbase-0.95-on-hadoop2/0.95-on-hadoop2/hbase-server/target/surefire/surefire_2376655716922336850114tmp
Running org.apache.hadoop.hbase.util.TestMiniClusterLoadEncoded
Tests run: 5, Failures: 0, Errors: 0, Skipped: 0, Time elapsed: 52.858 sec
Forking command line: /bin/sh -c cd /x1/jenkins/jenkins-slave/workspace/hbase-0.95-on-hadoop2/0.95-on-hadoop2/hbase-server && /x1/jenkins/tools/java/jdk1.6.0_45-32/jre/bin/java -enableassertions -Xmx1900m -Djava.security.egd=file:/dev/./urandom -Djava.net.preferIPv4Stack=true -jar /x1/jenkins/jenkins-slave/workspace/hbase-0.95-on-hadoop2/0.95-on-hadoop2/hbase-server/target/surefire/surefirebooter8779319508502419363.jar /x1/jenkins/jenkins-slave/workspace/hbase-0.95-on-hadoop2/0.95-on-hadoop2/hbase-server/target/surefire/surefire5659666508204229220tmp /x1/jenkins/jenkins-slave/workspace/hbase-0.95-on-hadoop2/0.95-on-hadoop2/hbase-server/target/surefire/surefire_2388754973677797670155tmp
Running org.apache.hadoop.hbase.util.TestMiniClusterLoadSequential
Tests run: 4, Failures: 0, Errors: 0, Skipped: 0, Time elapsed: 107.917 sec
Forking command line: /bin/sh -c cd /x1/jenkins/jenkins-slave/workspace/hbase-0.95-on-hadoop2/0.95-on-hadoop2/hbase-server && /x1/jenkins/tools/java/jdk1.6.0_45-32/jre/bin/java -enableassertions -Xmx1900m -Djava.security.egd=file:/dev/./urandom -Djava.net.preferIPv4Stack=true -jar /x1/jenkins/jenkins-slave/workspace/hbase-0.95-on-hadoop2/0.95-on-hadoop2/hbase-server/target/surefire/surefirebooter2963524789980666422.jar /x1/jenkins/jenkins-slave/workspace/hbase-0.95-on-hadoop2/0.95-on-hadoop2/hbase-server/target/surefire/surefire7279585022244121069tmp /x1/jenkins/jenkins-slave/workspace/hbase-0.95-on-hadoop2/0.95-on-hadoop2/hbase-server/target/surefire/surefire_2396755071158104562643tmp
Running org.apache.hadoop.hbase.util.TestFSVisitor
Tests run: 3, Failures: 0, Errors: 0, Skipped: 0, Time elapsed: 3.84 sec
Forking command line: /bin/sh -c cd /x1/jenkins/jenkins-slave/workspace/hbase-0.95-on-hadoop2/0.95-on-hadoop2/hbase-server && /x1/jenkins/tools/java/jdk1.6.0_45-32/jre/bin/java -enableassertions -Xmx1900m -Djava.security.egd=file:/dev/./urandom -Djava.net.preferIPv4Stack=true -jar /x1/jenkins/jenkins-slave/workspace/hbase-0.95-on-hadoop2/0.95-on-hadoop2/hbase-server/target/surefire/surefirebooter6570553060772935244.jar /x1/jenkins/jenkins-slave/workspace/hbase-0.95-on-hadoop2/0.95-on-hadoop2/hbase-server/target/surefire/surefire3444716556852799513tmp /x1/jenkins/jenkins-slave/workspace/hbase-0.95-on-hadoop2/0.95-on-hadoop2/hbase-server/target/surefire/surefire_2408280597560165324260tmp
Running org.apache.hadoop.hbase.util.TestMiniClusterLoadParallel
Tests run: 4, Failures: 0, Errors: 0, Skipped: 0, Time elapsed: 99.214 sec
Forking command line: /bin/sh -c cd /x1/jenkins/jenkins-slave/workspace/hbase-0.95-on-hadoop2/0.95-on-hadoop2/hbase-server && /x1/jenkins/tools/java/jdk1.6.0_45-32/jre/bin/java -enableassertions -Xmx1900m -Djava.security.egd=file:/dev/./urandom -Djava.net.preferIPv4Stack=true -jar /x1/jenkins/jenkins-slave/workspace/hbase-0.95-on-hadoop2/0.95-on-hadoop2/hbase-server/target/surefire/surefirebooter7467449480200891584.jar /x1/jenkins/jenkins-slave/workspace/hbase-0.95-on-hadoop2/0.95-on-hadoop2/hbase-server/target/surefire/surefire6876235520477200382tmp /x1/jenkins/jenkins-slave/workspace/hbase-0.95-on-hadoop2/0.95-on-hadoop2/hbase-server/target/surefire/surefire_2417524745226204837250tmp
Running org.apache.hadoop.hbase.util.TestCoprocessorScanPolicy
Tests run: 4, Failures: 0, Errors: 0, Skipped: 0, Time elapsed: 16.382 sec
Forking command line: /bin/sh -c cd /x1/jenkins/jenkins-slave/workspace/hbase-0.95-on-hadoop2/0.95-on-hadoop2/hbase-server && /x1/jenkins/tools/java/jdk1.6.0_45-32/jre/bin/java -enableassertions -Xmx1900m -Djava.security.egd=file:/dev/./urandom -Djava.net.preferIPv4Stack=true -jar /x1/jenkins/jenkins-slave/workspace/hbase-0.95-on-hadoop2/0.95-on-hadoop2/hbase-server/target/surefire/surefirebooter554891028101265193.jar /x1/jenkins/jenkins-slave/workspace/hbase-0.95-on-hadoop2/0.95-on-hadoop2/hbase-server/target/surefire/surefire5736096556920742643tmp /x1/jenkins/jenkins-slave/workspace/hbase-0.95-on-hadoop2/0.95-on-hadoop2/hbase-server/target/surefire/surefire_2426368956999445588646tmp
Running org.apache.hadoop.hbase.util.hbck.TestOfflineMetaRebuildBase
Tests run: 1, Failures: 0, Errors: 0, Skipped: 0, Time elapsed: 17.596 sec
Forking command line: /bin/sh -c cd /x1/jenkins/jenkins-slave/workspace/hbase-0.95-on-hadoop2/0.95-on-hadoop2/hbase-server && /x1/jenkins/tools/java/jdk1.6.0_45-32/jre/bin/java -enableassertions -Xmx1900m -Djava.security.egd=file:/dev/./urandom -Djava.net.preferIPv4Stack=true -jar /x1/jenkins/jenkins-slave/workspace/hbase-0.95-on-hadoop2/0.95-on-hadoop2/hbase-server/target/surefire/surefirebooter4113770175747552744.jar /x1/jenkins/jenkins-slave/workspace/hbase-0.95-on-hadoop2/0.95-on-hadoop2/hbase-server/target/surefire/surefire4420989104539598104tmp /x1/jenkins/jenkins-slave/workspace/hbase-0.95-on-hadoop2/0.95-on-hadoop2/hbase-server/target/surefire/surefire_2438260730741415538387tmp
Running org.apache.hadoop.hbase.util.TestDefaultEnvironmentEdge
Tests run: 1, Failures: 0, Errors: 0, Skipped: 0, Time elapsed: 0.216 sec
Forking command line: /bin/sh -c cd /x1/jenkins/jenkins-slave/workspace/hbase-0.95-on-hadoop2/0.95-on-hadoop2/hbase-server && /x1/jenkins/tools/java/jdk1.6.0_45-32/jre/bin/java -enableassertions -Xmx1900m -Djava.security.egd=file:/dev/./urandom -Djava.net.preferIPv4Stack=true -jar /x1/jenkins/jenkins-slave/workspace/hbase-0.95-on-hadoop2/0.95-on-hadoop2/hbase-server/target/surefire/surefirebooter4066388617110576431.jar /x1/jenkins/jenkins-slave/workspace/hbase-0.95-on-hadoop2/0.95-on-hadoop2/hbase-server/target/surefire/surefire4601837917147740596tmp /x1/jenkins/jenkins-slave/workspace/hbase-0.95-on-hadoop2/0.95-on-hadoop2/hbase-server/target/surefire/surefire_2448593883684601252550tmp
Running org.apache.hadoop.hbase.util.hbck.TestOfflineMetaRebuildOverlap
Tests run: 1, Failures: 0, Errors: 0, Skipped: 0, Time elapsed: 16.674 sec
Forking command line: /bin/sh -c cd /x1/jenkins/jenkins-slave/workspace/hbase-0.95-on-hadoop2/0.95-on-hadoop2/hbase-server && /x1/jenkins/tools/java/jdk1.6.0_45-32/jre/bin/java -enableassertions -Xmx1900m -Djava.security.egd=file:/dev/./urandom -Djava.net.preferIPv4Stack=true -jar /x1/jenkins/jenkins-slave/workspace/hbase-0.95-on-hadoop2/0.95-on-hadoop2/hbase-server/target/surefire/surefirebooter897778335173821593.jar /x1/jenkins/jenkins-slave/workspace/hbase-0.95-on-hadoop2/0.95-on-hadoop2/hbase-server/target/surefire/surefire5174193719394729074tmp /x1/jenkins/jenkins-slave/workspace/hbase-0.95-on-hadoop2/0.95-on-hadoop2/hbase-server/target/surefire/surefire_2452745878192079230888tmp
Running org.apache.hadoop.hbase.util.TestFSHDFSUtils
Tests run: 2, Failures: 0, Errors: 0, Skipped: 0, Time elapsed: 3.818 sec
Running org.apache.hadoop.hbase.util.hbck.TestOfflineMetaRebuildHole
Tests run: 1, Failures: 0, Errors: 0, Skipped: 0, Time elapsed: 15.923 sec
Running org.apache.hadoop.hbase.TestInfoServers
Tests run: 3, Failures: 0, Errors: 0, Skipped: 0, Time elapsed: 8.363 sec
Running org.apache.hadoop.hbase.util.TestHBaseFsck
Tests run: 36, Failures: 0, Errors: 0, Skipped: 1, Time elapsed: 227.313 sec

Results :

Failed tests:   testScanOBBToOPP(org.apache.hadoop.hbase.mapreduce.TestTableInputFormatScan2)
  testMetaExport(org.apache.hadoop.hbase.mapreduce.TestImportExport)
  testWithDeletes(org.apache.hadoop.hbase.mapreduce.TestImportExport)
  testScanEmptyToBBB(org.apache.hadoop.hbase.mapreduce.TestTableInputFormatScan1)
  testBulkOutputWithoutAnExistingTable(org.apache.hadoop.hbase.mapreduce.TestImportTsv): expected:<0> but was:<1>

Tests in error: 
  testWorkerAbort(org.apache.hadoop.hbase.master.TestDistributedLogSplitting): test timed out after 300000 milliseconds
  testCorrectnessWhenMasterFailOver(org.apache.hadoop.hbase.regionserver.TestRSKilledWhenMasterInitializing): test timed out after 120000 milliseconds

Tests run: 1408, Failures: 5, Errors: 2, Skipped: 14

[INFO]                                                                         
[INFO] ------------------------------------------------------------------------
[INFO] Skipping HBase
[INFO] This project has been banned from the build due to previous failures.
[INFO] ------------------------------------------------------------------------
[INFO] ------------------------------------------------------------------------
[INFO] Reactor Summary:
[INFO] 
[INFO] HBase ............................................. SUCCESS [3.906s]
[INFO] HBase - Common .................................... SUCCESS [19.111s]
[INFO] HBase - Protocol .................................. SUCCESS [14.797s]
[INFO] HBase - Client .................................... SUCCESS [8.183s]
[INFO] HBase - Prefix Tree ............................... SUCCESS [3.096s]
[INFO] HBase - Hadoop Compatibility ...................... SUCCESS [5.616s]
[INFO] HBase - Hadoop Two Compatibility .................. SUCCESS [2.769s]
[INFO] HBase - Server .................................... FAILURE [42:13.515s]
[INFO] HBase - Integration Tests ......................... SKIPPED
[INFO] HBase - Examples .................................. SKIPPED
[INFO] HBase - Assembly .................................. SKIPPED
[INFO] ------------------------------------------------------------------------
[INFO] BUILD FAILURE
[INFO] ------------------------------------------------------------------------
[INFO] Total time: 43:14.072s
[INFO] Finished at: Sat Jun 15 00:00:06 UTC 2013
[INFO] Final Memory: 126M/582M
[INFO] ------------------------------------------------------------------------
[ERROR] Failed to execute goal org.apache.maven.plugins:maven-surefire-plugin:2.12-TRUNK-HBASE-2:test (secondPartTestsExecution) on project hbase-server: Failure or timeout -> [Help 1]
org.apache.maven.lifecycle.LifecycleExecutionException: Failed to execute goal org.apache.maven.plugins:maven-surefire-plugin:2.12-TRUNK-HBASE-2:test (secondPartTestsExecution) on project hbase-server: Failure or timeout
	at org.apache.maven.lifecycle.internal.MojoExecutor.execute(MojoExecutor.java:217)
	at org.apache.maven.lifecycle.internal.MojoExecutor.execute(MojoExecutor.java:153)
	at org.apache.maven.lifecycle.internal.MojoExecutor.execute(MojoExecutor.java:145)
	at org.apache.maven.lifecycle.internal.LifecycleModuleBuilder.buildProject(LifecycleModuleBuilder.java:84)
	at org.apache.maven.lifecycle.internal.LifecycleModuleBuilder.buildProject(LifecycleModuleBuilder.java:59)
	at org.apache.maven.lifecycle.internal.LifecycleStarter.singleThreadedBuild(LifecycleStarter.java:183)
	at org.apache.maven.lifecycle.internal.LifecycleStarter.execute(LifecycleStarter.java:161)
	at org.apache.maven.DefaultMaven.doExecute(DefaultMaven.java:320)
	at org.apache.maven.DefaultMaven.execute(DefaultMaven.java:156)
	at org.apache.maven.cli.MavenCli.execute(MavenCli.java:537)
	at org.apache.maven.cli.MavenCli.doMain(MavenCli.java:196)
	at org.apache.maven.cli.MavenCli.main(MavenCli.java:141)
	at sun.reflect.NativeMethodAccessorImpl.invoke0(Native Method)
	at sun.reflect.NativeMethodAccessorImpl.invoke(NativeMethodAccessorImpl.java:39)
	at sun.reflect.DelegatingMethodAccessorImpl.invoke(DelegatingMethodAccessorImpl.java:25)
	at java.lang.reflect.Method.invoke(Method.java:597)
	at org.codehaus.plexus.classworlds.launcher.Launcher.launchEnhanced(Launcher.java:290)
	at org.codehaus.plexus.classworlds.launcher.Launcher.launch(Launcher.java:230)
	at org.codehaus.plexus.classworlds.launcher.Launcher.mainWithExitCode(Launcher.java:409)
	at org.codehaus.plexus.classworlds.launcher.Launcher.main(Launcher.java:352)
Caused by: org.apache.maven.plugin.MojoExecutionException: Failure or timeout
	at org.apache.maven.plugin.surefire.SurefirePlugin.assertNoFailureOrTimeout(SurefirePlugin.java:643)
	at org.apache.maven.plugin.surefire.SurefirePlugin.handleSummary(SurefirePlugin.java:624)
	at org.apache.maven.plugin.surefire.AbstractSurefireMojo.executeAfterPreconditionsChecked(AbstractSurefireMojo.java:137)
	at org.apache.maven.plugin.surefire.AbstractSurefireMojo.execute(AbstractSurefireMojo.java:98)
	at org.apache.maven.plugin.DefaultBuildPluginManager.executeMojo(DefaultBuildPluginManager.java:101)
	at org.apache.maven.lifecycle.internal.MojoExecutor.execute(MojoExecutor.java:209)
	... 19 more
[ERROR] 
[ERROR] 
[ERROR] For more information about the errors and possible solutions, please read the following articles:
[ERROR] [Help 1] http://cwiki.apache.org/confluence/display/MAVEN/MojoExecutionException
[ERROR] 
[ERROR] After correcting the problems, you can resume the build with the command
[ERROR]   mvn <goals> -rf :hbase-server
Build step 'Invoke top-level Maven targets' marked build as failure
Archiving artifacts
Recording test results
Updating HBASE-8742

Mime
View raw message