hbase-dev mailing list archives

Site index · List index
Message view « Date » · « Thread »
Top « Date » · « Thread »
From apurt...@apache.org
Subject Build failed in Jenkins: HBase-0.94 #213
Date Mon, 03 Jun 2013 06:26:57 GMT
See <http://54.241.6.143/job/HBase-0.94/213/>

------------------------------------------
[...truncated 1640 lines...]
AU        src/site/resources/images/replication_overview.png
AU        src/site/resources/images/hbase_logo.png
AU        src/site/resources/images/architecture.gif
AU        src/site/resources/images/big_h_logo.svg
AU        src/site/resources/images/hadoop-logo.jpg
AU        src/site/resources/images/hfile.png
AU        src/site/resources/images/big_h_logo.png
AU        src/site/resources/images/favicon.ico
A         src/site/resources/css
A         src/site/resources/css/freebsd_docbook.css
A         src/site/resources/css/site.css
A         src/site/xdoc
A         src/site/xdoc/cygwin.xml
A         src/site/xdoc/acid-semantics.xml
A         src/site/xdoc/metrics.xml
A         src/site/xdoc/sponsors.xml
A         src/site/xdoc/index.xml
A         src/site/xdoc/replication.xml
A         src/site/xdoc/old_news.xml
AU        src/site/xdoc/resources.xml
A         src/site/xdoc/bulk-loads.xml
A         src/site/xdoc/pseudo-distributed.xml
A         src/docbkx
A         src/docbkx/upgrading.xml
AU        src/docbkx/community.xml
A         src/docbkx/developer.xml
A         src/docbkx/getting_started.xml
A         src/docbkx/troubleshooting.xml
A         src/docbkx/book.xml
AU        src/docbkx/external_apis.xml
A         src/docbkx/performance.xml
AU        src/docbkx/zookeeper.xml
A         src/docbkx/preface.xml
A         src/docbkx/configuration.xml
AU        src/docbkx/security.xml
A         src/docbkx/shell.xml
AU        src/docbkx/ops_mgt.xml
AU        src/docbkx/case_studies.xml
A         src/docbkx/customization.xsl
AU        src/saveVersion.sh
A         src/examples
A         src/examples/thrift
A         src/examples/thrift/DemoClient.java
A         src/examples/thrift/DemoClient.cpp
A         src/examples/thrift/DemoClient.rb
A         src/examples/thrift/DemoClient.php
AU        src/examples/thrift/DemoClient.py
A         src/examples/thrift/README.txt
A         src/examples/thrift/DemoClient.pl
A         src/examples/thrift/Makefile
A         src/examples/thrift2
A         src/examples/thrift2/DemoClient.java
A         src/examples/thrift2/DemoClient.py
A         src/examples/healthcheck
A         src/examples/healthcheck/healthcheck.sh
A         src/examples/mapreduce
A         src/examples/mapreduce/org
A         src/examples/mapreduce/org/apache
A         src/examples/mapreduce/org/apache/hadoop
A         src/examples/mapreduce/org/apache/hadoop/hbase
A         src/examples/mapreduce/org/apache/hadoop/hbase/mapreduce
A         src/examples/mapreduce/org/apache/hadoop/hbase/mapreduce/SampleUploader.java
A         src/examples/mapreduce/org/apache/hadoop/hbase/mapreduce/IndexBuilder.java
A         src/examples/mapreduce/index-builder-setup.rb
A         src/examples/README.txt
A         src/packages
A         src/packages/update-hbase-env.sh
A         src/packages/conf-pseudo
A         src/packages/conf-pseudo/hbase-site.xml
A         src/packages/deb
A         src/packages/deb/conf-pseudo.control
A         src/packages/deb/conf-pseudo.control/control
A         src/packages/deb/conf-pseudo.control/postinst
A         src/packages/deb/conf-pseudo.control/conffile
A         src/packages/deb/conf-pseudo.control/prerm
A         src/packages/deb/hbase.control
A         src/packages/deb/hbase.control/control
A         src/packages/deb/hbase.control/postinst
A         src/packages/deb/hbase.control/postrm
A         src/packages/deb/hbase.control/preinst
A         src/packages/deb/hbase.control/conffile
A         src/packages/deb/hbase.control/prerm
A         src/packages/deb/init.d
A         src/packages/deb/init.d/hbase-regionserver
A         src/packages/deb/init.d/hbase-master
A         src/packages/build.xml
A         src/packages/rpm
A         src/packages/rpm/init.d
A         src/packages/rpm/init.d/hbase-regionserver
A         src/packages/rpm/init.d/hbase-master
A         src/packages/rpm/spec
A         src/packages/rpm/spec/conf-pseudo.spec
A         src/packages/rpm/spec/hbase.spec
A         bin
AU        bin/hbase-daemons.sh
AU        bin/hbase
A         bin/get-active-master.rb
AU        bin/start-hbase.sh
A         bin/hirb.rb
A         bin/region_status.rb
AU        bin/hbase-daemon.sh
A         bin/region_mover.rb
A         bin/hbase-config.sh
AU        bin/local-regionservers.sh
AU        bin/zookeepers.sh
AU        bin/local-master-backup.sh
AU        bin/rolling-restart.sh
AU        bin/graceful_stop.sh
AU        bin/regionservers.sh
AU        bin/master-backup.sh
A         bin/replication
A         bin/replication/copy_tables_desc.rb
A         bin/hbase-jruby
AU        bin/stop-hbase.sh
A         dev-support
AU        dev-support/smart-apply-patch.sh
AU        dev-support/test-util.sh
AU        dev-support/findHangingTest.sh
AU        dev-support/test-patch.sh
A         dev-support/test-patch.properties
AU        dev-support/hbasetests.sh
A         .arcconfig
A         pom.xml
A         README.txt
 U        .
At revision 1488856
no change for https://svn.apache.org/repos/asf/hbase/branches/0.94 since the previous build
[HBase-0.94] $ /bin/bash -xe /tmp/hudson2584401217936568323.sh
+ uname -a
Linux ip-10-197-53-249 3.4.36-39.44.amzn1.x86_64 #1 SMP Tue Mar 19 05:24:46 UTC 2013 x86_64
x86_64 x86_64 GNU/Linux
+ ulimit -a
core file size          (blocks, -c) 0
data seg size           (kbytes, -d) unlimited
scheduling priority             (-e) 0
file size               (blocks, -f) unlimited
pending signals                 (-i) 119688
max locked memory       (kbytes, -l) 64
max memory size         (kbytes, -m) unlimited
open files                      (-n) 65536
pipe size            (512 bytes, -p) 8
POSIX message queues     (bytes, -q) 819200
real-time priority              (-r) 0
stack size              (kbytes, -s) 8192
cpu time               (seconds, -t) unlimited
max user processes              (-u) 65536
virtual memory          (kbytes, -v) unlimited
file locks                      (-x) unlimited
+ mvn -version
Apache Maven 3.0.4 (r1232337; 2012-01-17 08:44:56+0000)
Maven home: /opt/maven
Java version: 1.6.0_43, vendor: Sun Microsystems Inc.
Java home: /usr/java/jdk1.6.0_43/jre
Default locale: en_US, platform encoding: UTF-8
OS name: "linux", version: "3.4.36-39.44.amzn1.x86_64", arch: "amd64", family: "unix"
[HBase-0.94] $ /opt/maven/bin/mvn -DskipTests clean install
[INFO] Scanning for projects...
Downloading: https://repository.apache.org/content/repositories/releases/org/apache/apache/8/apache-8.pom
754 B   
2 KB    
4 KB   
7 KB   
11 KB   
14 KB   
14 KB   
        
Downloaded: https://repository.apache.org/content/repositories/releases/org/apache/apache/8/apache-8.pom
(14 KB at 12.1 KB/sec)
[INFO]                                                                         
[INFO] ------------------------------------------------------------------------
[INFO] Building HBase 0.94.8
[INFO] ------------------------------------------------------------------------
Downloading: http://people.apache.org/~garyh/mvn/org/apache/maven/plugins/maven-remote-resources-plugin/1.1/maven-remote-resources-plugin-1.1.pom
        
Downloading: http://repo.maven.apache.org/maven2/org/apache/maven/plugins/maven-remote-resources-plugin/1.1/maven-remote-resources-plugin-1.1.pom
4/12 KB   
8/12 KB   
12/12 KB   
           
Downloaded: http://repo.maven.apache.org/maven2/org/apache/maven/plugins/maven-remote-resources-plugin/1.1/maven-remote-resources-plugin-1.1.pom
(12 KB at 54.9 KB/sec)
Downloading: http://people.apache.org/~garyh/mvn/org/apache/maven/plugins/maven-plugins/14/maven-plugins-14.pom
           
Downloading: http://repo.maven.apache.org/maven2/org/apache/maven/plugins/maven-plugins/14/maven-plugins-14.pom
4/13 KB    
5/13 KB   
9/13 KB   
13/13 KB   
13/13 KB   
           
Downloaded: http://repo.maven.apache.org/maven2/org/apache/maven/plugins/maven-plugins/14/maven-plugins-14.pom
(13 KB at 306.1 KB/sec)
Downloading: http://people.apache.org/~garyh/mvn/org/apache/maven/maven-parent/13/maven-parent-13.pom
           
Downloading: http://repo.maven.apache.org/maven2/org/apache/maven/maven-parent/13/maven-parent-13.pom
4/23 KB    
8/23 KB   
12/23 KB   
16/23 KB   
20/23 KB   
23/23 KB   
           
Downloaded: http://repo.maven.apache.org/maven2/org/apache/maven/maven-parent/13/maven-parent-13.pom
(23 KB at 242.9 KB/sec)
Downloading: http://people.apache.org/~garyh/mvn/org/apache/apache/6/apache-6.pom
           
Downloading: http://repo.maven.apache.org/maven2/org/apache/apache/6/apache-6.pom
2/13 KB    
6/13 KB   
10/13 KB   
13/13 KB   
           
Downloaded: http://repo.maven.apache.org/maven2/org/apache/apache/6/apache-6.pom (13 KB at
624.8 KB/sec)
Downloading: http://people.apache.org/~garyh/mvn/org/apache/maven/plugins/maven-remote-resources-plugin/1.1/maven-remote-resources-plugin-1.1.jar
           
Downloading: http://repo.maven.apache.org/maven2/org/apache/maven/plugins/maven-remote-resources-plugin/1.1/maven-remote-resources-plugin-1.1.jar
4/61 KB    
6/61 KB   
10/61 KB   
14/61 KB   
18/61 KB   
22/61 KB   
26/61 KB   
30/61 KB   
34/61 KB   
38/61 KB   
42/61 KB   
46/61 KB   
50/61 KB   
54/61 KB   
58/61 KB   
61/61 KB   
           
Downloaded: http://repo.maven.apache.org/maven2/org/apache/maven/plugins/maven-remote-resources-plugin/1.1/maven-remote-resources-plugin-1.1.jar
(61 KB at 1289.6 KB/sec)
Downloading: http://people.apache.org/~garyh/mvn/org/apache/maven/plugins/maven-failsafe-plugin/2.12-TRUNK-HBASE-2/maven-failsafe-plugin-2.12-TRUNK-HBASE-2.pom
           
Downloading: http://repo.maven.apache.org/maven2/org/apache/maven/plugins/maven-failsafe-plugin/2.12-TRUNK-HBASE-2/maven-failsafe-plugin-2.12-TRUNK-HBASE-2.pom
           
[INFO] ------------------------------------------------------------------------
[INFO] BUILD FAILURE
[INFO] ------------------------------------------------------------------------
[INFO] Total time: 6:21.078s
[INFO] Finished at: Mon Jun 03 06:26:55 UTC 2013
[INFO] Final Memory: 5M/224M
[INFO] ------------------------------------------------------------------------
[ERROR] Plugin org.apache.maven.plugins:maven-failsafe-plugin:2.12-TRUNK-HBASE-2 or one of
its dependencies could not be resolved: Failed to read artifact descriptor for org.apache.maven.plugins:maven-failsafe-plugin:jar:2.12-TRUNK-HBASE-2:
Could not transfer artifact org.apache.maven.plugins:maven-failsafe-plugin:pom:2.12-TRUNK-HBASE-2
from/to ghelmling.testing (http://people.apache.org/~garyh/mvn/): Connection to http://people.apache.org
refused: Connection timed out -> [Help 1]
[ERROR] 
[ERROR] To see the full stack trace of the errors, re-run Maven with the -e switch.
[ERROR] Re-run Maven using the -X switch to enable full debug logging.
[ERROR] 
[ERROR] For more information about the errors and possible solutions, please read the following
articles:
[ERROR] [Help 1] http://cwiki.apache.org/confluence/display/MAVEN/PluginResolutionException
Build step 'Invoke top-level Maven targets' marked build as failure
Archiving artifacts

Mime
View raw message