hbase-dev mailing list archives

Site index · List index
Message view « Date » · « Thread »
Top « Date » · « Thread »
From Stack <st...@duboce.net>
Subject Re: Build failed in Jenkins: HBase-0.95 #279
Date Thu, 16 May 2013 21:42:08 GMT
Elliott has a fix for this... coming right up.
St.Ack


On Thu, May 16, 2013 at 2:34 PM, <apurtell@apache.org> wrote:

> See <http://54.241.6.143/job/HBase-0.95/279/changes>
>
> Changes:
>
> [Michael Stack] HBASE-8560 TestMasterShutdown failing in trunk 0.95/trunk
> -- "Unable to get data of znode /hbase/meta-region-server because node does
> not exist (not an error)"
>
> ------------------------------------------
> [...truncated 6440 lines...]
> Tests run: 3, Failures: 0, Errors: 0, Skipped: 0, Time elapsed: 0.049 sec
> Running
> org.apache.hadoop.hbase.regionserver.TestMiniBatchOperationInProgress
> Tests run: 1, Failures: 0, Errors: 0, Skipped: 0, Time elapsed: 0.01 sec
> Running org.apache.hadoop.hbase.regionserver.compactions.TestOffPeakHours
> Tests run: 3, Failures: 0, Errors: 0, Skipped: 0, Time elapsed: 0.028 sec
> Running org.apache.hadoop.hbase.regionserver.TestRSStatusServlet
> Tests run: 2, Failures: 0, Errors: 0, Skipped: 0, Time elapsed: 0.183 sec
> Running org.apache.hadoop.hbase.regionserver.TestKeyValueHeap
> Tests run: 3, Failures: 0, Errors: 0, Skipped: 0, Time elapsed: 0.089 sec
> Running org.apache.hadoop.hbase.regionserver.TestWideScanner
> Tests run: 1, Failures: 0, Errors: 0, Skipped: 0, Time elapsed: 0.389 sec
> Running org.apache.hadoop.hbase.regionserver.TestKeyValueSkipListSet
> Tests run: 4, Failures: 0, Errors: 0, Skipped: 0, Time elapsed: 0.04 sec
> Running org.apache.hadoop.hbase.procedure.TestProcedureCoordinator
> Tests run: 7, Failures: 0, Errors: 0, Skipped: 0, Time elapsed: 0.139 sec
> Running org.apache.hadoop.hbase.procedure.TestProcedure
> Tests run: 4, Failures: 0, Errors: 0, Skipped: 0, Time elapsed: 0.071 sec
> Running org.apache.hadoop.hbase.procedure.TestProcedureMember
> Tests run: 8, Failures: 0, Errors: 0, Skipped: 0, Time elapsed: 0.384 sec
> Running org.apache.hadoop.hbase.security.TestUser
> Tests run: 3, Failures: 0, Errors: 0, Skipped: 0, Time elapsed: 0.055 sec
> Running org.apache.hadoop.hbase.thrift.TestCallQueue
> Tests run: 18, Failures: 0, Errors: 0, Skipped: 0, Time elapsed: 0.192 sec
> Running org.apache.hadoop.hbase.TestHRegionLocation
> Tests run: 3, Failures: 0, Errors: 0, Skipped: 0, Time elapsed: 0.027 sec
> Running org.apache.hadoop.hbase.executor.TestExecutorService
> Tests run: 1, Failures: 0, Errors: 0, Skipped: 0, Time elapsed: 2.046 sec
> Running org.apache.hadoop.hbase.codec.TestCellMessageCodec
> Tests run: 3, Failures: 0, Errors: 0, Skipped: 0, Time elapsed: 0.029 sec
> Running org.apache.hadoop.hbase.io.TestImmutableBytesWritable
> Tests run: 3, Failures: 0, Errors: 0, Skipped: 0, Time elapsed: 0.025 sec
> Running org.apache.hadoop.hbase.io.encoding.TestPrefixTreeEncoding
> Tests run: 4, Failures: 0, Errors: 0, Skipped: 0, Time elapsed: 0.158 sec
> Running org.apache.hadoop.hbase.io.TestReference
> Tests run: 1, Failures: 0, Errors: 0, Skipped: 0, Time elapsed: 0.01 sec
> Running org.apache.hadoop.hbase.io.TestHeapSize
> Tests run: 3, Failures: 0, Errors: 0, Skipped: 0, Time elapsed: 0.029 sec
> Running org.apache.hadoop.hbase.io.hfile.bucket.TestByteBufferIOEngine
> Tests run: 1, Failures: 0, Errors: 0, Skipped: 0, Time elapsed: 0.045 sec
> Running org.apache.hadoop.hbase.io.hfile.bucket.TestFileIOEngine
> Tests run: 1, Failures: 0, Errors: 0, Skipped: 0, Time elapsed: 0.012 sec
> Running org.apache.hadoop.hbase.io.hfile.bucket.TestBucketCache
> Tests run: 4, Failures: 0, Errors: 0, Skipped: 0, Time elapsed: 10.236 sec
> Running org.apache.hadoop.hbase.io.hfile.TestHFileWriterV2
> Tests run: 2, Failures: 0, Errors: 0, Skipped: 0, Time elapsed: 0.707 sec
> Running org.apache.hadoop.hbase.io.hfile.TestBlockCacheColumnFamilySummary
> Tests run: 4, Failures: 0, Errors: 0, Skipped: 0, Time elapsed: 0.038 sec
> Running org.apache.hadoop.hbase.io.hfile.TestChecksum
> Tests run: 3, Failures: 0, Errors: 0, Skipped: 0, Time elapsed: 0.121 sec
> Running org.apache.hadoop.hbase.io.hfile.TestScannerSelectionUsingKeyRange
> Tests run: 3, Failures: 0, Errors: 0, Skipped: 0, Time elapsed: 0.106 sec
> Running org.apache.hadoop.hbase.io.hfile.TestHFile
> Tests run: 8, Failures: 0, Errors: 0, Skipped: 0, Time elapsed: 0.264 sec
> Running org.apache.hadoop.hbase.io.hfile.TestReseekTo
> Tests run: 1, Failures: 0, Errors: 0, Skipped: 0, Time elapsed: 0.057 sec
> Running org.apache.hadoop.hbase.io.hfile.TestSeekTo
> Tests run: 4, Failures: 0, Errors: 0, Skipped: 0, Time elapsed: 0.126 sec
> Running
> org.apache.hadoop.hbase.io.hfile.TestHFileInlineToRootChunkConversion
> Tests run: 1, Failures: 0, Errors: 0, Skipped: 0, Time elapsed: 0.015 sec
> Running org.apache.hadoop.hbase.io.hfile.TestCachedBlockQueue
> Tests run: 2, Failures: 0, Errors: 0, Skipped: 0, Time elapsed: 0.02 sec
> Running org.apache.hadoop.hbase.io.hfile.TestHFileBlockCompatibility
> Tests run: 8, Failures: 0, Errors: 0, Skipped: 0, Time elapsed: 0.479 sec
> Running org.apache.hadoop.hbase.io.hfile.slab.TestSlab
> Tests run: 1, Failures: 0, Errors: 0, Skipped: 0, Time elapsed: 0.018 sec
> Running org.apache.hadoop.hbase.io.hfile.TestFixedFileTrailer
> Tests run: 2, Failures: 0, Errors: 0, Skipped: 0, Time elapsed: 0.03 sec
> Running org.apache.hadoop.hbase.io.hfile.TestLruBlockCache
> Tests run: 8, Failures: 0, Errors: 0, Skipped: 0, Time elapsed: 0.297 sec
> Running org.apache.hadoop.hbase.io.hfile.TestHFileDataBlockEncoder
> Tests run: 72, Failures: 0, Errors: 0, Skipped: 0, Time elapsed: 0.83 sec
> Running org.apache.hadoop.hbase.io.TestHalfStoreFileReader
> Tests run: 2, Failures: 0, Errors: 0, Skipped: 0, Time elapsed: 0.061 sec
> Running org.apache.hadoop.hbase.TestIPv6NIOServerSocketChannel
> Tests run: 2, Failures: 0, Errors: 0, Skipped: 0, Time elapsed: 0.024 sec
> Running org.apache.hadoop.hbase.filter.TestComparatorSerialization
> Tests run: 6, Failures: 0, Errors: 0, Skipped: 0, Time elapsed: 0.07 sec
> Running org.apache.hadoop.hbase.filter.TestPrefixFilter
> Tests run: 3, Failures: 0, Errors: 0, Skipped: 0, Time elapsed: 0.034 sec
> Running
> org.apache.hadoop.hbase.filter.TestFirstKeyValueMatchingQualifiersFilter
> Tests run: 1, Failures: 0, Errors: 0, Skipped: 0, Time elapsed: 0.012 sec
> Running org.apache.hadoop.hbase.filter.TestFilter
> Tests run: 19, Failures: 0, Errors: 0, Skipped: 0, Time elapsed: 1.13 sec
> Running org.apache.hadoop.hbase.filter.TestParseFilter
> Tests run: 34, Failures: 0, Errors: 0, Skipped: 0, Time elapsed: 0.373 sec
> Running org.apache.hadoop.hbase.filter.TestRandomRowFilter
> Tests run: 2, Failures: 0, Errors: 0, Skipped: 0, Time elapsed: 0.338 sec
> Running org.apache.hadoop.hbase.filter.TestSingleColumnValueFilter
> Tests run: 2, Failures: 0, Errors: 0, Skipped: 0, Time elapsed: 0.024 sec
> Running org.apache.hadoop.hbase.filter.TestBitComparator
> Tests run: 6, Failures: 0, Errors: 0, Skipped: 0, Time elapsed: 0.057 sec
> Running org.apache.hadoop.hbase.filter.TestColumnPrefixFilter
> Tests run: 2, Failures: 0, Errors: 0, Skipped: 0, Time elapsed: 1.405 sec
> Running org.apache.hadoop.hbase.filter.TestFilterList
> Tests run: 6, Failures: 0, Errors: 0, Skipped: 0, Time elapsed: 0.067 sec
> Running org.apache.hadoop.hbase.filter.TestColumnPaginationFilter
> Tests run: 1, Failures: 0, Errors: 0, Skipped: 0, Time elapsed: 0.013 sec
> Running org.apache.hadoop.hbase.filter.TestDependentColumnFilter
> Tests run: 2, Failures: 0, Errors: 0, Skipped: 0, Time elapsed: 0.061 sec
> Running org.apache.hadoop.hbase.filter.TestMultipleColumnPrefixFilter
> Tests run: 3, Failures: 0, Errors: 0, Skipped: 0, Time elapsed: 2.148 sec
> Running org.apache.hadoop.hbase.filter.TestFuzzyRowFilter
> Tests run: 2, Failures: 0, Errors: 0, Skipped: 0, Time elapsed: 0.02 sec
> Running org.apache.hadoop.hbase.filter.TestPageFilter
> Tests run: 2, Failures: 0, Errors: 0, Skipped: 0, Time elapsed: 0.019 sec
> Running org.apache.hadoop.hbase.filter.TestInclusiveStopFilter
> Tests run: 2, Failures: 0, Errors: 0, Skipped: 0, Time elapsed: 0.021 sec
> Running org.apache.hadoop.hbase.filter.TestFilterSerialization
> Tests run: 25, Failures: 0, Errors: 0, Skipped: 0, Time elapsed: 0.278 sec
> Running org.apache.hadoop.hbase.filter.TestSingleColumnValueExcludeFilter
> Tests run: 1, Failures: 0, Errors: 0, Skipped: 0, Time elapsed: 0.012 sec
> Running org.apache.hadoop.hbase.zookeeper.TestZooKeeperMainServerArg
> Tests run: 1, Failures: 0, Errors: 0, Skipped: 0, Time elapsed: 0.022 sec
> Running org.apache.hadoop.hbase.zookeeper.TestZKConfig
> Tests run: 1, Failures: 0, Errors: 0, Skipped: 0, Time elapsed: 0.021 sec
> Running
> org.apache.hadoop.hbase.errorhandling.TestForeignExceptionSerialization
> Tests run: 2, Failures: 0, Errors: 0, Skipped: 0, Time elapsed: 0.031 sec
> Running
> org.apache.hadoop.hbase.errorhandling.TestForeignExceptionDispatcher
> Tests run: 3, Failures: 0, Errors: 0, Skipped: 0, Time elapsed: 0.038 sec
> Running org.apache.hadoop.hbase.errorhandling.TestTimeoutExceptionInjector
> Tests run: 4, Failures: 0, Errors: 0, Skipped: 0, Time elapsed: 0.075 sec
> Running org.apache.hadoop.hbase.TestFSTableDescriptorForceCreation
> Tests run: 3, Failures: 0, Errors: 0, Skipped: 0, Time elapsed: 0.038 sec
> Running org.apache.hadoop.hbase.regionserver.TestMetricsRegionServer
> Tests run: 3, Failures: 2, Errors: 0, Skipped: 0, Time elapsed: 129.126
> sec <<< FAILURE!
> Running org.apache.hadoop.hbase.protobuf.TestProtobufUtil
> Tests run: 6, Failures: 0, Errors: 0, Skipped: 0, Time elapsed: 129.126 sec
>
> Results :
>
> Failed tests:
> testWrapperSource(org.apache.hadoop.hbase.regionserver.TestMetricsRegionServer):
> Tags should be equal expected:<[test]> but
> was:<[ip-10-222-107-215.us-west-1.compute.internal,33755,1368739943951]>
>
> testSlowCount(org.apache.hadoop.hbase.regionserver.TestMetricsRegionServer):
> Metrics Counters should be equal expected:<28> but was:<33>
>
> Tests run: 671, Failures: 2, Errors: 0, Skipped: 0
>
> [JENKINS] Recording test results
> [INFO]
> [INFO]
> ------------------------------------------------------------------------
> [INFO] Skipping HBase
> [INFO] This project has been banned from the build due to previous
> failures.
> [INFO]
> ------------------------------------------------------------------------
> [INFO]
> [INFO]
> ------------------------------------------------------------------------
> [INFO] Skipping HBase
> [INFO] This project has been banned from the build due to previous
> failures.
> [INFO]
> ------------------------------------------------------------------------
> [INFO]
> ------------------------------------------------------------------------
> [INFO] Reactor Summary:
> [INFO]
> [INFO] HBase ............................................. SUCCESS
> [40.135s]
> [INFO] HBase - Common .................................... SUCCESS
> [1:03.467s]
> [INFO] HBase - Protocol .................................. SUCCESS
> [18.999s]
> [INFO] HBase - Client .................................... SUCCESS
> [13.261s]
> [INFO] HBase - Prefix Tree ............................... SUCCESS [4.809s]
> [INFO] HBase - Hadoop Compatibility ...................... SUCCESS [1.234s]
> [INFO] HBase - Hadoop One Compatibility .................. SUCCESS
> [12.521s]
> [INFO] HBase - Server .................................... FAILURE
> [2:40.892s]
> [INFO] HBase - Integration Tests ......................... SKIPPED
> [INFO] HBase - Examples .................................. SKIPPED
> [INFO] HBase - Assembly .................................. SKIPPED
> [INFO]
> ------------------------------------------------------------------------
> [INFO] BUILD FAILURE
> [INFO]
> ------------------------------------------------------------------------
> [INFO] Total time: 5:45.228s
> [INFO] Finished at: Thu May 16 21:34:07 UTC 2013
> [INFO] Final Memory: 55M/395M
> [INFO]
> ------------------------------------------------------------------------
> [JENKINS] Archiving <
> http://54.241.6.143/job/HBase-0.95/ws/hbase-common/pom.xml> to
> /var/lib/jenkins/jobs/HBase-0.95/modules/org.apache.hbase$hbase-common/builds/2013-05-16_21-28-15/archive/org.apache.hbase/hbase-common/0.97.0-SNAPSHOT/hbase-common-0.97.0-SNAPSHOT.pom
> [JENKINS] Archiving <
> http://54.241.6.143/job/HBase-0.95/ws/hbase-common/target/hbase-common-0.97.0-SNAPSHOT.jar>
> to
> /var/lib/jenkins/jobs/HBase-0.95/modules/org.apache.hbase$hbase-common/builds/2013-05-16_21-28-15/archive/org.apache.hbase/hbase-common/0.97.0-SNAPSHOT/hbase-common-0.97.0-SNAPSHOT.jar
> [JENKINS] Archiving <
> http://54.241.6.143/job/HBase-0.95/ws/hbase-common/target/hbase-common-0.97.0-SNAPSHOT-sources.jar>
> to
> /var/lib/jenkins/jobs/HBase-0.95/modules/org.apache.hbase$hbase-common/builds/2013-05-16_21-28-15/archive/org.apache.hbase/hbase-common/0.97.0-SNAPSHOT/hbase-common-0.97.0-SNAPSHOT-sources.jar
> [JENKINS] Archiving <
> http://54.241.6.143/job/HBase-0.95/ws/hbase-common/target/hbase-common-0.97.0-SNAPSHOT-tests.jar>
> to
> /var/lib/jenkins/jobs/HBase-0.95/modules/org.apache.hbase$hbase-common/builds/2013-05-16_21-28-15/archive/org.apache.hbase/hbase-common/0.97.0-SNAPSHOT/hbase-common-0.97.0-SNAPSHOT-tests.jar
> [JENKINS] Archiving <
> http://54.241.6.143/job/HBase-0.95/ws/hbase-hadoop-compat/pom.xml> to
> /var/lib/jenkins/jobs/HBase-0.95/modules/org.apache.hbase$hbase-hadoop-compat/builds/2013-05-16_21-28-15/archive/org.apache.hbase/hbase-hadoop-compat/0.97.0-SNAPSHOT/hbase-hadoop-compat-0.97.0-SNAPSHOT.pom
> [JENKINS] Archiving <
> http://54.241.6.143/job/HBase-0.95/ws/hbase-hadoop-compat/target/hbase-hadoop-compat-0.97.0-SNAPSHOT.jar>
> to
> /var/lib/jenkins/jobs/HBase-0.95/modules/org.apache.hbase$hbase-hadoop-compat/builds/2013-05-16_21-28-15/archive/org.apache.hbase/hbase-hadoop-compat/0.97.0-SNAPSHOT/hbase-hadoop-compat-0.97.0-SNAPSHOT.jar
> [JENKINS] Archiving <
> http://54.241.6.143/job/HBase-0.95/ws/hbase-hadoop-compat/target/hbase-hadoop-compat-0.97.0-SNAPSHOT-sources.jar>
> to
> /var/lib/jenkins/jobs/HBase-0.95/modules/org.apache.hbase$hbase-hadoop-compat/builds/2013-05-16_21-28-15/archive/org.apache.hbase/hbase-hadoop-compat/0.97.0-SNAPSHOT/hbase-hadoop-compat-0.97.0-SNAPSHOT-sources.jar
> [JENKINS] Archiving <
> http://54.241.6.143/job/HBase-0.95/ws/hbase-hadoop-compat/target/hbase-hadoop-compat-0.97.0-SNAPSHOT-tests.jar>
> to
> /var/lib/jenkins/jobs/HBase-0.95/modules/org.apache.hbase$hbase-hadoop-compat/builds/2013-05-16_21-28-15/archive/org.apache.hbase/hbase-hadoop-compat/0.97.0-SNAPSHOT/hbase-hadoop-compat-0.97.0-SNAPSHOT-tests.jar
> [JENKINS] Archiving <
> http://54.241.6.143/job/HBase-0.95/ws/hbase-examples/pom.xml> to
> /var/lib/jenkins/jobs/HBase-0.95/modules/org.apache.hbase$hbase-examples/builds/2013-05-16_21-28-15/archive/org.apache.hbase/hbase-examples/0.97.0-SNAPSHOT/hbase-examples-0.97.0-SNAPSHOT.pom
> [JENKINS] Archiving <
> http://54.241.6.143/job/HBase-0.95/ws/hbase-it/pom.xml> to
> /var/lib/jenkins/jobs/HBase-0.95/modules/org.apache.hbase$hbase-it/builds/2013-05-16_21-28-15/archive/org.apache.hbase/hbase-it/0.97.0-SNAPSHOT/hbase-it-0.97.0-SNAPSHOT.pom
> [JENKINS] Archiving <http://54.241.6.143/job/HBase-0.95/ws/pom.xml> to
> /var/lib/jenkins/jobs/HBase-0.95/modules/org.apache.hbase$hbase/builds/2013-05-16_21-28-15/archive/org.apache.hbase/hbase/0.97.0-SNAPSHOT/hbase-0.97.0-SNAPSHOT.pom
> [JENKINS] Archiving <
> http://54.241.6.143/job/HBase-0.95/ws/target/hbase-0.97.0-SNAPSHOT-site.xml>
> to
> /var/lib/jenkins/jobs/HBase-0.95/modules/org.apache.hbase$hbase/builds/2013-05-16_21-28-15/archive/org.apache.hbase/hbase/0.97.0-SNAPSHOT/hbase-0.97.0-SNAPSHOT-site.xml
> [JENKINS] Archiving <
> http://54.241.6.143/job/HBase-0.95/ws/hbase-assembly/pom.xml> to
> /var/lib/jenkins/jobs/HBase-0.95/modules/org.apache.hbase$hbase-assembly/builds/2013-05-16_21-28-15/archive/org.apache.hbase/hbase-assembly/0.97.0-SNAPSHOT/hbase-assembly-0.97.0-SNAPSHOT.pom
> [JENKINS] Archiving <
> http://54.241.6.143/job/HBase-0.95/ws/hbase-client/pom.xml> to
> /var/lib/jenkins/jobs/HBase-0.95/modules/org.apache.hbase$hbase-client/builds/2013-05-16_21-28-15/archive/org.apache.hbase/hbase-client/0.97.0-SNAPSHOT/hbase-client-0.97.0-SNAPSHOT.pom
> [JENKINS] Archiving <
> http://54.241.6.143/job/HBase-0.95/ws/hbase-client/target/hbase-client-0.97.0-SNAPSHOT.jar>
> to
> /var/lib/jenkins/jobs/HBase-0.95/modules/org.apache.hbase$hbase-client/builds/2013-05-16_21-28-15/archive/org.apache.hbase/hbase-client/0.97.0-SNAPSHOT/hbase-client-0.97.0-SNAPSHOT.jar
> [JENKINS] Archiving <
> http://54.241.6.143/job/HBase-0.95/ws/hbase-client/target/hbase-client-0.97.0-SNAPSHOT-sources.jar>
> to
> /var/lib/jenkins/jobs/HBase-0.95/modules/org.apache.hbase$hbase-client/builds/2013-05-16_21-28-15/archive/org.apache.hbase/hbase-client/0.97.0-SNAPSHOT/hbase-client-0.97.0-SNAPSHOT-sources.jar
> [JENKINS] Archiving <
> http://54.241.6.143/job/HBase-0.95/ws/hbase-client/target/hbase-client-0.97.0-SNAPSHOT-tests.jar>
> to
> /var/lib/jenkins/jobs/HBase-0.95/modules/org.apache.hbase$hbase-client/builds/2013-05-16_21-28-15/archive/org.apache.hbase/hbase-client/0.97.0-SNAPSHOT/hbase-client-0.97.0-SNAPSHOT-tests.jar
> [JENKINS] Archiving <
> http://54.241.6.143/job/HBase-0.95/ws/hbase-prefix-tree/pom.xml> to
> /var/lib/jenkins/jobs/HBase-0.95/modules/org.apache.hbase$hbase-prefix-tree/builds/2013-05-16_21-28-15/archive/org.apache.hbase/hbase-prefix-tree/0.97.0-SNAPSHOT/hbase-prefix-tree-0.97.0-SNAPSHOT.pom
> [JENKINS] Archiving <
> http://54.241.6.143/job/HBase-0.95/ws/hbase-prefix-tree/target/hbase-prefix-tree-0.97.0-SNAPSHOT.jar>
> to
> /var/lib/jenkins/jobs/HBase-0.95/modules/org.apache.hbase$hbase-prefix-tree/builds/2013-05-16_21-28-15/archive/org.apache.hbase/hbase-prefix-tree/0.97.0-SNAPSHOT/hbase-prefix-tree-0.97.0-SNAPSHOT.jar
> [JENKINS] Archiving <
> http://54.241.6.143/job/HBase-0.95/ws/hbase-prefix-tree/target/hbase-prefix-tree-0.97.0-SNAPSHOT-sources.jar>
> to
> /var/lib/jenkins/jobs/HBase-0.95/modules/org.apache.hbase$hbase-prefix-tree/builds/2013-05-16_21-28-15/archive/org.apache.hbase/hbase-prefix-tree/0.97.0-SNAPSHOT/hbase-prefix-tree-0.97.0-SNAPSHOT-sources.jar
> [JENKINS] Archiving <
> http://54.241.6.143/job/HBase-0.95/ws/hbase-prefix-tree/target/hbase-prefix-tree-0.97.0-SNAPSHOT-tests.jar>
> to
> /var/lib/jenkins/jobs/HBase-0.95/modules/org.apache.hbase$hbase-prefix-tree/builds/2013-05-16_21-28-15/archive/org.apache.hbase/hbase-prefix-tree/0.97.0-SNAPSHOT/hbase-prefix-tree-0.97.0-SNAPSHOT-tests.jar
> [JENKINS] Archiving <
> http://54.241.6.143/job/HBase-0.95/ws/hbase-protocol/pom.xml> to
> /var/lib/jenkins/jobs/HBase-0.95/modules/org.apache.hbase$hbase-protocol/builds/2013-05-16_21-28-15/archive/org.apache.hbase/hbase-protocol/0.97.0-SNAPSHOT/hbase-protocol-0.97.0-SNAPSHOT.pom
> [JENKINS] Archiving <
> http://54.241.6.143/job/HBase-0.95/ws/hbase-protocol/target/hbase-protocol-0.97.0-SNAPSHOT.jar>
> to
> /var/lib/jenkins/jobs/HBase-0.95/modules/org.apache.hbase$hbase-protocol/builds/2013-05-16_21-28-15/archive/org.apache.hbase/hbase-protocol/0.97.0-SNAPSHOT/hbase-protocol-0.97.0-SNAPSHOT.jar
> [JENKINS] Archiving <
> http://54.241.6.143/job/HBase-0.95/ws/hbase-protocol/target/hbase-protocol-0.97.0-SNAPSHOT-sources.jar>
> to
> /var/lib/jenkins/jobs/HBase-0.95/modules/org.apache.hbase$hbase-protocol/builds/2013-05-16_21-28-15/archive/org.apache.hbase/hbase-protocol/0.97.0-SNAPSHOT/hbase-protocol-0.97.0-SNAPSHOT-sources.jar
> [JENKINS] Archiving <
> http://54.241.6.143/job/HBase-0.95/ws/hbase-protocol/target/hbase-protocol-0.97.0-SNAPSHOT-tests.jar>
> to
> /var/lib/jenkins/jobs/HBase-0.95/modules/org.apache.hbase$hbase-protocol/builds/2013-05-16_21-28-15/archive/org.apache.hbase/hbase-protocol/0.97.0-SNAPSHOT/hbase-protocol-0.97.0-SNAPSHOT-tests.jar
> [JENKINS] Archiving <
> http://54.241.6.143/job/HBase-0.95/ws/hbase-hadoop1-compat/pom.xml> to
> /var/lib/jenkins/jobs/HBase-0.95/modules/org.apache.hbase$hbase-hadoop1-compat/builds/2013-05-16_21-28-15/archive/org.apache.hbase/hbase-hadoop1-compat/0.97.0-SNAPSHOT/hbase-hadoop1-compat-0.97.0-SNAPSHOT.pom
> [JENKINS] Archiving <
> http://54.241.6.143/job/HBase-0.95/ws/hbase-hadoop1-compat/target/hbase-hadoop1-compat-0.97.0-SNAPSHOT.jar>
> to
> /var/lib/jenkins/jobs/HBase-0.95/modules/org.apache.hbase$hbase-hadoop1-compat/builds/2013-05-16_21-28-15/archive/org.apache.hbase/hbase-hadoop1-compat/0.97.0-SNAPSHOT/hbase-hadoop1-compat-0.97.0-SNAPSHOT.jar
> [JENKINS] Archiving <
> http://54.241.6.143/job/HBase-0.95/ws/hbase-hadoop1-compat/target/hbase-hadoop1-compat-0.97.0-SNAPSHOT-sources.jar>
> to
> /var/lib/jenkins/jobs/HBase-0.95/modules/org.apache.hbase$hbase-hadoop1-compat/builds/2013-05-16_21-28-15/archive/org.apache.hbase/hbase-hadoop1-compat/0.97.0-SNAPSHOT/hbase-hadoop1-compat-0.97.0-SNAPSHOT-sources.jar
> [JENKINS] Archiving <
> http://54.241.6.143/job/HBase-0.95/ws/hbase-hadoop1-compat/target/hbase-hadoop1-compat-0.97.0-SNAPSHOT-tests.jar>
> to
> /var/lib/jenkins/jobs/HBase-0.95/modules/org.apache.hbase$hbase-hadoop1-compat/builds/2013-05-16_21-28-15/archive/org.apache.hbase/hbase-hadoop1-compat/0.97.0-SNAPSHOT/hbase-hadoop1-compat-0.97.0-SNAPSHOT-tests.jar
> [JENKINS] Archiving <
> http://54.241.6.143/job/HBase-0.95/ws/hbase-server/pom.xml> to
> /var/lib/jenkins/jobs/HBase-0.95/modules/org.apache.hbase$hbase-server/builds/2013-05-16_21-28-15/archive/org.apache.hbase/hbase-server/0.97.0-SNAPSHOT/hbase-server-0.97.0-SNAPSHOT.pom
> Waiting for Jenkins to finish collecting data
> mavenExecutionResult exceptions not empty
> message : Failed to execute goal
> org.apache.maven.plugins:maven-surefire-plugin:2.12-TRUNK-HBASE-2:test
> (default-test) on project hbase-server: There are test failures.
>
> Please refer to <
> http://54.241.6.143/job/HBase-0.95/ws/hbase-server/target/surefire-reports>
> for the individual test results.
> cause : There are test failures.
>
> Please refer to <
> http://54.241.6.143/job/HBase-0.95/ws/hbase-server/target/surefire-reports>
> for the individual test results.
> Stack trace :
> org.apache.maven.lifecycle.LifecycleExecutionException: Failed to execute
> goal org.apache.maven.plugins:maven-surefire-plugin:2.12-TRUNK-HBASE-2:test
> (default-test) on project hbase-server: There are test failures.
>
> Please refer to <
> http://54.241.6.143/job/HBase-0.95/ws/hbase-server/target/surefire-reports>
> for the individual test results.
>         at
> org.apache.maven.lifecycle.internal.MojoExecutor.execute(MojoExecutor.java:213)
>         at
> org.apache.maven.lifecycle.internal.MojoExecutor.execute(MojoExecutor.java:153)
>         at
> org.apache.maven.lifecycle.internal.MojoExecutor.execute(MojoExecutor.java:145)
>         at
> org.apache.maven.lifecycle.internal.LifecycleModuleBuilder.buildProject(LifecycleModuleBuilder.java:84)
>         at
> org.apache.maven.lifecycle.internal.LifecycleModuleBuilder.buildProject(LifecycleModuleBuilder.java:59)
>         at
> org.apache.maven.lifecycle.internal.LifecycleStarter.singleThreadedBuild(LifecycleStarter.java:183)
>         at
> org.apache.maven.lifecycle.internal.LifecycleStarter.execute(LifecycleStarter.java:161)
>         at org.apache.maven.DefaultMaven.doExecute(DefaultMaven.java:320)
>         at org.apache.maven.DefaultMaven.execute(DefaultMaven.java:156)
>         at
> org.jvnet.hudson.maven3.launcher.Maven3Launcher.main(Maven3Launcher.java:79)
>         at sun.reflect.NativeMethodAccessorImpl.invoke0(Native Method)
>         at
> sun.reflect.NativeMethodAccessorImpl.invoke(NativeMethodAccessorImpl.java:39)
>         at
> sun.reflect.DelegatingMethodAccessorImpl.invoke(DelegatingMethodAccessorImpl.java:25)
>         at java.lang.reflect.Method.invoke(Method.java:597)
>         at
> org.codehaus.plexus.classworlds.launcher.Launcher.launchStandard(Launcher.java:329)
>         at
> org.codehaus.plexus.classworlds.launcher.Launcher.launch(Launcher.java:239)
>         at
> org.jvnet.hudson.maven3.agent.Maven3Main.launch(Maven3Main.java:158)
>         at hudson.maven.Maven3Builder.call(Maven3Builder.java:100)
>         at hudson.maven.Maven3Builder.call(Maven3Builder.java:66)
>         at hudson.remoting.UserRequest.perform(UserRequest.java:118)
>         at hudson.remoting.UserRequest.perform(UserRequest.java:48)
>         at hudson.remoting.Request$2.run(Request.java:326)
>         at
> hudson.remoting.InterceptingExecutorService$1.call(InterceptingExecutorService.java:72)
>         at
> java.util.concurrent.FutureTask$Sync.innerRun(FutureTask.java:303)
>         at java.util.concurrent.FutureTask.run(FutureTask.java:138)
>         at
> java.util.concurrent.ThreadPoolExecutor$Worker.runTask(ThreadPoolExecutor.java:895)
>         at
> java.util.concurrent.ThreadPoolExecutor$Worker.run(ThreadPoolExecutor.java:918)
>         at java.lang.Thread.run(Thread.java:662)
> Caused by: org.apache.maven.plugin.MojoFailureException: There are test
> failures.
>
> Please refer to <
> http://54.241.6.143/job/HBase-0.95/ws/hbase-server/target/surefire-reports>
> for the individual test results.
>         at
> org.apache.maven.plugin.surefire.SurefireHelper.reportExecution(SurefireHelper.java:87)
>         at
> org.apache.maven.plugin.surefire.SurefirePlugin.writeSummary(SurefirePlugin.java:651)
>         at
> org.apache.maven.plugin.surefire.SurefirePlugin.handleSummary(SurefirePlugin.java:625)
>         at
> org.apache.maven.plugin.surefire.AbstractSurefireMojo.executeAfterPreconditionsChecked(AbstractSurefireMojo.java:137)
>         at
> org.apache.maven.plugin.surefire.AbstractSurefireMojo.execute(AbstractSurefireMojo.java:98)
>         at
> org.apache.maven.plugin.DefaultBuildPluginManager.executeMojo(DefaultBuildPluginManager.java:101)
>         at
> org.apache.maven.lifecycle.internal.MojoExecutor.execute(MojoExecutor.java:209)
>         ... 27 more
> channel stopped
>

Mime
  • Unnamed multipart/alternative (inline, None, 0 bytes)
View raw message