hbase-dev mailing list archives

Site index · List index
Message view « Date » · « Thread »
Top « Date » · « Thread »
From Stack <st...@duboce.net>
Subject Re: Build failed in Jenkins: HBase-TRUNK #4121
Date Wed, 15 May 2013 18:06:17 GMT
This is a hanging TestHCM.  Looks related to HBASE-8535 -- or HBASE-8535
uncovered this.  Digging in on it.
St.Ack


On Wed, May 15, 2013 at 10:36 AM, Apache Jenkins Server <
jenkins@builds.apache.org> wrote:

> See <https://builds.apache.org/job/HBase-TRUNK/4121/changes>
>
> Changes:
>
> [stack] HBASE-8535 Test for zk leak does not account for unsynchronized
> access to zk watcher
>
> [stack] HBASE-8531 TestZooKeeper fails in trunk/0.95 builds
>
> ------------------------------------------
> [...truncated 3744 lines...]
> Running org.apache.hadoop.hbase.regionserver.TestCompactionState
> Tests run: 5, Failures: 0, Errors: 0, Skipped: 0, Time elapsed: 80.4 sec
> Running org.apache.hadoop.hbase.regionserver.TestRegionServerMetrics
> Tests run: 9, Failures: 0, Errors: 0, Skipped: 0, Time elapsed: 18.264 sec
> Running org.apache.hadoop.hbase.regionserver.TestMemStore
> Tests run: 24, Failures: 0, Errors: 0, Skipped: 0, Time elapsed: 35.605 sec
> Running org.apache.hadoop.hbase.regionserver.TestGetClosestAtOrBefore
> Tests run: 3, Failures: 0, Errors: 0, Skipped: 0, Time elapsed: 1.11 sec
> Running
> org.apache.hadoop.hbase.regionserver.TestRSKilledWhenMasterInitializing
> Tests run: 1, Failures: 0, Errors: 0, Skipped: 0, Time elapsed: 36.377 sec
> Running org.apache.hadoop.hbase.regionserver.TestJoinedScanners
> Tests run: 1, Failures: 0, Errors: 0, Skipped: 0, Time elapsed: 37.776 sec
> Running org.apache.hadoop.hbase.regionserver.TestAtomicOperation
> Tests run: 6, Failures: 0, Errors: 0, Skipped: 0, Time elapsed: 21.314 sec
> Running org.apache.hadoop.hbase.regionserver.TestRegionServerNoMaster
> Tests run: 7, Failures: 0, Errors: 0, Skipped: 0, Time elapsed: 25.284 sec
> Running org.apache.hadoop.hbase.regionserver.TestFSErrorsExposed
> Tests run: 3, Failures: 0, Errors: 0, Skipped: 1, Time elapsed: 0.791 sec
> Running org.apache.hadoop.hbase.regionserver.TestHRegionBusyWait
> Tests run: 64, Failures: 0, Errors: 0, Skipped: 0, Time elapsed: 36.975 sec
> Running org.apache.hadoop.hbase.regionserver.TestHRegionOnCluster
> Tests run: 1, Failures: 0, Errors: 0, Skipped: 0, Time elapsed: 19.856 sec
> Running org.apache.hadoop.hbase.regionserver.TestParallelPut
> Tests run: 2, Failures: 0, Errors: 0, Skipped: 0, Time elapsed: 3.705 sec
> Running org.apache.hadoop.hbase.regionserver.TestCompoundBloomFilter
> Tests run: 3, Failures: 0, Errors: 0, Skipped: 0, Time elapsed: 17.912 sec
> Running org.apache.hadoop.hbase.regionserver.TestPriorityRpc
> Tests run: 3, Failures: 0, Errors: 0, Skipped: 0, Time elapsed: 1.015 sec
> Running org.apache.hadoop.hbase.regionserver.TestSeekOptimizations
> Tests run: 6, Failures: 0, Errors: 0, Skipped: 0, Time elapsed: 2.448 sec
> Running org.apache.hadoop.hbase.regionserver.handler.TestCloseRegionHandler
> Tests run: 3, Failures: 0, Errors: 0, Skipped: 0, Time elapsed: 1.406 sec
> Running org.apache.hadoop.hbase.regionserver.handler.TestOpenRegionHandler
> Tests run: 5, Failures: 0, Errors: 0, Skipped: 0, Time elapsed: 1.197 sec
> Running org.apache.hadoop.hbase.regionserver.TestServerCustomProtocol
> Tests run: 7, Failures: 0, Errors: 0, Skipped: 0, Time elapsed: 39.298 sec
> Running org.apache.hadoop.hbase.regionserver.TestBlocksRead
> Tests run: 4, Failures: 0, Errors: 0, Skipped: 0, Time elapsed: 1.104 sec
> Running org.apache.hadoop.hbase.regionserver.TestStoreScanner
> Tests run: 16, Failures: 0, Errors: 0, Skipped: 0, Time elapsed: 0.475 sec
> Running org.apache.hadoop.hbase.regionserver.TestSplitLogWorker
> Tests run: 5, Failures: 0, Errors: 0, Skipped: 0, Time elapsed: 2.815 sec
> Running org.apache.hadoop.hbase.regionserver.TestStoreFileBlockCacheSummary
> Tests run: 1, Failures: 0, Errors: 0, Skipped: 0, Time elapsed: 11.131 sec
> Running org.apache.hadoop.hbase.regionserver.TestCompaction
> Tests run: 17, Failures: 0, Errors: 0, Skipped: 0, Time elapsed: 33.342 sec
> Running org.apache.hadoop.hbase.regionserver.TestHRegionServerBulkLoad
> Tests run: 1, Failures: 0, Errors: 0, Skipped: 0, Time elapsed: 42.408 sec
> Running org.apache.hadoop.hbase.regionserver.TestClusterId
> Tests run: 1, Failures: 0, Errors: 0, Skipped: 0, Time elapsed: 25.288 sec
> Running
> org.apache.hadoop.hbase.regionserver.TestRegionMergeTransactionOnCluster
> Tests run: 2, Failures: 0, Errors: 0, Skipped: 0, Time elapsed: 20.86 sec
> Running org.apache.hadoop.hbase.regionserver.TestEndToEndSplitTransaction
> Tests run: 2, Failures: 0, Errors: 0, Skipped: 0, Time elapsed: 33.923 sec
> Running org.apache.hadoop.hbase.regionserver.TestMasterAddressManager
> Tests run: 1, Failures: 0, Errors: 0, Skipped: 0, Time elapsed: 0.644 sec
> Running org.apache.hadoop.hbase.regionserver.TestMultiColumnScanner
> Tests run: 12, Failures: 0, Errors: 0, Skipped: 0, Time elapsed: 40.586 sec
> Running org.apache.hadoop.hbase.regionserver.TestHRegion
> Tests run: 63, Failures: 0, Errors: 0, Skipped: 0, Time elapsed: 38.798 sec
> Running
> org.apache.hadoop.hbase.backup.example.TestZooKeeperTableArchiveClient
> Tests run: 3, Failures: 0, Errors: 0, Skipped: 0, Time elapsed: 5.743 sec
> Running org.apache.hadoop.hbase.TestLocalHBaseCluster
> Tests run: 1, Failures: 0, Errors: 0, Skipped: 0, Time elapsed: 9.509 sec
> Running org.apache.hadoop.hbase.security.token.TestTokenAuthentication
> Tests run: 2, Failures: 0, Errors: 0, Skipped: 0, Time elapsed: 1.897 sec
> Running org.apache.hadoop.hbase.security.token.TestZKSecretWatcher
> Tests run: 1, Failures: 0, Errors: 0, Skipped: 0, Time elapsed: 15.448 sec
> Running org.apache.hadoop.hbase.security.access.TestAccessControlFilter
> Tests run: 1, Failures: 0, Errors: 0, Skipped: 0, Time elapsed: 11.087 sec
> Running org.apache.hadoop.hbase.security.access.TestZKPermissionsWatcher
> Tests run: 1, Failures: 0, Errors: 0, Skipped: 0, Time elapsed: 8.385 sec
> Running org.apache.hadoop.hbase.security.access.TestTablePermissions
> Tests run: 7, Failures: 0, Errors: 0, Skipped: 0, Time elapsed: 22.963 sec
> Running org.apache.hadoop.hbase.backup.TestHFileArchiving
> Tests run: 5, Failures: 0, Errors: 0, Skipped: 0, Time elapsed: 134.849 sec
> Running org.apache.hadoop.hbase.TestFullLogReconstruction
> Tests run: 1, Failures: 0, Errors: 0, Skipped: 0, Time elapsed: 28.915 sec
> Running org.apache.hadoop.hbase.ipc.TestDelayedRpc
> Tests run: 4, Failures: 0, Errors: 0, Skipped: 0, Time elapsed: 3.201 sec
> Running org.apache.hadoop.hbase.ipc.TestHBaseClient
> Tests run: 1, Failures: 0, Errors: 0, Skipped: 0, Time elapsed: 0.222 sec
> Running org.apache.hadoop.hbase.ipc.TestProtoBufRpc
> Tests run: 1, Failures: 0, Errors: 0, Skipped: 0, Time elapsed: 1.514 sec
> Running org.apache.hadoop.hbase.TestGlobalMemStoreSize
> Tests run: 1, Failures: 0, Errors: 0, Skipped: 0, Time elapsed: 13.643 sec
> Running org.apache.hadoop.hbase.constraint.TestConstraint
> Tests run: 5, Failures: 0, Errors: 0, Skipped: 0, Time elapsed: 25.419 sec
> Running org.apache.hadoop.hbase.security.access.TestAccessController
> Tests run: 37, Failures: 0, Errors: 0, Skipped: 0, Time elapsed: 129.238
> sec
> Running org.apache.hadoop.hbase.rest.TestSchemaResource
> Tests run: 2, Failures: 0, Errors: 0, Skipped: 0, Time elapsed: 18.183 sec
> Running org.apache.hadoop.hbase.rest.client.TestRemoteAdmin
> Tests run: 5, Failures: 0, Errors: 0, Skipped: 0, Time elapsed: 14.327 sec
> Running org.apache.hadoop.hbase.rest.client.TestRemoteTable
> Tests run: 4, Failures: 0, Errors: 0, Skipped: 0, Time elapsed: 11.184 sec
> Running org.apache.hadoop.hbase.rest.TestMultiRowResource
> Tests run: 3, Failures: 0, Errors: 0, Skipped: 0, Time elapsed: 13.622 sec
> Running org.apache.hadoop.hbase.rest.TestTableResource
> Tests run: 8, Failures: 0, Errors: 0, Skipped: 0, Time elapsed: 23.074 sec
> Running org.apache.hadoop.hbase.rest.TestGzipFilter
> Tests run: 2, Failures: 0, Errors: 0, Skipped: 0, Time elapsed: 11.448 sec
> Running org.apache.hadoop.hbase.rest.TestRowResource
> Tests run: 12, Failures: 0, Errors: 0, Skipped: 0, Time elapsed: 14.161 sec
> Running org.apache.hadoop.hbase.rest.TestVersionResource
> Tests run: 7, Failures: 0, Errors: 0, Skipped: 0, Time elapsed: 10.92 sec
> Running org.apache.hadoop.hbase.rest.TestScannerResource
> Tests run: 5, Failures: 0, Errors: 0, Skipped: 0, Time elapsed: 24.668 sec
> Running org.apache.hadoop.hbase.rest.TestStatusResource
> Tests run: 2, Failures: 0, Errors: 0, Skipped: 0, Time elapsed: 9.693 sec
> Running org.apache.hadoop.hbase.rest.TestScannersWithFilters
> Tests run: 10, Failures: 0, Errors: 0, Skipped: 0, Time elapsed: 15.969 sec
> Running org.apache.hadoop.hbase.trace.TestHTraceHooks
> Tests run: 1, Failures: 0, Errors: 0, Skipped: 0, Time elapsed: 11.747 sec
> Running org.apache.hadoop.hbase.io.hfile.TestHFileSeek
> Tests run: 1, Failures: 0, Errors: 0, Skipped: 0, Time elapsed: 3.824 sec
> Running org.apache.hadoop.hbase.io.hfile.TestHFileBlockIndex
> Tests run: 10, Failures: 0, Errors: 0, Skipped: 0, Time elapsed: 7.745 sec
> Running org.apache.hadoop.hbase.io.hfile.TestHFilePerformance
> Tests run: 1, Failures: 0, Errors: 0, Skipped: 0, Time elapsed: 4.479 sec
> Running org.apache.hadoop.hbase.io.hfile.TestForceCacheImportantBlocks
> Tests run: 2, Failures: 0, Errors: 0, Skipped: 0, Time elapsed: 20.912 sec
> Running org.apache.hadoop.hbase.io.hfile.TestCacheOnWrite
> Tests run: 36, Failures: 0, Errors: 0, Skipped: 0, Time elapsed: 30.192 sec
> Running org.apache.hadoop.hbase.io.hfile.TestScannerSelectionUsingTTL
> Tests run: 6, Failures: 0, Errors: 0, Skipped: 0, Time elapsed: 62.03 sec
> Running org.apache.hadoop.hbase.io.hfile.TestHFileBlock
> Tests run: 14, Failures: 0, Errors: 0, Skipped: 0, Time elapsed: 49.785 sec
> Running org.apache.hadoop.hbase.io.hfile.slab.TestSlabCache
> Tests run: 7, Failures: 0, Errors: 0, Skipped: 0, Time elapsed: 17.761 sec
> Running org.apache.hadoop.hbase.io.hfile.slab.TestSingleSizeCache
> Tests run: 5, Failures: 0, Errors: 0, Skipped: 0, Time elapsed: 22.285 sec
> Running org.apache.hadoop.hbase.io.TestFileLink
> Tests run: 3, Failures: 0, Errors: 0, Skipped: 0, Time elapsed: 12.71 sec
> Running org.apache.hadoop.hbase.io.encoding.TestEncodedSeekers
> Tests run: 10, Failures: 0, Errors: 0, Skipped: 0, Time elapsed: 31.929 sec
> Running org.apache.hadoop.hbase.io.encoding.TestDataBlockEncoders
> Tests run: 12, Failures: 0, Errors: 0, Skipped: 0, Time elapsed: 86.604 sec
> Running org.apache.hadoop.hbase.io.encoding.TestBufferedDataBlockEncoder
> Tests run: 1, Failures: 0, Errors: 0, Skipped: 0, Time elapsed: 18.803 sec
> Running org.apache.hadoop.hbase.io.encoding.TestLoadAndSwitchEncodeOnDisk
> Tests run: 1, Failures: 0, Errors: 0, Skipped: 0, Time elapsed: 28.046 sec
> Running org.apache.hadoop.hbase.io.encoding.TestChangingEncoding
> Tests run: 4, Failures: 0, Errors: 0, Skipped: 0, Time elapsed: 171.992 sec
> Running org.apache.hadoop.hbase.TestRegionRebalancing
> Tests run: 2, Failures: 0, Errors: 0, Skipped: 0, Time elapsed: 30.9 sec
> Running org.apache.hadoop.hbase.mapred.TestTableInputFormat
> Tests run: 10, Failures: 0, Errors: 0, Skipped: 0, Time elapsed: 21.152 sec
> Running
> org.apache.hadoop.hbase.replication.TestReplicationDisableInactivePeer
> Tests run: 1, Failures: 0, Errors: 0, Skipped: 0, Time elapsed: 39.444 sec
> Running
> org.apache.hadoop.hbase.replication.TestReplicationQueueFailoverCompressed
> Tests run: 1, Failures: 0, Errors: 0, Skipped: 0, Time elapsed: 40.476 sec
> Running org.apache.hadoop.hbase.replication.TestReplicationQueueFailover
> Tests run: 1, Failures: 0, Errors: 0, Skipped: 0, Time elapsed: 40.469 sec
> Running org.apache.hadoop.hbase.replication.TestReplicationZookeeper
> Tests run: 4, Failures: 0, Errors: 0, Skipped: 0, Time elapsed: 0.965 sec
> Running
> org.apache.hadoop.hbase.replication.regionserver.TestReplicationSink
> Tests run: 5, Failures: 0, Errors: 0, Skipped: 0, Time elapsed: 12.928 sec
> Running
> org.apache.hadoop.hbase.replication.regionserver.TestReplicationSourceManager
> Tests run: 3, Failures: 0, Errors: 0, Skipped: 0, Time elapsed: 1.518 sec
> Running org.apache.hadoop.hbase.replication.TestReplicationSource
> Tests run: 1, Failures: 0, Errors: 0, Skipped: 0, Time elapsed: 2.175 sec
> Running org.apache.hadoop.hbase.replication.TestMultiSlaveReplication
> Tests run: 1, Failures: 0, Errors: 0, Skipped: 0, Time elapsed: 29.131 sec
> Running org.apache.hadoop.hbase.mapred.TestTableMapReduce
> Tests run: 1, Failures: 0, Errors: 0, Skipped: 0, Time elapsed: 173.909 sec
> Running org.apache.hadoop.hbase.replication.TestReplicationStateZKImpl
> Tests run: 2, Failures: 0, Errors: 0, Skipped: 0, Time elapsed: 1.34 sec
> Running org.apache.hadoop.hbase.replication.TestMasterReplication
> Tests run: 2, Failures: 0, Errors: 0, Skipped: 0, Time elapsed: 52.605 sec
> Running org.apache.hadoop.hbase.replication.TestReplicationSmallTests
> Tests run: 8, Failures: 0, Errors: 0, Skipped: 0, Time elapsed: 70.824 sec
> Running org.apache.hadoop.hbase.util.TestFSTableDescriptors
> Tests run: 12, Failures: 0, Errors: 0, Skipped: 0, Time elapsed: 1.3 sec
> Running org.apache.hadoop.hbase.util.TestMergeTool
> Tests run: 1, Failures: 0, Errors: 0, Skipped: 0, Time elapsed: 20.765 sec
> Running org.apache.hadoop.hbase.util.TestIdLock
> Tests run: 1, Failures: 0, Errors: 0, Skipped: 0, Time elapsed: 15.463 sec
> Running org.apache.hadoop.hbase.util.TestMergeTable
> Tests run: 1, Failures: 0, Errors: 0, Skipped: 0, Time elapsed: 25.48 sec
> Running org.apache.hadoop.hbase.util.TestMiniClusterLoadSequential
> Tests run: 4, Failures: 0, Errors: 0, Skipped: 0, Time elapsed: 52.654 sec
> Running org.apache.hadoop.hbase.util.TestMiniClusterLoadParallel
> Tests run: 4, Failures: 0, Errors: 0, Skipped: 0, Time elapsed: 46.045 sec
> Running org.apache.hadoop.hbase.util.TestFSUtils
> Tests run: 6, Failures: 0, Errors: 0, Skipped: 0, Time elapsed: 20.296 sec
> Running org.apache.hadoop.hbase.util.TestRegionSplitter
> Tests run: 5, Failures: 0, Errors: 0, Skipped: 0, Time elapsed: 14.138 sec
> Running org.apache.hadoop.hbase.util.TestProcessBasedCluster
> Tests run: 1, Failures: 0, Errors: 0, Skipped: 0, Time elapsed: 0.38 sec
> Running org.apache.hadoop.hbase.util.TestMiniClusterLoadEncoded
> Tests run: 5, Failures: 0, Errors: 0, Skipped: 0, Time elapsed: 56.01 sec
> Running org.apache.hadoop.hbase.util.TestCoprocessorScanPolicy
> Tests run: 4, Failures: 0, Errors: 0, Skipped: 0, Time elapsed: 20.188 sec
> Running org.apache.hadoop.hbase.util.TestFSVisitor
> Tests run: 3, Failures: 0, Errors: 0, Skipped: 0, Time elapsed: 1.487 sec
> Running org.apache.hadoop.hbase.util.hbck.TestOfflineMetaRebuildBase
> Tests run: 1, Failures: 0, Errors: 0, Skipped: 0, Time elapsed: 20.634 sec
> Running org.apache.hadoop.hbase.util.hbck.TestOfflineMetaRebuildOverlap
> Tests run: 1, Failures: 0, Errors: 0, Skipped: 0, Time elapsed: 20.44 sec
> Running org.apache.hadoop.hbase.util.hbck.TestOfflineMetaRebuildHole
> Tests run: 1, Failures: 0, Errors: 0, Skipped: 0, Time elapsed: 20.233 sec
> Running org.apache.hadoop.hbase.util.TestDefaultEnvironmentEdge
> Tests run: 1, Failures: 0, Errors: 0, Skipped: 0, Time elapsed: 0.322 sec
> Running org.apache.hadoop.hbase.TestInfoServers
> Tests run: 3, Failures: 0, Errors: 0, Skipped: 0, Time elapsed: 10.309 sec
> Running org.apache.hadoop.hbase.util.TestHBaseFsck
> Tests run: 36, Failures: 0, Errors: 0, Skipped: 1, Time elapsed: 237.774
> sec
>
> Results :
>
> Tests run: 1518, Failures: 0, Errors: 0, Skipped: 14
>
> [INFO]
> ------------------------------------------------------------------------
> [INFO] Reactor Summary:
> [INFO]
> [INFO] HBase ............................................. SUCCESS [3.232s]
> [INFO] HBase - Common .................................... SUCCESS
> [17.117s]
> [INFO] HBase - Protocol .................................. SUCCESS
> [13.142s]
> [INFO] HBase - Client .................................... SUCCESS [7.475s]
> [INFO] HBase - Prefix Tree ............................... SUCCESS [3.047s]
> [INFO] HBase - Hadoop Compatibility ...................... SUCCESS [0.600s]
> [INFO] HBase - Hadoop One Compatibility .................. SUCCESS [1.377s]
> [INFO] HBase - Server .................................... FAILURE
> [1:36:21.479s]
> [INFO] HBase - Integration Tests ......................... SKIPPED
> [INFO] HBase - Examples .................................. SKIPPED
> [INFO] HBase - Assembly .................................. SKIPPED
> [INFO]
> ------------------------------------------------------------------------
> [INFO] BUILD FAILURE
> [INFO]
> ------------------------------------------------------------------------
> [INFO] Total time: 1:37:07.973s
> [INFO] Finished at: Wed May 15 17:36:09 UTC 2013
> [INFO] Final Memory: 39M/654M
> [INFO]
> ------------------------------------------------------------------------
> [ERROR] Failed to execute goal
> org.apache.maven.plugins:maven-surefire-plugin:2.12-TRUNK-HBASE-2:test
> (secondPartTestsExecution) on project hbase-server: Failure or timeout ->
> [Help 1]
> [ERROR]
> [ERROR] To see the full stack trace of the errors, re-run Maven with the
> -e switch.
> [ERROR] Re-run Maven using the -X switch to enable full debug logging.
> [ERROR]
> [ERROR] For more information about the errors and possible solutions,
> please read the following articles:
> [ERROR] [Help 1]
> http://cwiki.apache.org/confluence/display/MAVEN/MojoExecutionException
> [ERROR]
> [ERROR] After correcting the problems, you can resume the build with the
> command
> [ERROR]   mvn <goals> -rf :hbase-server
> Build step 'Invoke top-level Maven targets' marked build as failure
> Archiving artifacts
> Recording test results
> Updating HBASE-8535
> Updating HBASE-8531
>

Mime
  • Unnamed multipart/alternative (inline, None, 0 bytes)
View raw message