hbase-dev mailing list archives

Site index · List index
Message view « Date » · « Thread »
Top « Date » · « Thread »
From Stack <st...@duboce.net>
Subject Re: Build failed in Jenkins: HBase-0.95 #269
Date Wed, 15 May 2013 18:19:04 GMT
A few test failed in here:

TestDelayedRpc

Looking at it.

And then there are these hanging tests:

Hanging test: Running org.apache.hadoop.hbase.io.hfile.TestCacheOnWrite
Hanging test: Running org.apache.hadoop.hbase.client.TestFromClientSide
Hanging test: Running
org.apache.hadoop.hbase.master.handler.TestTableDescriptorModification

St.Ack




On Wed, May 15, 2013 at 10:11 AM, <apurtell@apache.org> wrote:

> See <http://54.241.6.143/job/HBase-0.95/269/changes>
>
> Changes:
>
> [Michael Stack] HBASE-8535 Test for zk leak does not account for
> unsynchronized access to zk watcher
>
> ------------------------------------------
> [...truncated 3871 lines...]
> Tests run: 1, Failures: 0, Errors: 0, Skipped: 0, Time elapsed: 2.161 sec
> Running
> org.apache.hadoop.hbase.master.TestMasterFailoverBalancerPersistence
> Tests run: 1, Failures: 0, Errors: 0, Skipped: 0, Time elapsed: 14.077 sec
> Running org.apache.hadoop.hbase.master.TestActiveMasterManager
> Tests run: 2, Failures: 0, Errors: 0, Skipped: 0, Time elapsed: 1.434 sec
> Running org.apache.hadoop.hbase.master.TestMasterMetricsWrapper
> Tests run: 1, Failures: 0, Errors: 0, Skipped: 0, Time elapsed: 13.514 sec
> Running org.apache.hadoop.hbase.master.TestTableLockManager
> Tests run: 5, Failures: 0, Errors: 0, Skipped: 0, Time elapsed: 110.206 sec
> Running org.apache.hadoop.hbase.master.TestMasterFailover
> Tests run: 4, Failures: 0, Errors: 0, Skipped: 0, Time elapsed: 55.092 sec
> Running org.apache.hadoop.hbase.zookeeper.TestZooKeeperNodeTracker
> Tests run: 3, Failures: 0, Errors: 0, Skipped: 0, Time elapsed: 1.252 sec
> Running org.apache.hadoop.hbase.zookeeper.TestHQuorumPeer
> Tests run: 3, Failures: 0, Errors: 0, Skipped: 0, Time elapsed: 0.97 sec
> Running org.apache.hadoop.hbase.master.TestMasterShutdown
> Tests run: 2, Failures: 0, Errors: 0, Skipped: 0, Time elapsed: 142.232 sec
> Running org.apache.hadoop.hbase.zookeeper.TestZooKeeperACL
> Tests run: 5, Failures: 0, Errors: 0, Skipped: 0, Time elapsed: 7.829 sec
> Running org.apache.hadoop.hbase.zookeeper.TestZKMulti
> Tests run: 6, Failures: 0, Errors: 0, Skipped: 0, Time elapsed: 1.212 sec
> Running org.apache.hadoop.hbase.zookeeper.TestZKLeaderManager
> Tests run: 1, Failures: 0, Errors: 0, Skipped: 0, Time elapsed: 1.105 sec
> Running org.apache.hadoop.hbase.zookeeper.TestRecoverableZooKeeper
> Tests run: 1, Failures: 0, Errors: 0, Skipped: 0, Time elapsed: 3.033 sec
> Running org.apache.hadoop.hbase.zookeeper.TestZKTable
> Tests run: 1, Failures: 0, Errors: 0, Skipped: 0, Time elapsed: 1.175 sec
> Running org.apache.hadoop.hbase.constraint.TestConstraint
> Tests run: 5, Failures: 0, Errors: 0, Skipped: 0, Time elapsed: 26.546 sec
> Running
> org.apache.hadoop.hbase.zookeeper.lock.TestZKInterProcessReadWriteLock
> Tests run: 6, Failures: 0, Errors: 0, Skipped: 0, Time elapsed: 25.438 sec
> Running org.apache.hadoop.hbase.TestGlobalMemStoreSize
> Tests run: 1, Failures: 0, Errors: 0, Skipped: 0, Time elapsed: 17.48 sec
> Running org.apache.hadoop.hbase.TestDrainingServer
> Tests run: 2, Failures: 0, Errors: 0, Skipped: 0, Time elapsed: 20.107 sec
> Running
> org.apache.hadoop.hbase.regionserver.TestRegionMergeTransactionOnCluster
> Tests run: 2, Failures: 0, Errors: 0, Skipped: 0, Time elapsed: 21.616 sec
> Running org.apache.hadoop.hbase.regionserver.TestSplitTransactionOnCluster
> Tests run: 9, Failures: 0, Errors: 0, Skipped: 0, Time elapsed: 51.297 sec
> Running org.apache.hadoop.hbase.regionserver.TestRegionServerNoMaster
> Tests run: 7, Failures: 0, Errors: 0, Skipped: 0, Time elapsed: 24.713 sec
> Running org.apache.hadoop.hbase.regionserver.TestCompactionWithCoprocessor
> Tests run: 17, Failures: 0, Errors: 0, Skipped: 0, Time elapsed: 84.475 sec
> Running org.apache.hadoop.hbase.regionserver.TestAtomicOperation
> Tests run: 6, Failures: 0, Errors: 0, Skipped: 0, Time elapsed: 38.366 sec
> Running org.apache.hadoop.hbase.regionserver.TestGetClosestAtOrBefore
> Tests run: 3, Failures: 0, Errors: 0, Skipped: 0, Time elapsed: 1.582 sec
> Running org.apache.hadoop.hbase.regionserver.TestParallelPut
> Tests run: 2, Failures: 0, Errors: 0, Skipped: 0, Time elapsed: 8.597 sec
> Running org.apache.hadoop.hbase.regionserver.TestMemStore
> Tests run: 24, Failures: 0, Errors: 0, Skipped: 0, Time elapsed: 56.491 sec
> Running org.apache.hadoop.hbase.regionserver.TestClusterId
> Tests run: 1, Failures: 0, Errors: 0, Skipped: 0, Time elapsed: 31.569 sec
> Running org.apache.hadoop.hbase.regionserver.TestStore
> Tests run: 15, Failures: 0, Errors: 0, Skipped: 0, Time elapsed: 14.137 sec
> Running org.apache.hadoop.hbase.regionserver.TestEndToEndSplitTransaction
> Tests run: 2, Failures: 0, Errors: 0, Skipped: 0, Time elapsed: 39.195 sec
> Running org.apache.hadoop.hbase.regionserver.TestFSErrorsExposed
> Tests run: 3, Failures: 0, Errors: 0, Skipped: 1, Time elapsed: 1.511 sec
> Running org.apache.hadoop.hbase.regionserver.TestJoinedScanners
> Tests run: 1, Failures: 0, Errors: 0, Skipped: 0, Time elapsed: 43.243 sec
> Running org.apache.hadoop.hbase.regionserver.TestCompaction
> Tests run: 17, Failures: 0, Errors: 0, Skipped: 0, Time elapsed: 69.059 sec
> Running org.apache.hadoop.hbase.regionserver.TestStoreScanner
> Tests run: 16, Failures: 0, Errors: 0, Skipped: 0, Time elapsed: 0.57 sec
> Running org.apache.hadoop.hbase.regionserver.TestBlocksRead
> Tests run: 4, Failures: 0, Errors: 0, Skipped: 0, Time elapsed: 1.884 sec
> Running org.apache.hadoop.hbase.regionserver.TestServerCustomProtocol
> Tests run: 7, Failures: 0, Errors: 0, Skipped: 0, Time elapsed: 42.039 sec
> Running org.apache.hadoop.hbase.regionserver.TestCacheOnWriteInSchema
> Tests run: 3, Failures: 0, Errors: 0, Skipped: 0, Time elapsed: 2.738 sec
> Running
> org.apache.hadoop.hbase.regionserver.TestRSKilledWhenMasterInitializing
> Tests run: 1, Failures: 0, Errors: 0, Skipped: 0, Time elapsed: 38.237 sec
> Running org.apache.hadoop.hbase.regionserver.TestStoreFileBlockCacheSummary
> Tests run: 1, Failures: 0, Errors: 0, Skipped: 0, Time elapsed: 14.487 sec
> Running org.apache.hadoop.hbase.regionserver.handler.TestCloseRegionHandler
> Tests run: 3, Failures: 0, Errors: 0, Skipped: 0, Time elapsed: 2.465 sec
> Running org.apache.hadoop.hbase.regionserver.handler.TestOpenRegionHandler
> Tests run: 5, Failures: 0, Errors: 0, Skipped: 0, Time elapsed: 3.93 sec
> Running org.apache.hadoop.hbase.regionserver.TestMasterAddressManager
> Tests run: 1, Failures: 0, Errors: 0, Skipped: 0, Time elapsed: 3.053 sec
> Running org.apache.hadoop.hbase.regionserver.TestPriorityRpc
> Tests run: 3, Failures: 0, Errors: 0, Skipped: 0, Time elapsed: 4.709 sec
> Running org.apache.hadoop.hbase.regionserver.TestHRegionServerBulkLoad
> Tests run: 1, Failures: 0, Errors: 0, Skipped: 0, Time elapsed: 43.976 sec
> Running org.apache.hadoop.hbase.regionserver.TestMultiColumnScanner
> Tests run: 12, Failures: 0, Errors: 0, Skipped: 0, Time elapsed: 74.601 sec
> Running org.apache.hadoop.hbase.regionserver.TestCompoundBloomFilter
> Tests run: 3, Failures: 0, Errors: 0, Skipped: 0, Time elapsed: 34.181 sec
> Running org.apache.hadoop.hbase.client.TestAdmin
> Tests run: 43, Failures: 0, Errors: 0, Skipped: 0, Time elapsed: 645.228
> sec
> Running org.apache.hadoop.hbase.regionserver.TestHRegionOnCluster
> Tests run: 1, Failures: 0, Errors: 0, Skipped: 0, Time elapsed: 21.179 sec
> Running org.apache.hadoop.hbase.regionserver.TestSplitLogWorker
> Tests run: 5, Failures: 0, Errors: 0, Skipped: 0, Time elapsed: 3.814 sec
> Running org.apache.hadoop.hbase.regionserver.TestRegionServerMetrics
> Tests run: 9, Failures: 0, Errors: 0, Skipped: 0, Time elapsed: 22.604 sec
> Running org.apache.hadoop.hbase.regionserver.TestSeekOptimizations
> Tests run: 6, Failures: 0, Errors: 0, Skipped: 0, Time elapsed: 10.088 sec
> Running org.apache.hadoop.hbase.master.TestDistributedLogSplitting
> Tests run: 12, Failures: 1, Errors: 0, Skipped: 0, Time elapsed: 390.344
> sec <<< FAILURE!
> Running org.apache.hadoop.hbase.regionserver.TestHRegionBusyWait
> Tests run: 64, Failures: 0, Errors: 0, Skipped: 0, Time elapsed: 68.363 sec
> Running org.apache.hadoop.hbase.regionserver.TestHRegion
> Tests run: 63, Failures: 0, Errors: 0, Skipped: 0, Time elapsed: 67.265 sec
> Running org.apache.hadoop.hbase.regionserver.wal.TestWALReplay
> Tests run: 8, Failures: 0, Errors: 0, Skipped: 0, Time elapsed: 65.864 sec
> Running org.apache.hadoop.hbase.regionserver.wal.TestHLogFiltering
> Tests run: 1, Failures: 0, Errors: 0, Skipped: 0, Time elapsed: 30.093 sec
> Running org.apache.hadoop.hbase.regionserver.TestCompactionState
> Tests run: 5, Failures: 0, Errors: 0, Skipped: 0, Time elapsed: 95.173 sec
> Running org.apache.hadoop.hbase.regionserver.wal.TestWALReplayCompressed
> Tests run: 8, Failures: 0, Errors: 0, Skipped: 0, Time elapsed: 60.781 sec
> Running org.apache.hadoop.hbase.regionserver.wal.TestHLog
> Tests run: 12, Failures: 0, Errors: 0, Skipped: 0, Time elapsed: 65.774 sec
> Running org.apache.hadoop.hbase.regionserver.wal.TestDurability
> Tests run: 1, Failures: 0, Errors: 0, Skipped: 0, Time elapsed: 4.469 sec
> Running org.apache.hadoop.hbase.regionserver.wal.TestHLogSplit
> Tests run: 34, Failures: 0, Errors: 0, Skipped: 1, Time elapsed: 119.689
> sec
> Running org.apache.hadoop.hbase.regionserver.wal.TestLogRollAbort
> Tests run: 1, Failures: 0, Errors: 0, Skipped: 0, Time elapsed: 162.834 sec
> Running org.apache.hadoop.hbase.regionserver.wal.TestHLogSplitCompressed
> Tests run: 34, Failures: 0, Errors: 0, Skipped: 1, Time elapsed: 126.07 sec
> Running org.apache.hadoop.hbase.regionserver.wal.TestLogRolling
> Tests run: 2, Failures: 0, Errors: 0, Skipped: 0, Time elapsed: 258.859 sec
>
> Results :
>
> Failed tests:
> testWorkerAbort(org.apache.hadoop.hbase.master.TestDistributedLogSplitting):
> none of the following counters went up in 80000 milliseconds -
> tot_wkr_task_resigned, tot_wkr_task_err, tot_wkr_final_transition_failed,
> tot_wkr_task_done, tot_wkr_preempt_task
>
> Tests in error:
>
> testDelayedRpcImmediateReturnValue(org.apache.hadoop.hbase.ipc.TestDelayedRpc):
> Index: 1, Size: 1
>
> Tests run: 1531, Failures: 1, Errors: 1, Skipped: 14
>
> [JENKINS] Recording test results
> [INFO]
> [INFO]
> ------------------------------------------------------------------------
> [INFO] Skipping HBase
> [INFO] This project has been banned from the build due to previous
> failures.
> [INFO]
> ------------------------------------------------------------------------
> [INFO]
> [INFO]
> ------------------------------------------------------------------------
> [INFO] Skipping HBase
> [INFO] This project has been banned from the build due to previous
> failures.
> [INFO]
> ------------------------------------------------------------------------
> [INFO]
> ------------------------------------------------------------------------
> [INFO] Reactor Summary:
> [INFO]
> [INFO] HBase ............................................. SUCCESS [4.927s]
> [INFO] HBase - Common .................................... SUCCESS
> [23.076s]
> [INFO] HBase - Protocol .................................. SUCCESS
> [19.178s]
> [INFO] HBase - Client .................................... SUCCESS [9.770s]
> [INFO] HBase - Prefix Tree ............................... SUCCESS [5.083s]
> [INFO] HBase - Hadoop Compatibility ...................... SUCCESS [1.463s]
> [INFO] HBase - Hadoop One Compatibility .................. SUCCESS [2.246s]
> [INFO] HBase - Server .................................... FAILURE
> [55:03.345s]
> [INFO] HBase - Integration Tests ......................... SKIPPED
> [INFO] HBase - Examples .................................. SKIPPED
> [INFO] HBase - Assembly .................................. SKIPPED
> [INFO]
> ------------------------------------------------------------------------
> [INFO] BUILD FAILURE
> [INFO]
> ------------------------------------------------------------------------
> [INFO] Total time: 56:17.631s
> [INFO] Finished at: Wed May 15 17:11:31 UTC 2013
> [INFO] Final Memory: 125M/530M
> [INFO]
> ------------------------------------------------------------------------
> [JENKINS] Archiving <
> http://54.241.6.143/job/HBase-0.95/ws/hbase-common/pom.xml> to
> /var/lib/jenkins/jobs/HBase-0.95/modules/org.apache.hbase$hbase-common/builds/2013-05-15_16-15-07/archive/org.apache.hbase/hbase-common/0.97.0-SNAPSHOT/hbase-common-0.97.0-SNAPSHOT.pom
> [JENKINS] Archiving <
> http://54.241.6.143/job/HBase-0.95/ws/hbase-common/target/hbase-common-0.97.0-SNAPSHOT.jar>
> to
> /var/lib/jenkins/jobs/HBase-0.95/modules/org.apache.hbase$hbase-common/builds/2013-05-15_16-15-07/archive/org.apache.hbase/hbase-common/0.97.0-SNAPSHOT/hbase-common-0.97.0-SNAPSHOT.jar
> [JENKINS] Archiving <
> http://54.241.6.143/job/HBase-0.95/ws/hbase-common/target/hbase-common-0.97.0-SNAPSHOT-sources.jar>
> to
> /var/lib/jenkins/jobs/HBase-0.95/modules/org.apache.hbase$hbase-common/builds/2013-05-15_16-15-07/archive/org.apache.hbase/hbase-common/0.97.0-SNAPSHOT/hbase-common-0.97.0-SNAPSHOT-sources.jar
> [JENKINS] Archiving <
> http://54.241.6.143/job/HBase-0.95/ws/hbase-common/target/hbase-common-0.97.0-SNAPSHOT-tests.jar>
> to
> /var/lib/jenkins/jobs/HBase-0.95/modules/org.apache.hbase$hbase-common/builds/2013-05-15_16-15-07/archive/org.apache.hbase/hbase-common/0.97.0-SNAPSHOT/hbase-common-0.97.0-SNAPSHOT-tests.jar
> [JENKINS] Archiving <
> http://54.241.6.143/job/HBase-0.95/ws/hbase-hadoop-compat/pom.xml> to
> /var/lib/jenkins/jobs/HBase-0.95/modules/org.apache.hbase$hbase-hadoop-compat/builds/2013-05-15_16-15-07/archive/org.apache.hbase/hbase-hadoop-compat/0.97.0-SNAPSHOT/hbase-hadoop-compat-0.97.0-SNAPSHOT.pom
> [JENKINS] Archiving <
> http://54.241.6.143/job/HBase-0.95/ws/hbase-hadoop-compat/target/hbase-hadoop-compat-0.97.0-SNAPSHOT.jar>
> to
> /var/lib/jenkins/jobs/HBase-0.95/modules/org.apache.hbase$hbase-hadoop-compat/builds/2013-05-15_16-15-07/archive/org.apache.hbase/hbase-hadoop-compat/0.97.0-SNAPSHOT/hbase-hadoop-compat-0.97.0-SNAPSHOT.jar
> [JENKINS] Archiving <
> http://54.241.6.143/job/HBase-0.95/ws/hbase-hadoop-compat/target/hbase-hadoop-compat-0.97.0-SNAPSHOT-sources.jar>
> to
> /var/lib/jenkins/jobs/HBase-0.95/modules/org.apache.hbase$hbase-hadoop-compat/builds/2013-05-15_16-15-07/archive/org.apache.hbase/hbase-hadoop-compat/0.97.0-SNAPSHOT/hbase-hadoop-compat-0.97.0-SNAPSHOT-sources.jar
> [JENKINS] Archiving <
> http://54.241.6.143/job/HBase-0.95/ws/hbase-hadoop-compat/target/hbase-hadoop-compat-0.97.0-SNAPSHOT-tests.jar>
> to
> /var/lib/jenkins/jobs/HBase-0.95/modules/org.apache.hbase$hbase-hadoop-compat/builds/2013-05-15_16-15-07/archive/org.apache.hbase/hbase-hadoop-compat/0.97.0-SNAPSHOT/hbase-hadoop-compat-0.97.0-SNAPSHOT-tests.jar
> [JENKINS] Archiving <
> http://54.241.6.143/job/HBase-0.95/ws/hbase-examples/pom.xml> to
> /var/lib/jenkins/jobs/HBase-0.95/modules/org.apache.hbase$hbase-examples/builds/2013-05-15_16-15-07/archive/org.apache.hbase/hbase-examples/0.97.0-SNAPSHOT/hbase-examples-0.97.0-SNAPSHOT.pom
> [JENKINS] Archiving <
> http://54.241.6.143/job/HBase-0.95/ws/hbase-it/pom.xml> to
> /var/lib/jenkins/jobs/HBase-0.95/modules/org.apache.hbase$hbase-it/builds/2013-05-15_16-15-07/archive/org.apache.hbase/hbase-it/0.97.0-SNAPSHOT/hbase-it-0.97.0-SNAPSHOT.pom
> [JENKINS] Archiving <http://54.241.6.143/job/HBase-0.95/ws/pom.xml> to
> /var/lib/jenkins/jobs/HBase-0.95/modules/org.apache.hbase$hbase/builds/2013-05-15_16-15-07/archive/org.apache.hbase/hbase/0.97.0-SNAPSHOT/hbase-0.97.0-SNAPSHOT.pom
> [JENKINS] Archiving <
> http://54.241.6.143/job/HBase-0.95/ws/target/hbase-0.97.0-SNAPSHOT-site.xml>
> to
> /var/lib/jenkins/jobs/HBase-0.95/modules/org.apache.hbase$hbase/builds/2013-05-15_16-15-07/archive/org.apache.hbase/hbase/0.97.0-SNAPSHOT/hbase-0.97.0-SNAPSHOT-site.xml
> [JENKINS] Archiving <
> http://54.241.6.143/job/HBase-0.95/ws/hbase-assembly/pom.xml> to
> /var/lib/jenkins/jobs/HBase-0.95/modules/org.apache.hbase$hbase-assembly/builds/2013-05-15_16-15-07/archive/org.apache.hbase/hbase-assembly/0.97.0-SNAPSHOT/hbase-assembly-0.97.0-SNAPSHOT.pom
> [JENKINS] Archiving <
> http://54.241.6.143/job/HBase-0.95/ws/hbase-client/pom.xml> to
> /var/lib/jenkins/jobs/HBase-0.95/modules/org.apache.hbase$hbase-client/builds/2013-05-15_16-15-07/archive/org.apache.hbase/hbase-client/0.97.0-SNAPSHOT/hbase-client-0.97.0-SNAPSHOT.pom
> [JENKINS] Archiving <
> http://54.241.6.143/job/HBase-0.95/ws/hbase-client/target/hbase-client-0.97.0-SNAPSHOT.jar>
> to
> /var/lib/jenkins/jobs/HBase-0.95/modules/org.apache.hbase$hbase-client/builds/2013-05-15_16-15-07/archive/org.apache.hbase/hbase-client/0.97.0-SNAPSHOT/hbase-client-0.97.0-SNAPSHOT.jar
> [JENKINS] Archiving <
> http://54.241.6.143/job/HBase-0.95/ws/hbase-client/target/hbase-client-0.97.0-SNAPSHOT-sources.jar>
> to
> /var/lib/jenkins/jobs/HBase-0.95/modules/org.apache.hbase$hbase-client/builds/2013-05-15_16-15-07/archive/org.apache.hbase/hbase-client/0.97.0-SNAPSHOT/hbase-client-0.97.0-SNAPSHOT-sources.jar
> [JENKINS] Archiving <
> http://54.241.6.143/job/HBase-0.95/ws/hbase-client/target/hbase-client-0.97.0-SNAPSHOT-tests.jar>
> to
> /var/lib/jenkins/jobs/HBase-0.95/modules/org.apache.hbase$hbase-client/builds/2013-05-15_16-15-07/archive/org.apache.hbase/hbase-client/0.97.0-SNAPSHOT/hbase-client-0.97.0-SNAPSHOT-tests.jar
> [JENKINS] Archiving <
> http://54.241.6.143/job/HBase-0.95/ws/hbase-prefix-tree/pom.xml> to
> /var/lib/jenkins/jobs/HBase-0.95/modules/org.apache.hbase$hbase-prefix-tree/builds/2013-05-15_16-15-07/archive/org.apache.hbase/hbase-prefix-tree/0.97.0-SNAPSHOT/hbase-prefix-tree-0.97.0-SNAPSHOT.pom
> [JENKINS] Archiving <
> http://54.241.6.143/job/HBase-0.95/ws/hbase-prefix-tree/target/hbase-prefix-tree-0.97.0-SNAPSHOT.jar>
> to
> /var/lib/jenkins/jobs/HBase-0.95/modules/org.apache.hbase$hbase-prefix-tree/builds/2013-05-15_16-15-07/archive/org.apache.hbase/hbase-prefix-tree/0.97.0-SNAPSHOT/hbase-prefix-tree-0.97.0-SNAPSHOT.jar
> [JENKINS] Archiving <
> http://54.241.6.143/job/HBase-0.95/ws/hbase-prefix-tree/target/hbase-prefix-tree-0.97.0-SNAPSHOT-sources.jar>
> to
> /var/lib/jenkins/jobs/HBase-0.95/modules/org.apache.hbase$hbase-prefix-tree/builds/2013-05-15_16-15-07/archive/org.apache.hbase/hbase-prefix-tree/0.97.0-SNAPSHOT/hbase-prefix-tree-0.97.0-SNAPSHOT-sources.jar
> [JENKINS] Archiving <
> http://54.241.6.143/job/HBase-0.95/ws/hbase-prefix-tree/target/hbase-prefix-tree-0.97.0-SNAPSHOT-tests.jar>
> to
> /var/lib/jenkins/jobs/HBase-0.95/modules/org.apache.hbase$hbase-prefix-tree/builds/2013-05-15_16-15-07/archive/org.apache.hbase/hbase-prefix-tree/0.97.0-SNAPSHOT/hbase-prefix-tree-0.97.0-SNAPSHOT-tests.jar
> [JENKINS] Archiving <
> http://54.241.6.143/job/HBase-0.95/ws/hbase-protocol/pom.xml> to
> /var/lib/jenkins/jobs/HBase-0.95/modules/org.apache.hbase$hbase-protocol/builds/2013-05-15_16-15-07/archive/org.apache.hbase/hbase-protocol/0.97.0-SNAPSHOT/hbase-protocol-0.97.0-SNAPSHOT.pom
> [JENKINS] Archiving <
> http://54.241.6.143/job/HBase-0.95/ws/hbase-protocol/target/hbase-protocol-0.97.0-SNAPSHOT.jar>
> to
> /var/lib/jenkins/jobs/HBase-0.95/modules/org.apache.hbase$hbase-protocol/builds/2013-05-15_16-15-07/archive/org.apache.hbase/hbase-protocol/0.97.0-SNAPSHOT/hbase-protocol-0.97.0-SNAPSHOT.jar
> [JENKINS] Archiving <
> http://54.241.6.143/job/HBase-0.95/ws/hbase-protocol/target/hbase-protocol-0.97.0-SNAPSHOT-sources.jar>
> to
> /var/lib/jenkins/jobs/HBase-0.95/modules/org.apache.hbase$hbase-protocol/builds/2013-05-15_16-15-07/archive/org.apache.hbase/hbase-protocol/0.97.0-SNAPSHOT/hbase-protocol-0.97.0-SNAPSHOT-sources.jar
> [JENKINS] Archiving <
> http://54.241.6.143/job/HBase-0.95/ws/hbase-protocol/target/hbase-protocol-0.97.0-SNAPSHOT-tests.jar>
> to
> /var/lib/jenkins/jobs/HBase-0.95/modules/org.apache.hbase$hbase-protocol/builds/2013-05-15_16-15-07/archive/org.apache.hbase/hbase-protocol/0.97.0-SNAPSHOT/hbase-protocol-0.97.0-SNAPSHOT-tests.jar
> [JENKINS] Archiving <
> http://54.241.6.143/job/HBase-0.95/ws/hbase-hadoop1-compat/pom.xml> to
> /var/lib/jenkins/jobs/HBase-0.95/modules/org.apache.hbase$hbase-hadoop1-compat/builds/2013-05-15_16-15-07/archive/org.apache.hbase/hbase-hadoop1-compat/0.97.0-SNAPSHOT/hbase-hadoop1-compat-0.97.0-SNAPSHOT.pom
> [JENKINS] Archiving <
> http://54.241.6.143/job/HBase-0.95/ws/hbase-hadoop1-compat/target/hbase-hadoop1-compat-0.97.0-SNAPSHOT.jar>
> to
> /var/lib/jenkins/jobs/HBase-0.95/modules/org.apache.hbase$hbase-hadoop1-compat/builds/2013-05-15_16-15-07/archive/org.apache.hbase/hbase-hadoop1-compat/0.97.0-SNAPSHOT/hbase-hadoop1-compat-0.97.0-SNAPSHOT.jar
> [JENKINS] Archiving <
> http://54.241.6.143/job/HBase-0.95/ws/hbase-hadoop1-compat/target/hbase-hadoop1-compat-0.97.0-SNAPSHOT-sources.jar>
> to
> /var/lib/jenkins/jobs/HBase-0.95/modules/org.apache.hbase$hbase-hadoop1-compat/builds/2013-05-15_16-15-07/archive/org.apache.hbase/hbase-hadoop1-compat/0.97.0-SNAPSHOT/hbase-hadoop1-compat-0.97.0-SNAPSHOT-sources.jar
> [JENKINS] Archiving <
> http://54.241.6.143/job/HBase-0.95/ws/hbase-hadoop1-compat/target/hbase-hadoop1-compat-0.97.0-SNAPSHOT-tests.jar>
> to
> /var/lib/jenkins/jobs/HBase-0.95/modules/org.apache.hbase$hbase-hadoop1-compat/builds/2013-05-15_16-15-07/archive/org.apache.hbase/hbase-hadoop1-compat/0.97.0-SNAPSHOT/hbase-hadoop1-compat-0.97.0-SNAPSHOT-tests.jar
> [JENKINS] Archiving <
> http://54.241.6.143/job/HBase-0.95/ws/hbase-server/pom.xml> to
> /var/lib/jenkins/jobs/HBase-0.95/modules/org.apache.hbase$hbase-server/builds/2013-05-15_16-15-07/archive/org.apache.hbase/hbase-server/0.97.0-SNAPSHOT/hbase-server-0.97.0-SNAPSHOT.pom
> Waiting for Jenkins to finish collecting data
> mavenExecutionResult exceptions not empty
> message : Failed to execute goal
> org.apache.maven.plugins:maven-surefire-plugin:2.12-TRUNK-HBASE-2:test
> (secondPartTestsExecution) on project hbase-server: There are test failures.
>
> Please refer to <
> http://54.241.6.143/job/HBase-0.95/ws/hbase-server/target/surefire-reports>
> for the individual test results.
> cause : There are test failures.
>
> Please refer to <
> http://54.241.6.143/job/HBase-0.95/ws/hbase-server/target/surefire-reports>
> for the individual test results.
> Stack trace :
> org.apache.maven.lifecycle.LifecycleExecutionException: Failed to execute
> goal org.apache.maven.plugins:maven-surefire-plugin:2.12-TRUNK-HBASE-2:test
> (secondPartTestsExecution) on project hbase-server: There are test failures.
>
> Please refer to <
> http://54.241.6.143/job/HBase-0.95/ws/hbase-server/target/surefire-reports>
> for the individual test results.
>         at
> org.apache.maven.lifecycle.internal.MojoExecutor.execute(MojoExecutor.java:213)
>         at
> org.apache.maven.lifecycle.internal.MojoExecutor.execute(MojoExecutor.java:153)
>         at
> org.apache.maven.lifecycle.internal.MojoExecutor.execute(MojoExecutor.java:145)
>         at
> org.apache.maven.lifecycle.internal.LifecycleModuleBuilder.buildProject(LifecycleModuleBuilder.java:84)
>         at
> org.apache.maven.lifecycle.internal.LifecycleModuleBuilder.buildProject(LifecycleModuleBuilder.java:59)
>         at
> org.apache.maven.lifecycle.internal.LifecycleStarter.singleThreadedBuild(LifecycleStarter.java:183)
>         at
> org.apache.maven.lifecycle.internal.LifecycleStarter.execute(LifecycleStarter.java:161)
>         at org.apache.maven.DefaultMaven.doExecute(DefaultMaven.java:320)
>         at org.apache.maven.DefaultMaven.execute(DefaultMaven.java:156)
>         at
> org.jvnet.hudson.maven3.launcher.Maven3Launcher.main(Maven3Launcher.java:79)
>         at sun.reflect.NativeMethodAccessorImpl.invoke0(Native Method)
>         at
> sun.reflect.NativeMethodAccessorImpl.invoke(NativeMethodAccessorImpl.java:39)
>         at
> sun.reflect.DelegatingMethodAccessorImpl.invoke(DelegatingMethodAccessorImpl.java:25)
>         at java.lang.reflect.Method.invoke(Method.java:597)
>         at
> org.codehaus.plexus.classworlds.launcher.Launcher.launchStandard(Launcher.java:329)
>         at
> org.codehaus.plexus.classworlds.launcher.Launcher.launch(Launcher.java:239)
>         at
> org.jvnet.hudson.maven3.agent.Maven3Main.launch(Maven3Main.java:158)
>         at hudson.maven.Maven3Builder.call(Maven3Builder.java:100)
>         at hudson.maven.Maven3Builder.call(Maven3Builder.java:66)
>         at hudson.remoting.UserRequest.perform(UserRequest.java:118)
>         at hudson.remoting.UserRequest.perform(UserRequest.java:48)
>         at hudson.remoting.Request$2.run(Request.java:326)
>         at
> hudson.remoting.InterceptingExecutorService$1.call(InterceptingExecutorService.java:72)
>         at
> java.util.concurrent.FutureTask$Sync.innerRun(FutureTask.java:303)
>         at java.util.concurrent.FutureTask.run(FutureTask.java:138)
>         at
> java.util.concurrent.ThreadPoolExecutor$Worker.runTask(ThreadPoolExecutor.java:895)
>         at
> java.util.concurrent.ThreadPoolExecutor$Worker.run(ThreadPoolExecutor.java:918)
>         at java.lang.Thread.run(Thread.java:662)
> Caused by: org.apache.maven.plugin.MojoFailureException: There are test
> failures.
>
> Please refer to <
> http://54.241.6.143/job/HBase-0.95/ws/hbase-server/target/surefire-reports>
> for the individual test results.
>         at
> org.apache.maven.plugin.surefire.SurefireHelper.reportExecution(SurefireHelper.java:87)
>         at
> org.apache.maven.plugin.surefire.SurefirePlugin.writeSummary(SurefirePlugin.java:651)
>         at
> org.apache.maven.plugin.surefire.SurefirePlugin.handleSummary(SurefirePlugin.java:625)
>         at
> org.apache.maven.plugin.surefire.AbstractSurefireMojo.executeAfterPreconditionsChecked(AbstractSurefireMojo.java:137)
>         at
> org.apache.maven.plugin.surefire.AbstractSurefireMojo.execute(AbstractSurefireMojo.java:98)
>         at
> org.apache.maven.plugin.DefaultBuildPluginManager.executeMojo(DefaultBuildPluginManager.java:101)
>         at
> org.apache.maven.lifecycle.internal.MojoExecutor.execute(MojoExecutor.java:209)
>         ... 27 more
> channel stopped
>

Mime
  • Unnamed multipart/alternative (inline, None, 0 bytes)
View raw message