hbase-dev mailing list archives

Site index · List index
Message view « Date » · « Thread »
Top « Date » · « Thread »
From Jonathan Hsieh <...@cloudera.com>
Subject Re: Build failed in Jenkins: HBase-TRUNK-Hadoop-2 #232
Date Thu, 09 May 2013 12:51:53 GMT
< Running org.apache.hadoop.hbase.mapreduce.TestHFileOutputFormat
< Running org.apache.hadoop.hbase.mapreduce.TestImportTsv
< Running org.apache.hadoop.hbase.mapreduce.TestRowCounter
< Running org.apache.hadoop.hbase.mapreduce.TestTableInputFormatScan1
< Running org.apache.hadoop.hbase.mapreduce.TestTableMapReduce
< Running org.apache.hadoop.hbase.TestZooKeeper



On Thu, May 9, 2013 at 2:57 AM, <apurtell@apache.org> wrote:

> See <http://54.241.6.143/job/HBase-TRUNK-Hadoop-2/232/>
>
> ------------------------------------------
> [...truncated 5284 lines...]
> Tests run: 9, Failures: 0, Errors: 0, Skipped: 0, Time elapsed: 22.501 sec
> Running org.apache.hadoop.hbase.regionserver.TestCompactionWithCoprocessor
> Tests run: 17, Failures: 0, Errors: 0, Skipped: 0, Time elapsed: 75.897 sec
> Running org.apache.hadoop.hbase.regionserver.TestSeekOptimizations
> Tests run: 6, Failures: 0, Errors: 0, Skipped: 0, Time elapsed: 5.574 sec
> Running org.apache.hadoop.hbase.regionserver.TestStore
> Tests run: 15, Failures: 0, Errors: 0, Skipped: 0, Time elapsed: 16.908 sec
> Running org.apache.hadoop.hbase.util.TestFSVisitor
> Tests run: 3, Failures: 0, Errors: 0, Skipped: 0, Time elapsed: 13.34 sec
> Running org.apache.hadoop.hbase.util.TestRegionSplitter
> Tests run: 5, Failures: 0, Errors: 0, Skipped: 0, Time elapsed: 19.226 sec
> Running org.apache.hadoop.hbase.util.TestFSUtils
> Tests run: 6, Failures: 0, Errors: 0, Skipped: 0, Time elapsed: 14.132 sec
> Running org.apache.hadoop.hbase.util.TestDefaultEnvironmentEdge
> Tests run: 1, Failures: 0, Errors: 0, Skipped: 0, Time elapsed: 0.447 sec
> Running org.apache.hadoop.hbase.util.TestFSTableDescriptors
> Tests run: 12, Failures: 0, Errors: 0, Skipped: 0, Time elapsed: 3.186 sec
> Running org.apache.hadoop.hbase.util.TestMergeTool
> Tests run: 1, Failures: 0, Errors: 0, Skipped: 0, Time elapsed: 27.061 sec
> Running org.apache.hadoop.hbase.regionserver.wal.TestWALReplay
> Tests run: 8, Failures: 0, Errors: 0, Skipped: 0, Time elapsed: 240.058 sec
> Running org.apache.hadoop.hbase.util.hbck.TestOfflineMetaRebuildOverlap
> Tests run: 1, Failures: 0, Errors: 0, Skipped: 0, Time elapsed: 31.452 sec
> Running org.apache.hadoop.hbase.util.hbck.TestOfflineMetaRebuildHole
> Tests run: 1, Failures: 0, Errors: 0, Skipped: 0, Time elapsed: 31.422 sec
> Running org.apache.hadoop.hbase.util.TestProcessBasedCluster
> Tests run: 1, Failures: 0, Errors: 0, Skipped: 0, Time elapsed: 1.516 sec
> Running org.apache.hadoop.hbase.util.hbck.TestOfflineMetaRebuildBase
> Tests run: 1, Failures: 0, Errors: 0, Skipped: 0, Time elapsed: 30.345 sec
> Running org.apache.hadoop.hbase.util.TestMergeTable
> Tests run: 1, Failures: 0, Errors: 0, Skipped: 0, Time elapsed: 31.642 sec
> Running org.apache.hadoop.hbase.util.TestCoprocessorScanPolicy
> Tests run: 4, Failures: 0, Errors: 0, Skipped: 0, Time elapsed: 26.898 sec
> Running org.apache.hadoop.hbase.util.TestMiniClusterLoadEncoded
> Running org.apache.hadoop.hbase.util.TestIdLock
> Tests run: 1, Failures: 0, Errors: 0, Skipped: 0, Time elapsed: 16.358 sec
> Tests run: 5, Failures: 0, Errors: 0, Skipped: 0, Time elapsed: 73.31 sec
> Running org.apache.hadoop.hbase.zookeeper.TestHQuorumPeer
> Tests run: 3, Failures: 0, Errors: 0, Skipped: 0, Time elapsed: 4.714 sec
> Running org.apache.hadoop.hbase.zookeeper.TestZooKeeperACL
> Tests run: 5, Failures: 0, Errors: 0, Skipped: 0, Time elapsed: 15.982 sec
> Running org.apache.hadoop.hbase.zookeeper.TestZKTable
> Tests run: 1, Failures: 0, Errors: 0, Skipped: 0, Time elapsed: 1.714 sec
> Running org.apache.hadoop.hbase.zookeeper.TestZooKeeperNodeTracker
> Tests run: 3, Failures: 0, Errors: 0, Skipped: 0, Time elapsed: 2.056 sec
> Running org.apache.hadoop.hbase.zookeeper.TestZKMulti
> Tests run: 6, Failures: 0, Errors: 0, Skipped: 0, Time elapsed: 1.874 sec
> Running org.apache.hadoop.hbase.zookeeper.TestZKLeaderManager
> Tests run: 1, Failures: 0, Errors: 0, Skipped: 0, Time elapsed: 1.847 sec
> Running org.apache.hadoop.hbase.zookeeper.TestRecoverableZooKeeper
> Tests run: 1, Failures: 0, Errors: 0, Skipped: 0, Time elapsed: 3.468 sec
> Running
> org.apache.hadoop.hbase.zookeeper.lock.TestZKInterProcessReadWriteLock
> Tests run: 6, Failures: 0, Errors: 0, Skipped: 0, Time elapsed: 27.693 sec
> Running org.apache.hadoop.hbase.catalog.TestMetaReaderEditorNoCluster
> Tests run: 2, Failures: 0, Errors: 0, Skipped: 0, Time elapsed: 7.39 sec
> Running org.apache.hadoop.hbase.catalog.TestCatalogTracker
> Tests run: 7, Failures: 0, Errors: 0, Skipped: 0, Time elapsed: 4.502 sec
> Running org.apache.hadoop.hbase.catalog.TestMetaReaderEditor
> Tests run: 5, Failures: 0, Errors: 0, Skipped: 0, Time elapsed: 27.005 sec
> Running org.apache.hadoop.hbase.catalog.TestMetaMigrationConvertingToPB
> Tests run: 3, Failures: 0, Errors: 0, Skipped: 0, Time elapsed: 41.285 sec
> Running org.apache.hadoop.hbase.util.TestMiniClusterLoadParallel
> Tests run: 4, Failures: 0, Errors: 0, Skipped: 0, Time elapsed: 118.276 sec
> Running org.apache.hadoop.hbase.client.TestHTableMultiplexer
> Tests run: 1, Failures: 0, Errors: 0, Skipped: 0, Time elapsed: 17.973 sec
> Running org.apache.hadoop.hbase.util.TestMiniClusterLoadSequential
> Tests run: 4, Failures: 0, Errors: 0, Skipped: 0, Time elapsed: 123.367 sec
> Running org.apache.hadoop.hbase.client.TestSnapshotCloneIndependence
> Tests run: 6, Failures: 0, Errors: 0, Skipped: 0, Time elapsed: 46.972 sec
> Running org.apache.hadoop.hbase.client.TestHTableUtil
> Tests run: 2, Failures: 0, Errors: 0, Skipped: 0, Time elapsed: 14.555 sec
> Running
> org.apache.hadoop.hbase.client.TestHTablePool$TestHTableReusablePool
> Tests run: 8, Failures: 0, Errors: 0, Skipped: 0, Time elapsed: 4.487 sec
> Running
> org.apache.hadoop.hbase.client.TestHTablePool$TestHTableThreadLocalPool
> Tests run: 8, Failures: 0, Errors: 0, Skipped: 0, Time elapsed: 20.334 sec
> Running org.apache.hadoop.hbase.client.TestMetaScanner
> Tests run: 1, Failures: 0, Errors: 0, Skipped: 0, Time elapsed: 13.467 sec
> Running org.apache.hadoop.hbase.client.replication.TestReplicationAdmin
> Tests run: 1, Failures: 0, Errors: 0, Skipped: 0, Time elapsed: 1.575 sec
> Running org.apache.hadoop.hbase.client.TestMultiParallel
> Tests run: 11, Failures: 0, Errors: 0, Skipped: 0, Time elapsed: 105.962
> sec
> Running org.apache.hadoop.hbase.client.TestScannerTimeout
> Tests run: 4, Failures: 0, Errors: 0, Skipped: 0, Time elapsed: 48.198 sec
> Running org.apache.hadoop.hbase.client.TestCloneSnapshotFromClient
> Running org.apache.hadoop.hbase.util.TestHBaseFsck
> Tests run: 36, Failures: 0, Errors: 0, Skipped: 1, Time elapsed: 261.408
> sec
> Tests run: 3, Failures: 0, Errors: 0, Skipped: 0, Time elapsed: 90.148 sec
> Running org.apache.hadoop.hbase.client.TestFromClientSide
> Tests run: 61, Failures: 0, Errors: 0, Skipped: 3, Time elapsed: 169.771
> sec
> Running org.apache.hadoop.hbase.client.TestScannersFromClientSide
> Tests run: 4, Failures: 0, Errors: 0, Skipped: 0, Time elapsed: 24.825 sec
> Running org.apache.hadoop.hbase.client.TestMultipleTimestamps
> Tests run: 8, Failures: 0, Errors: 0, Skipped: 0, Time elapsed: 28.708 sec
> Running org.apache.hadoop.hbase.client.TestTimestampsFilter
> Tests run: 3, Failures: 0, Errors: 0, Skipped: 0, Time elapsed: 23.929 sec
> Running org.apache.hadoop.hbase.client.TestFromClientSide3
> Tests run: 5, Failures: 0, Errors: 0, Skipped: 0, Time elapsed: 75.611 sec
> Running org.apache.hadoop.hbase.client.TestClientScannerRPCTimeout
> Tests run: 1, Failures: 0, Errors: 0, Skipped: 0, Time elapsed: 22.675 sec
> Running org.apache.hadoop.hbase.client.TestClientTimeouts
> Tests run: 1, Failures: 0, Errors: 0, Skipped: 0, Time elapsed: 16.844 sec
> Running org.apache.hadoop.hbase.client.TestSnapshotFromClient
> Tests run: 3, Failures: 0, Errors: 0, Skipped: 0, Time elapsed: 25.974 sec
> Running org.apache.hadoop.hbase.client.TestShell
> Tests run: 1, Failures: 0, Errors: 0, Skipped: 0, Time elapsed: 96.939 sec
> Running org.apache.hadoop.hbase.client.TestSnapshotMetadata
> Tests run: 4, Failures: 0, Errors: 0, Skipped: 0, Time elapsed: 32.227 sec
> Running org.apache.hadoop.hbase.client.TestRestoreSnapshotFromClient
> Tests run: 3, Failures: 0, Errors: 0, Skipped: 0, Time elapsed: 142.275 sec
> Running org.apache.hadoop.hbase.mapred.TestTableInputFormat
> Tests run: 10, Failures: 0, Errors: 0, Skipped: 0, Time elapsed: 21.867 sec
> Running
> org.apache.hadoop.hbase.backup.example.TestZooKeeperTableArchiveClient
> Tests run: 3, Failures: 0, Errors: 0, Skipped: 0, Time elapsed: 10.241 sec
> Running org.apache.hadoop.hbase.mapred.TestTableMapReduce
> Tests run: 1, Failures: 0, Errors: 0, Skipped: 0, Time elapsed: 71.082 sec
> Running org.apache.hadoop.hbase.TestFullLogReconstruction
> Tests run: 1, Failures: 0, Errors: 0, Skipped: 0, Time elapsed: 33.533 sec
> Running org.apache.hadoop.hbase.ipc.TestProtoBufRpc
> Tests run: 1, Failures: 0, Errors: 0, Skipped: 0, Time elapsed: 2.924 sec
> Running org.apache.hadoop.hbase.ipc.TestDelayedRpc
> Tests run: 4, Failures: 0, Errors: 1, Skipped: 0, Time elapsed: 4.895 sec
> <<< FAILURE!
> Running org.apache.hadoop.hbase.ipc.TestHBaseClient
> Tests run: 1, Failures: 0, Errors: 0, Skipped: 0, Time elapsed: 0.543 sec
> Running org.apache.hadoop.hbase.client.TestFromClientSideWithCoprocessor
> Tests run: 61, Failures: 0, Errors: 0, Skipped: 3, Time elapsed: 167.683
> sec
> Running org.apache.hadoop.hbase.client.TestAdmin
> Tests run: 43, Failures: 0, Errors: 0, Skipped: 0, Time elapsed: 227.121
> sec
> Running org.apache.hadoop.hbase.backup.TestHFileArchiving
> Tests run: 5, Failures: 0, Errors: 0, Skipped: 0, Time elapsed: 88.479 sec
> Running org.apache.hadoop.hbase.client.TestHCM
> Tests run: 13, Failures: 0, Errors: 0, Skipped: 0, Time elapsed: 186.694
> sec
>
> Results :
>
> Failed tests:
> testWithFilter(org.apache.hadoop.hbase.mapreduce.TestImportExport)
>
> testScanOPPToEmpty(org.apache.hadoop.hbase.mapreduce.TestTableInputFormatScan2)
>
> testScanOBBToQPP(org.apache.hadoop.hbase.mapreduce.TestTableInputFormatScan2)
>
> testScanOPPToEmpty(org.apache.hadoop.hbase.mapreduce.TestMultiTableInputFormat)
>
> Tests in error:
>
> testDelayedRpcImmediateReturnValue(org.apache.hadoop.hbase.ipc.TestDelayedRpc):
> Index: 1, Size: 1
>
> Tests run: 1474, Failures: 4, Errors: 1, Skipped: 14
>
> [JENKINS] Recording test results
> [INFO]
> [INFO]
> ------------------------------------------------------------------------
> [INFO] Skipping HBase
> [INFO] This project has been banned from the build due to previous
> failures.
> [INFO]
> ------------------------------------------------------------------------
> [INFO]
> [INFO]
> ------------------------------------------------------------------------
> [INFO] Skipping HBase
> [INFO] This project has been banned from the build due to previous
> failures.
> [INFO]
> ------------------------------------------------------------------------
> [INFO]
> ------------------------------------------------------------------------
> [INFO] Reactor Summary:
> [INFO]
> [INFO] HBase ............................................. SUCCESS
> [51.173s]
> [INFO] HBase - Common .................................... SUCCESS
> [1:50.269s]
> [INFO] HBase - Protocol .................................. SUCCESS
> [18.030s]
> [INFO] HBase - Client .................................... SUCCESS
> [14.514s]
> [INFO] HBase - Prefix Tree ............................... SUCCESS [5.468s]
> [INFO] HBase - Hadoop Compatibility ...................... SUCCESS [1.349s]
> [INFO] HBase - Hadoop Two Compatibility .................. SUCCESS
> [35.032s]
> [INFO] HBase - Server .................................... FAILURE
> [51:01.862s]
> [INFO] HBase - Integration Tests ......................... SKIPPED
> [INFO] HBase - Examples .................................. SKIPPED
> [INFO] HBase - Assembly .................................. SKIPPED
> [INFO]
> ------------------------------------------------------------------------
> [INFO] BUILD FAILURE
> [INFO]
> ------------------------------------------------------------------------
> [INFO] Total time: 55:16.797s
> [INFO] Finished at: Thu May 09 09:57:14 UTC 2013
> [INFO] Final Memory: 140M/564M
> [INFO]
> ------------------------------------------------------------------------
> [JENKINS] Archiving <
> http://54.241.6.143/job/HBase-TRUNK-Hadoop-2/ws/hbase-hadoop2-compat/pom.xml>
> to
> /var/lib/jenkins/jobs/HBase-TRUNK-Hadoop-2/modules/org.apache.hbase$hbase-hadoop2-compat/builds/2013-05-09_09-01-51/archive/org.apache.hbase/hbase-hadoop2-compat/0.97.0-SNAPSHOT/hbase-hadoop2-compat-0.97.0-SNAPSHOT.pom
> [JENKINS] Archiving <
> http://54.241.6.143/job/HBase-TRUNK-Hadoop-2/ws/hbase-hadoop2-compat/target/hbase-hadoop2-compat-0.97.0-SNAPSHOT.jar>
> to
> /var/lib/jenkins/jobs/HBase-TRUNK-Hadoop-2/modules/org.apache.hbase$hbase-hadoop2-compat/builds/2013-05-09_09-01-51/archive/org.apache.hbase/hbase-hadoop2-compat/0.97.0-SNAPSHOT/hbase-hadoop2-compat-0.97.0-SNAPSHOT.jar
> [JENKINS] Archiving <
> http://54.241.6.143/job/HBase-TRUNK-Hadoop-2/ws/hbase-hadoop2-compat/target/hbase-hadoop2-compat-0.97.0-SNAPSHOT-sources.jar>
> to
> /var/lib/jenkins/jobs/HBase-TRUNK-Hadoop-2/modules/org.apache.hbase$hbase-hadoop2-compat/builds/2013-05-09_09-01-51/archive/org.apache.hbase/hbase-hadoop2-compat/0.97.0-SNAPSHOT/hbase-hadoop2-compat-0.97.0-SNAPSHOT-sources.jar
> [JENKINS] Archiving <
> http://54.241.6.143/job/HBase-TRUNK-Hadoop-2/ws/hbase-hadoop2-compat/target/hbase-hadoop2-compat-0.97.0-SNAPSHOT-tests.jar>
> to
> /var/lib/jenkins/jobs/HBase-TRUNK-Hadoop-2/modules/org.apache.hbase$hbase-hadoop2-compat/builds/2013-05-09_09-01-51/archive/org.apache.hbase/hbase-hadoop2-compat/0.97.0-SNAPSHOT/hbase-hadoop2-compat-0.97.0-SNAPSHOT-tests.jar
> [JENKINS] Archiving <
> http://54.241.6.143/job/HBase-TRUNK-Hadoop-2/ws/hbase-common/pom.xml> to
> /var/lib/jenkins/jobs/HBase-TRUNK-Hadoop-2/modules/org.apache.hbase$hbase-common/builds/2013-05-09_09-01-51/archive/org.apache.hbase/hbase-common/0.97.0-SNAPSHOT/hbase-common-0.97.0-SNAPSHOT.pom
> [JENKINS] Archiving <
> http://54.241.6.143/job/HBase-TRUNK-Hadoop-2/ws/hbase-common/target/hbase-common-0.97.0-SNAPSHOT.jar>
> to
> /var/lib/jenkins/jobs/HBase-TRUNK-Hadoop-2/modules/org.apache.hbase$hbase-common/builds/2013-05-09_09-01-51/archive/org.apache.hbase/hbase-common/0.97.0-SNAPSHOT/hbase-common-0.97.0-SNAPSHOT.jar
> [JENKINS] Archiving <
> http://54.241.6.143/job/HBase-TRUNK-Hadoop-2/ws/hbase-common/target/hbase-common-0.97.0-SNAPSHOT-sources.jar>
> to
> /var/lib/jenkins/jobs/HBase-TRUNK-Hadoop-2/modules/org.apache.hbase$hbase-common/builds/2013-05-09_09-01-51/archive/org.apache.hbase/hbase-common/0.97.0-SNAPSHOT/hbase-common-0.97.0-SNAPSHOT-sources.jar
> [JENKINS] Archiving <
> http://54.241.6.143/job/HBase-TRUNK-Hadoop-2/ws/hbase-common/target/hbase-common-0.97.0-SNAPSHOT-tests.jar>
> to
> /var/lib/jenkins/jobs/HBase-TRUNK-Hadoop-2/modules/org.apache.hbase$hbase-common/builds/2013-05-09_09-01-51/archive/org.apache.hbase/hbase-common/0.97.0-SNAPSHOT/hbase-common-0.97.0-SNAPSHOT-tests.jar
> [JENKINS] Archiving <
> http://54.241.6.143/job/HBase-TRUNK-Hadoop-2/ws/hbase-hadoop-compat/pom.xml>
> to
> /var/lib/jenkins/jobs/HBase-TRUNK-Hadoop-2/modules/org.apache.hbase$hbase-hadoop-compat/builds/2013-05-09_09-01-51/archive/org.apache.hbase/hbase-hadoop-compat/0.97.0-SNAPSHOT/hbase-hadoop-compat-0.97.0-SNAPSHOT.pom
> [JENKINS] Archiving <
> http://54.241.6.143/job/HBase-TRUNK-Hadoop-2/ws/hbase-hadoop-compat/target/hbase-hadoop-compat-0.97.0-SNAPSHOT.jar>
> to
> /var/lib/jenkins/jobs/HBase-TRUNK-Hadoop-2/modules/org.apache.hbase$hbase-hadoop-compat/builds/2013-05-09_09-01-51/archive/org.apache.hbase/hbase-hadoop-compat/0.97.0-SNAPSHOT/hbase-hadoop-compat-0.97.0-SNAPSHOT.jar
> [JENKINS] Archiving <
> http://54.241.6.143/job/HBase-TRUNK-Hadoop-2/ws/hbase-hadoop-compat/target/hbase-hadoop-compat-0.97.0-SNAPSHOT-sources.jar>
> to
> /var/lib/jenkins/jobs/HBase-TRUNK-Hadoop-2/modules/org.apache.hbase$hbase-hadoop-compat/builds/2013-05-09_09-01-51/archive/org.apache.hbase/hbase-hadoop-compat/0.97.0-SNAPSHOT/hbase-hadoop-compat-0.97.0-SNAPSHOT-sources.jar
> [JENKINS] Archiving <
> http://54.241.6.143/job/HBase-TRUNK-Hadoop-2/ws/hbase-hadoop-compat/target/hbase-hadoop-compat-0.97.0-SNAPSHOT-tests.jar>
> to
> /var/lib/jenkins/jobs/HBase-TRUNK-Hadoop-2/modules/org.apache.hbase$hbase-hadoop-compat/builds/2013-05-09_09-01-51/archive/org.apache.hbase/hbase-hadoop-compat/0.97.0-SNAPSHOT/hbase-hadoop-compat-0.97.0-SNAPSHOT-tests.jar
> [JENKINS] Archiving <
> http://54.241.6.143/job/HBase-TRUNK-Hadoop-2/ws/hbase-examples/pom.xml>
> to
> /var/lib/jenkins/jobs/HBase-TRUNK-Hadoop-2/modules/org.apache.hbase$hbase-examples/builds/2013-05-09_09-01-51/archive/org.apache.hbase/hbase-examples/0.97.0-SNAPSHOT/hbase-examples-0.97.0-SNAPSHOT.pom
> [JENKINS] Archiving <
> http://54.241.6.143/job/HBase-TRUNK-Hadoop-2/ws/hbase-it/pom.xml> to
> /var/lib/jenkins/jobs/HBase-TRUNK-Hadoop-2/modules/org.apache.hbase$hbase-it/builds/2013-05-09_09-01-51/archive/org.apache.hbase/hbase-it/0.97.0-SNAPSHOT/hbase-it-0.97.0-SNAPSHOT.pom
> [JENKINS] Archiving <
> http://54.241.6.143/job/HBase-TRUNK-Hadoop-2/ws/pom.xml> to
> /var/lib/jenkins/jobs/HBase-TRUNK-Hadoop-2/modules/org.apache.hbase$hbase/builds/2013-05-09_09-01-51/archive/org.apache.hbase/hbase/0.97.0-SNAPSHOT/hbase-0.97.0-SNAPSHOT.pom
> [JENKINS] Archiving <
> http://54.241.6.143/job/HBase-TRUNK-Hadoop-2/ws/target/hbase-0.97.0-SNAPSHOT-site.xml>
> to
> /var/lib/jenkins/jobs/HBase-TRUNK-Hadoop-2/modules/org.apache.hbase$hbase/builds/2013-05-09_09-01-51/archive/org.apache.hbase/hbase/0.97.0-SNAPSHOT/hbase-0.97.0-SNAPSHOT-site.xml
> [JENKINS] Archiving <
> http://54.241.6.143/job/HBase-TRUNK-Hadoop-2/ws/hbase-assembly/pom.xml>
> to
> /var/lib/jenkins/jobs/HBase-TRUNK-Hadoop-2/modules/org.apache.hbase$hbase-assembly/builds/2013-05-09_09-01-51/archive/org.apache.hbase/hbase-assembly/0.97.0-SNAPSHOT/hbase-assembly-0.97.0-SNAPSHOT.pom
> [JENKINS] Archiving <
> http://54.241.6.143/job/HBase-TRUNK-Hadoop-2/ws/hbase-client/pom.xml> to
> /var/lib/jenkins/jobs/HBase-TRUNK-Hadoop-2/modules/org.apache.hbase$hbase-client/builds/2013-05-09_09-01-51/archive/org.apache.hbase/hbase-client/0.97.0-SNAPSHOT/hbase-client-0.97.0-SNAPSHOT.pom
> [JENKINS] Archiving <
> http://54.241.6.143/job/HBase-TRUNK-Hadoop-2/ws/hbase-client/target/hbase-client-0.97.0-SNAPSHOT.jar>
> to
> /var/lib/jenkins/jobs/HBase-TRUNK-Hadoop-2/modules/org.apache.hbase$hbase-client/builds/2013-05-09_09-01-51/archive/org.apache.hbase/hbase-client/0.97.0-SNAPSHOT/hbase-client-0.97.0-SNAPSHOT.jar
> [JENKINS] Archiving <
> http://54.241.6.143/job/HBase-TRUNK-Hadoop-2/ws/hbase-client/target/hbase-client-0.97.0-SNAPSHOT-sources.jar>
> to
> /var/lib/jenkins/jobs/HBase-TRUNK-Hadoop-2/modules/org.apache.hbase$hbase-client/builds/2013-05-09_09-01-51/archive/org.apache.hbase/hbase-client/0.97.0-SNAPSHOT/hbase-client-0.97.0-SNAPSHOT-sources.jar
> [JENKINS] Archiving <
> http://54.241.6.143/job/HBase-TRUNK-Hadoop-2/ws/hbase-client/target/hbase-client-0.97.0-SNAPSHOT-tests.jar>
> to
> /var/lib/jenkins/jobs/HBase-TRUNK-Hadoop-2/modules/org.apache.hbase$hbase-client/builds/2013-05-09_09-01-51/archive/org.apache.hbase/hbase-client/0.97.0-SNAPSHOT/hbase-client-0.97.0-SNAPSHOT-tests.jar
> [JENKINS] Archiving <
> http://54.241.6.143/job/HBase-TRUNK-Hadoop-2/ws/hbase-prefix-tree/pom.xml>
> to
> /var/lib/jenkins/jobs/HBase-TRUNK-Hadoop-2/modules/org.apache.hbase$hbase-prefix-tree/builds/2013-05-09_09-01-51/archive/org.apache.hbase/hbase-prefix-tree/0.97.0-SNAPSHOT/hbase-prefix-tree-0.97.0-SNAPSHOT.pom
> [JENKINS] Archiving <
> http://54.241.6.143/job/HBase-TRUNK-Hadoop-2/ws/hbase-prefix-tree/target/hbase-prefix-tree-0.97.0-SNAPSHOT.jar>
> to
> /var/lib/jenkins/jobs/HBase-TRUNK-Hadoop-2/modules/org.apache.hbase$hbase-prefix-tree/builds/2013-05-09_09-01-51/archive/org.apache.hbase/hbase-prefix-tree/0.97.0-SNAPSHOT/hbase-prefix-tree-0.97.0-SNAPSHOT.jar
> [JENKINS] Archiving <
> http://54.241.6.143/job/HBase-TRUNK-Hadoop-2/ws/hbase-prefix-tree/target/hbase-prefix-tree-0.97.0-SNAPSHOT-sources.jar>
> to
> /var/lib/jenkins/jobs/HBase-TRUNK-Hadoop-2/modules/org.apache.hbase$hbase-prefix-tree/builds/2013-05-09_09-01-51/archive/org.apache.hbase/hbase-prefix-tree/0.97.0-SNAPSHOT/hbase-prefix-tree-0.97.0-SNAPSHOT-sources.jar
> [JENKINS] Archiving <
> http://54.241.6.143/job/HBase-TRUNK-Hadoop-2/ws/hbase-prefix-tree/target/hbase-prefix-tree-0.97.0-SNAPSHOT-tests.jar>
> to
> /var/lib/jenkins/jobs/HBase-TRUNK-Hadoop-2/modules/org.apache.hbase$hbase-prefix-tree/builds/2013-05-09_09-01-51/archive/org.apache.hbase/hbase-prefix-tree/0.97.0-SNAPSHOT/hbase-prefix-tree-0.97.0-SNAPSHOT-tests.jar
> [JENKINS] Archiving <
> http://54.241.6.143/job/HBase-TRUNK-Hadoop-2/ws/hbase-protocol/pom.xml>
> to
> /var/lib/jenkins/jobs/HBase-TRUNK-Hadoop-2/modules/org.apache.hbase$hbase-protocol/builds/2013-05-09_09-01-51/archive/org.apache.hbase/hbase-protocol/0.97.0-SNAPSHOT/hbase-protocol-0.97.0-SNAPSHOT.pom
> [JENKINS] Archiving <
> http://54.241.6.143/job/HBase-TRUNK-Hadoop-2/ws/hbase-protocol/target/hbase-protocol-0.97.0-SNAPSHOT.jar>
> to
> /var/lib/jenkins/jobs/HBase-TRUNK-Hadoop-2/modules/org.apache.hbase$hbase-protocol/builds/2013-05-09_09-01-51/archive/org.apache.hbase/hbase-protocol/0.97.0-SNAPSHOT/hbase-protocol-0.97.0-SNAPSHOT.jar
> [JENKINS] Archiving <
> http://54.241.6.143/job/HBase-TRUNK-Hadoop-2/ws/hbase-protocol/target/hbase-protocol-0.97.0-SNAPSHOT-sources.jar>
> to
> /var/lib/jenkins/jobs/HBase-TRUNK-Hadoop-2/modules/org.apache.hbase$hbase-protocol/builds/2013-05-09_09-01-51/archive/org.apache.hbase/hbase-protocol/0.97.0-SNAPSHOT/hbase-protocol-0.97.0-SNAPSHOT-sources.jar
> [JENKINS] Archiving <
> http://54.241.6.143/job/HBase-TRUNK-Hadoop-2/ws/hbase-protocol/target/hbase-protocol-0.97.0-SNAPSHOT-tests.jar>
> to
> /var/lib/jenkins/jobs/HBase-TRUNK-Hadoop-2/modules/org.apache.hbase$hbase-protocol/builds/2013-05-09_09-01-51/archive/org.apache.hbase/hbase-protocol/0.97.0-SNAPSHOT/hbase-protocol-0.97.0-SNAPSHOT-tests.jar
> [JENKINS] Archiving <
> http://54.241.6.143/job/HBase-TRUNK-Hadoop-2/ws/hbase-server/pom.xml> to
> /var/lib/jenkins/jobs/HBase-TRUNK-Hadoop-2/modules/org.apache.hbase$hbase-server/builds/2013-05-09_09-01-51/archive/org.apache.hbase/hbase-server/0.97.0-SNAPSHOT/hbase-server-0.97.0-SNAPSHOT.pom
> Waiting for Jenkins to finish collecting data
> mavenExecutionResult exceptions not empty
> message : Failed to execute goal
> org.apache.maven.plugins:maven-surefire-plugin:2.12-TRUNK-HBASE-2:test
> (secondPartTestsExecution) on project hbase-server: Failure or timeout
> cause : Failure or timeout
> Stack trace :
> org.apache.maven.lifecycle.LifecycleExecutionException: Failed to execute
> goal org.apache.maven.plugins:maven-surefire-plugin:2.12-TRUNK-HBASE-2:test
> (secondPartTestsExecution) on project hbase-server: Failure or timeout
>         at
> org.apache.maven.lifecycle.internal.MojoExecutor.execute(MojoExecutor.java:217)
>         at
> org.apache.maven.lifecycle.internal.MojoExecutor.execute(MojoExecutor.java:153)
>         at
> org.apache.maven.lifecycle.internal.MojoExecutor.execute(MojoExecutor.java:145)
>         at
> org.apache.maven.lifecycle.internal.LifecycleModuleBuilder.buildProject(LifecycleModuleBuilder.java:84)
>         at
> org.apache.maven.lifecycle.internal.LifecycleModuleBuilder.buildProject(LifecycleModuleBuilder.java:59)
>         at
> org.apache.maven.lifecycle.internal.LifecycleStarter.singleThreadedBuild(LifecycleStarter.java:183)
>         at
> org.apache.maven.lifecycle.internal.LifecycleStarter.execute(LifecycleStarter.java:161)
>         at org.apache.maven.DefaultMaven.doExecute(DefaultMaven.java:320)
>         at org.apache.maven.DefaultMaven.execute(DefaultMaven.java:156)
>         at
> org.jvnet.hudson.maven3.launcher.Maven3Launcher.main(Maven3Launcher.java:79)
>         at sun.reflect.NativeMethodAccessorImpl.invoke0(Native Method)
>         at
> sun.reflect.NativeMethodAccessorImpl.invoke(NativeMethodAccessorImpl.java:39)
>         at
> sun.reflect.DelegatingMethodAccessorImpl.invoke(DelegatingMethodAccessorImpl.java:25)
>         at java.lang.reflect.Method.invoke(Method.java:597)
>         at
> org.codehaus.plexus.classworlds.launcher.Launcher.launchStandard(Launcher.java:329)
>         at
> org.codehaus.plexus.classworlds.launcher.Launcher.launch(Launcher.java:239)
>         at
> org.jvnet.hudson.maven3.agent.Maven3Main.launch(Maven3Main.java:158)
>         at hudson.maven.Maven3Builder.call(Maven3Builder.java:100)
>         at hudson.maven.Maven3Builder.call(Maven3Builder.java:66)
>         at hudson.remoting.UserRequest.perform(UserRequest.java:118)
>         at hudson.remoting.UserRequest.perform(UserRequest.java:48)
>         at hudson.remoting.Request$2.run(Request.java:326)
>         at
> hudson.remoting.InterceptingExecutorService$1.call(InterceptingExecutorService.java:72)
>         at
> java.util.concurrent.FutureTask$Sync.innerRun(FutureTask.java:303)
>         at java.util.concurrent.FutureTask.run(FutureTask.java:138)
>         at
> java.util.concurrent.ThreadPoolExecutor$Worker.runTask(ThreadPoolExecutor.java:895)
>         at
> java.util.concurrent.ThreadPoolExecutor$Worker.run(ThreadPoolExecutor.java:918)
>         at java.lang.Thread.run(Thread.java:662)
> Caused by: org.apache.maven.plugin.MojoExecutionException: Failure or
> timeout
>         at
> org.apache.maven.plugin.surefire.SurefirePlugin.assertNoFailureOrTimeout(SurefirePlugin.java:643)
>         at
> org.apache.maven.plugin.surefire.SurefirePlugin.handleSummary(SurefirePlugin.java:624)
>         at
> org.apache.maven.plugin.surefire.AbstractSurefireMojo.executeAfterPreconditionsChecked(AbstractSurefireMojo.java:137)
>         at
> org.apache.maven.plugin.surefire.AbstractSurefireMojo.execute(AbstractSurefireMojo.java:98)
>         at
> org.apache.maven.plugin.DefaultBuildPluginManager.executeMojo(DefaultBuildPluginManager.java:101)
>         at
> org.apache.maven.lifecycle.internal.MojoExecutor.execute(MojoExecutor.java:209)
>         ... 27 more
> channel stopped
>



-- 
// Jonathan Hsieh (shay)
// Software Engineer, Cloudera
// jon@cloudera.com

Mime
  • Unnamed multipart/alternative (inline, None, 0 bytes)
View raw message