hbase-dev mailing list archives

Site index · List index
Message view « Date » · « Thread »
Top « Date » · « Thread »
From Jonathan Hsieh <...@cloudera.com>
Subject Re: Build failed in Jenkins: HBase-TRUNK #244
Date Tue, 07 May 2013 13:17:46 GMT
Hung:
< Running org.apache.hadoop.hbase.mapreduce.TestMultiTableInputFormat
< Running org.apache.hadoop.hbase.TestZooKeeper



On Mon, May 6, 2013 at 6:19 PM, <apurtell@apache.org> wrote:

> See <http://54.241.6.143/job/HBase-TRUNK/244/changes>
>
> Changes:
>
> [enis] HBASE-8478 HBASE-2231 breaks
> TestHRegion#testRecoveredEditsReplayCompaction under hadoop2 profile
>
> [sershe] HBASE-8405 Add more custom options to how ClusterManager runs
> commands REDO DIFFERENTLY
>
> ------------------------------------------
> [...truncated 6721 lines...]
> Running org.apache.hadoop.hbase.regionserver.handler.TestOpenRegionHandler
> Tests run: 5, Failures: 0, Errors: 0, Skipped: 0, Time elapsed: 2.634 sec
> Running org.apache.hadoop.hbase.regionserver.handler.TestCloseRegionHandler
> Tests run: 3, Failures: 0, Errors: 0, Skipped: 0, Time elapsed: 2.733 sec
> Running
> org.apache.hadoop.hbase.regionserver.TestRegionMergeTransactionOnCluster
> Tests run: 2, Failures: 0, Errors: 0, Skipped: 0, Time elapsed: 25.982 sec
> Running org.apache.hadoop.hbase.regionserver.TestCompactionState
> Tests run: 5, Failures: 0, Errors: 0, Skipped: 0, Time elapsed: 90.565 sec
> Running org.apache.hadoop.hbase.regionserver.TestStoreFileBlockCacheSummary
> Tests run: 1, Failures: 0, Errors: 0, Skipped: 0, Time elapsed: 16.004 sec
> Running org.apache.hadoop.hbase.regionserver.TestMemStore
> Tests run: 22, Failures: 0, Errors: 0, Skipped: 0, Time elapsed: 31.528 sec
> Running org.apache.hadoop.hbase.regionserver.TestCompaction
> Tests run: 17, Failures: 0, Errors: 0, Skipped: 0, Time elapsed: 74.6 sec
> Running org.apache.hadoop.hbase.regionserver.TestRegionServerMetrics
> Tests run: 9, Failures: 0, Errors: 0, Skipped: 0, Time elapsed: 24.035 sec
> Running org.apache.hadoop.hbase.regionserver.TestStore
> Tests run: 15, Failures: 0, Errors: 0, Skipped: 0, Time elapsed: 18.097 sec
> Running org.apache.hadoop.hbase.regionserver.TestBlocksRead
> Tests run: 4, Failures: 0, Errors: 0, Skipped: 0, Time elapsed: 7.852 sec
> Running org.apache.hadoop.hbase.regionserver.TestSeekOptimizations
> Tests run: 6, Failures: 0, Errors: 0, Skipped: 0, Time elapsed: 13.907 sec
> Running org.apache.hadoop.hbase.regionserver.TestHRegionServerBulkLoad
> Tests run: 1, Failures: 0, Errors: 0, Skipped: 0, Time elapsed: 43.1 sec
> Running org.apache.hadoop.hbase.regionserver.TestMasterAddressManager
> Tests run: 1, Failures: 0, Errors: 0, Skipped: 0, Time elapsed: 1.851 sec
> Running org.apache.hadoop.hbase.regionserver.TestJoinedScanners
> Tests run: 1, Failures: 0, Errors: 0, Skipped: 0, Time elapsed: 50.567 sec
> Running org.apache.hadoop.hbase.regionserver.TestHRegionOnCluster
> Tests run: 1, Failures: 0, Errors: 0, Skipped: 0, Time elapsed: 45.661 sec
> Running org.apache.hadoop.hbase.regionserver.TestAtomicOperation
> Tests run: 6, Failures: 0, Errors: 0, Skipped: 0, Time elapsed: 43.632 sec
> Running org.apache.hadoop.hbase.regionserver.wal.TestHLogFiltering
> Tests run: 1, Failures: 0, Errors: 0, Skipped: 0, Time elapsed: 53.459 sec
> Running org.apache.hadoop.hbase.regionserver.wal.TestDurability
> Tests run: 1, Failures: 0, Errors: 0, Skipped: 0, Time elapsed: 5.098 sec
> Running org.apache.hadoop.hbase.regionserver.TestHRegionBusyWait
> Tests run: 64, Failures: 0, Errors: 0, Skipped: 0, Time elapsed: 101.124
> sec
> Running org.apache.hadoop.hbase.regionserver.TestSplitTransactionOnCluster
> Tests run: 9, Failures: 0, Errors: 0, Skipped: 0, Time elapsed: 90.606 sec
> Running org.apache.hadoop.hbase.regionserver.wal.TestWALReplayCompressed
> Tests run: 8, Failures: 0, Errors: 0, Skipped: 0, Time elapsed: 58.17 sec
> Running org.apache.hadoop.hbase.regionserver.wal.TestHLog
> Tests run: 12, Failures: 0, Errors: 0, Skipped: 0, Time elapsed: 65.563 sec
> Running org.apache.hadoop.hbase.regionserver.wal.TestWALReplay
> Tests run: 8, Failures: 0, Errors: 0, Skipped: 0, Time elapsed: 57.094 sec
> Running org.apache.hadoop.hbase.regionserver.wal.TestHLogSplit
> Tests run: 34, Failures: 0, Errors: 0, Skipped: 1, Time elapsed: 124.499
> sec
> Running org.apache.hadoop.hbase.regionserver.TestEndToEndSplitTransaction
> Tests run: 2, Failures: 0, Errors: 0, Skipped: 0, Time elapsed: 34.831 sec
> Running org.apache.hadoop.hbase.regionserver.wal.TestHLogSplitCompressed
> Tests run: 34, Failures: 0, Errors: 0, Skipped: 1, Time elapsed: 120.898
> sec
> Running org.apache.hadoop.hbase.master.TestAssignmentManager
> Tests run: 15, Failures: 0, Errors: 0, Skipped: 0, Time elapsed: 6.869 sec
> Running org.apache.hadoop.hbase.master.TestHMasterRPCException
> Tests run: 1, Failures: 0, Errors: 0, Skipped: 0, Time elapsed: 3.118 sec
> Running org.apache.hadoop.hbase.regionserver.TestHRegion
> Tests run: 63, Failures: 0, Errors: 0, Skipped: 0, Time elapsed: 42.127 sec
> Running org.apache.hadoop.hbase.master.TestZKBasedOpenCloseRegion
> Tests run: 4, Failures: 0, Errors: 0, Skipped: 0, Time elapsed: 17.581 sec
> Running org.apache.hadoop.hbase.master.balancer.TestBaseLoadBalancer
> Tests run: 3, Failures: 0, Errors: 0, Skipped: 0, Time elapsed: 0.74 sec
> Running org.apache.hadoop.hbase.master.balancer.TestDefaultLoadBalancer
> Tests run: 1, Failures: 0, Errors: 0, Skipped: 0, Time elapsed: 2.493 sec
> Running org.apache.hadoop.hbase.master.TestOpenedRegionHandler
> Tests run: 2, Failures: 0, Errors: 0, Skipped: 0, Time elapsed: 13.407 sec
> Running org.apache.hadoop.hbase.master.TestMasterFailover
> Tests run: 4, Failures: 0, Errors: 0, Skipped: 0, Time elapsed: 59.133 sec
> Running
> org.apache.hadoop.hbase.master.TestMasterFailoverBalancerPersistence
> Tests run: 1, Failures: 0, Errors: 0, Skipped: 0, Time elapsed: 13.737 sec
> Running org.apache.hadoop.hbase.master.snapshot.TestSnapshotFileCache
> Tests run: 4, Failures: 0, Errors: 0, Skipped: 0, Time elapsed: 5.13 sec
> Running org.apache.hadoop.hbase.master.balancer.TestStochasticLoadBalancer
> Tests run: 9, Failures: 0, Errors: 0, Skipped: 1, Time elapsed: 48.269 sec
> Running org.apache.hadoop.hbase.master.TestMaster
> Tests run: 4, Failures: 0, Errors: 0, Skipped: 0, Time elapsed: 21.793 sec
> Running org.apache.hadoop.hbase.regionserver.wal.TestLogRolling
> Tests run: 2, Failures: 0, Errors: 0, Skipped: 0, Time elapsed: 253.467 sec
> Running
> org.apache.hadoop.hbase.master.handler.TestTableDescriptorModification
> Tests run: 3, Failures: 0, Errors: 0, Skipped: 0, Time elapsed: 21.222 sec
> Running org.apache.hadoop.hbase.master.TestRestartCluster
> Tests run: 2, Failures: 0, Errors: 0, Skipped: 0, Time elapsed: 27.335 sec
> Running org.apache.hadoop.hbase.master.handler.TestCreateTableHandler
> Tests run: 2, Failures: 0, Errors: 0, Skipped: 0, Time elapsed: 21.086 sec
> Running org.apache.hadoop.hbase.regionserver.wal.TestLogRollAbort
> Tests run: 1, Failures: 0, Errors: 0, Skipped: 0, Time elapsed: 163.653 sec
> Running org.apache.hadoop.hbase.master.TestDeadServer
> Tests run: 3, Failures: 0, Errors: 0, Skipped: 0, Time elapsed: 1.282 sec
> Running org.apache.hadoop.hbase.master.TestMasterStatusServlet
> Tests run: 4, Failures: 0, Errors: 0, Skipped: 0, Time elapsed: 2.954 sec
> Running org.apache.hadoop.hbase.master.TestActiveMasterManager
> Tests run: 2, Failures: 0, Errors: 0, Skipped: 0, Time elapsed: 1.603 sec
> Running org.apache.hadoop.hbase.master.TestMasterTransitions
> Tests run: 3, Failures: 0, Errors: 0, Skipped: 3, Time elapsed: 19.528 sec
> Running org.apache.hadoop.hbase.master.TestMasterFileSystem
> Tests run: 1, Failures: 0, Errors: 0, Skipped: 0, Time elapsed: 12.929 sec
> Running org.apache.hadoop.hbase.master.TestAssignmentManagerOnCluster
> Tests run: 7, Failures: 0, Errors: 0, Skipped: 0, Time elapsed: 38.762 sec
> Running org.apache.hadoop.hbase.master.handler.TestTableDeleteFamilyHandler
> Tests run: 1, Failures: 0, Errors: 0, Skipped: 0, Time elapsed: 40.953 sec
> Running org.apache.hadoop.hbase.master.TestMasterRestartAfterDisablingTable
> Tests run: 1, Failures: 0, Errors: 0, Skipped: 0, Time elapsed: 17.686 sec
> Running org.apache.hadoop.hbase.master.cleaner.TestHFileCleaner
> Tests run: 3, Failures: 0, Errors: 0, Skipped: 0, Time elapsed: 5.327 sec
> Running org.apache.hadoop.hbase.master.TestMasterMetrics
> Tests run: 2, Failures: 0, Errors: 0, Skipped: 0, Time elapsed: 25.772 sec
> Running org.apache.hadoop.hbase.master.cleaner.TestLogsCleaner
> Tests run: 1, Failures: 0, Errors: 0, Skipped: 0, Time elapsed: 12.285 sec
> Running org.apache.hadoop.hbase.master.TestMasterNoCluster
> Tests run: 3, Failures: 0, Errors: 0, Skipped: 0, Time elapsed: 5.205 sec
> Running org.apache.hadoop.hbase.master.TestClusterStatusPublisher
> Tests run: 3, Failures: 0, Errors: 0, Skipped: 0, Time elapsed: 0.628 sec
> Running org.apache.hadoop.hbase.master.cleaner.TestSnapshotFromMaster
> Tests run: 4, Failures: 0, Errors: 0, Skipped: 0, Time elapsed: 32.69 sec
> Running org.apache.hadoop.hbase.master.TestMasterShutdown
> Tests run: 2, Failures: 0, Errors: 0, Skipped: 0, Time elapsed: 25.965 sec
> Running org.apache.hadoop.hbase.master.TestRollingRestart
> Tests run: 1, Failures: 0, Errors: 0, Skipped: 0, Time elapsed: 41.228 sec
> Running org.apache.hadoop.hbase.master.TestMasterMetricsWrapper
> Tests run: 1, Failures: 0, Errors: 0, Skipped: 0, Time elapsed: 23.213 sec
> Running org.apache.hadoop.hbase.TestGlobalMemStoreSize
> Tests run: 1, Failures: 0, Errors: 0, Skipped: 0, Time elapsed: 17.672 sec
> Running org.apache.hadoop.hbase.TestInfoServers
> Tests run: 3, Failures: 0, Errors: 0, Skipped: 0, Time elapsed: 14.037 sec
> Running org.apache.hadoop.hbase.master.TestSplitLogManager
> Tests run: 13, Failures: 0, Errors: 0, Skipped: 0, Time elapsed: 85.294 sec
> Running org.apache.hadoop.hbase.master.TestTableLockManager
> Tests run: 5, Failures: 0, Errors: 0, Skipped: 0, Time elapsed: 134.912 sec
> Running org.apache.hadoop.hbase.TestRegionRebalancing
> Tests run: 2, Failures: 0, Errors: 0, Skipped: 0, Time elapsed: 49.453 sec
> Running org.apache.hadoop.hbase.TestAcidGuarantees
> Running org.apache.hadoop.hbase.TestIOFencing
> Tests run: 3, Failures: 0, Errors: 0, Skipped: 0, Time elapsed: 91.587 sec
> Tests run: 2, Failures: 0, Errors: 0, Skipped: 0, Time elapsed: 90.151 sec
> Running org.apache.hadoop.hbase.master.TestDistributedLogSplitting
> Tests run: 4, Failures: 0, Errors: 0, Skipped: 0, Time elapsed: 151.802 sec
>
> Results :
>
> Tests in error:
>
> testDelayedRpcImmediateReturnValue(org.apache.hadoop.hbase.ipc.TestDelayedRpc):
> Index: 1, Size: 1
>
> Tests run: 1494, Failures: 0, Errors: 1, Skipped: 14
>
> [JENKINS] Recording test results
> [INFO]
> [INFO]
> ------------------------------------------------------------------------
> [INFO] Skipping HBase
> [INFO] This project has been banned from the build due to previous
> failures.
> [INFO]
> ------------------------------------------------------------------------
> [INFO]
> [INFO]
> ------------------------------------------------------------------------
> [INFO] Skipping HBase
> [INFO] This project has been banned from the build due to previous
> failures.
> [INFO]
> ------------------------------------------------------------------------
> [INFO]
> ------------------------------------------------------------------------
> [INFO] Reactor Summary:
> [INFO]
> [INFO] HBase ............................................. SUCCESS
> [1:01.380s]
> [INFO] HBase - Common .................................... SUCCESS
> [1:04.749s]
> [INFO] HBase - Protocol .................................. SUCCESS
> [19.360s]
> [INFO] HBase - Client .................................... SUCCESS
> [12.738s]
> [INFO] HBase - Prefix Tree ............................... SUCCESS [5.087s]
> [INFO] HBase - Hadoop Compatibility ...................... SUCCESS [1.394s]
> [INFO] HBase - Hadoop One Compatibility .................. SUCCESS
> [10.002s]
> [INFO] HBase - Server .................................... FAILURE
> [55:49.345s]
> [INFO] HBase - Integration Tests ......................... SKIPPED
> [INFO] HBase - Examples .................................. SKIPPED
> [INFO] HBase - Assembly .................................. SKIPPED
> [INFO]
> ------------------------------------------------------------------------
> [INFO] BUILD FAILURE
> [INFO]
> ------------------------------------------------------------------------
> [INFO] Total time: 58:55.652s
> [INFO] Finished at: Tue May 07 01:19:22 UTC 2013
> [INFO] Final Memory: 102M/481M
> [INFO]
> ------------------------------------------------------------------------
> [JENKINS] Archiving <
> http://54.241.6.143/job/HBase-TRUNK/ws/hbase-common/pom.xml> to
> /var/lib/jenkins/jobs/HBase-TRUNK/modules/org.apache.hbase$hbase-common/builds/2013-05-07_00-20-19/archive/org.apache.hbase/hbase-common/0.97.0-SNAPSHOT/hbase-common-0.97.0-SNAPSHOT.pom
> [JENKINS] Archiving <
> http://54.241.6.143/job/HBase-TRUNK/ws/hbase-common/target/hbase-common-0.97.0-SNAPSHOT.jar>
> to
> /var/lib/jenkins/jobs/HBase-TRUNK/modules/org.apache.hbase$hbase-common/builds/2013-05-07_00-20-19/archive/org.apache.hbase/hbase-common/0.97.0-SNAPSHOT/hbase-common-0.97.0-SNAPSHOT.jar
> [JENKINS] Archiving <
> http://54.241.6.143/job/HBase-TRUNK/ws/hbase-common/target/hbase-common-0.97.0-SNAPSHOT-sources.jar>
> to
> /var/lib/jenkins/jobs/HBase-TRUNK/modules/org.apache.hbase$hbase-common/builds/2013-05-07_00-20-19/archive/org.apache.hbase/hbase-common/0.97.0-SNAPSHOT/hbase-common-0.97.0-SNAPSHOT-sources.jar
> [JENKINS] Archiving <
> http://54.241.6.143/job/HBase-TRUNK/ws/hbase-common/target/hbase-common-0.97.0-SNAPSHOT-tests.jar>
> to
> /var/lib/jenkins/jobs/HBase-TRUNK/modules/org.apache.hbase$hbase-common/builds/2013-05-07_00-20-19/archive/org.apache.hbase/hbase-common/0.97.0-SNAPSHOT/hbase-common-0.97.0-SNAPSHOT-tests.jar
> [JENKINS] Archiving <
> http://54.241.6.143/job/HBase-TRUNK/ws/hbase-hadoop-compat/pom.xml> to
> /var/lib/jenkins/jobs/HBase-TRUNK/modules/org.apache.hbase$hbase-hadoop-compat/builds/2013-05-07_00-20-19/archive/org.apache.hbase/hbase-hadoop-compat/0.97.0-SNAPSHOT/hbase-hadoop-compat-0.97.0-SNAPSHOT.pom
> [JENKINS] Archiving <
> http://54.241.6.143/job/HBase-TRUNK/ws/hbase-hadoop-compat/target/hbase-hadoop-compat-0.97.0-SNAPSHOT.jar>
> to
> /var/lib/jenkins/jobs/HBase-TRUNK/modules/org.apache.hbase$hbase-hadoop-compat/builds/2013-05-07_00-20-19/archive/org.apache.hbase/hbase-hadoop-compat/0.97.0-SNAPSHOT/hbase-hadoop-compat-0.97.0-SNAPSHOT.jar
> [JENKINS] Archiving <
> http://54.241.6.143/job/HBase-TRUNK/ws/hbase-hadoop-compat/target/hbase-hadoop-compat-0.97.0-SNAPSHOT-sources.jar>
> to
> /var/lib/jenkins/jobs/HBase-TRUNK/modules/org.apache.hbase$hbase-hadoop-compat/builds/2013-05-07_00-20-19/archive/org.apache.hbase/hbase-hadoop-compat/0.97.0-SNAPSHOT/hbase-hadoop-compat-0.97.0-SNAPSHOT-sources.jar
> [JENKINS] Archiving <
> http://54.241.6.143/job/HBase-TRUNK/ws/hbase-hadoop-compat/target/hbase-hadoop-compat-0.97.0-SNAPSHOT-tests.jar>
> to
> /var/lib/jenkins/jobs/HBase-TRUNK/modules/org.apache.hbase$hbase-hadoop-compat/builds/2013-05-07_00-20-19/archive/org.apache.hbase/hbase-hadoop-compat/0.97.0-SNAPSHOT/hbase-hadoop-compat-0.97.0-SNAPSHOT-tests.jar
> [JENKINS] Archiving <
> http://54.241.6.143/job/HBase-TRUNK/ws/hbase-examples/pom.xml> to
> /var/lib/jenkins/jobs/HBase-TRUNK/modules/org.apache.hbase$hbase-examples/builds/2013-05-07_00-20-20/archive/org.apache.hbase/hbase-examples/0.97.0-SNAPSHOT/hbase-examples-0.97.0-SNAPSHOT.pom
> [JENKINS] Archiving <
> http://54.241.6.143/job/HBase-TRUNK/ws/hbase-it/pom.xml> to
> /var/lib/jenkins/jobs/HBase-TRUNK/modules/org.apache.hbase$hbase-it/builds/2013-05-07_00-20-20/archive/org.apache.hbase/hbase-it/0.97.0-SNAPSHOT/hbase-it-0.97.0-SNAPSHOT.pom
> [JENKINS] Archiving <http://54.241.6.143/job/HBase-TRUNK/ws/pom.xml> to
> /var/lib/jenkins/jobs/HBase-TRUNK/modules/org.apache.hbase$hbase/builds/2013-05-07_00-20-19/archive/org.apache.hbase/hbase/0.97.0-SNAPSHOT/hbase-0.97.0-SNAPSHOT.pom
> [JENKINS] Archiving <
> http://54.241.6.143/job/HBase-TRUNK/ws/target/hbase-0.97.0-SNAPSHOT-site.xml>
> to
> /var/lib/jenkins/jobs/HBase-TRUNK/modules/org.apache.hbase$hbase/builds/2013-05-07_00-20-19/archive/org.apache.hbase/hbase/0.97.0-SNAPSHOT/hbase-0.97.0-SNAPSHOT-site.xml
> [JENKINS] Archiving <
> http://54.241.6.143/job/HBase-TRUNK/ws/hbase-assembly/pom.xml> to
> /var/lib/jenkins/jobs/HBase-TRUNK/modules/org.apache.hbase$hbase-assembly/builds/2013-05-07_00-20-20/archive/org.apache.hbase/hbase-assembly/0.97.0-SNAPSHOT/hbase-assembly-0.97.0-SNAPSHOT.pom
> [JENKINS] Archiving <
> http://54.241.6.143/job/HBase-TRUNK/ws/hbase-client/pom.xml> to
> /var/lib/jenkins/jobs/HBase-TRUNK/modules/org.apache.hbase$hbase-client/builds/2013-05-07_00-20-19/archive/org.apache.hbase/hbase-client/0.97.0-SNAPSHOT/hbase-client-0.97.0-SNAPSHOT.pom
> [JENKINS] Archiving <
> http://54.241.6.143/job/HBase-TRUNK/ws/hbase-client/target/hbase-client-0.97.0-SNAPSHOT.jar>
> to
> /var/lib/jenkins/jobs/HBase-TRUNK/modules/org.apache.hbase$hbase-client/builds/2013-05-07_00-20-19/archive/org.apache.hbase/hbase-client/0.97.0-SNAPSHOT/hbase-client-0.97.0-SNAPSHOT.jar
> [JENKINS] Archiving <
> http://54.241.6.143/job/HBase-TRUNK/ws/hbase-client/target/hbase-client-0.97.0-SNAPSHOT-sources.jar>
> to
> /var/lib/jenkins/jobs/HBase-TRUNK/modules/org.apache.hbase$hbase-client/builds/2013-05-07_00-20-19/archive/org.apache.hbase/hbase-client/0.97.0-SNAPSHOT/hbase-client-0.97.0-SNAPSHOT-sources.jar
> [JENKINS] Archiving <
> http://54.241.6.143/job/HBase-TRUNK/ws/hbase-client/target/hbase-client-0.97.0-SNAPSHOT-tests.jar>
> to
> /var/lib/jenkins/jobs/HBase-TRUNK/modules/org.apache.hbase$hbase-client/builds/2013-05-07_00-20-19/archive/org.apache.hbase/hbase-client/0.97.0-SNAPSHOT/hbase-client-0.97.0-SNAPSHOT-tests.jar
> [JENKINS] Archiving <
> http://54.241.6.143/job/HBase-TRUNK/ws/hbase-prefix-tree/pom.xml> to
> /var/lib/jenkins/jobs/HBase-TRUNK/modules/org.apache.hbase$hbase-prefix-tree/builds/2013-05-07_00-20-20/archive/org.apache.hbase/hbase-prefix-tree/0.97.0-SNAPSHOT/hbase-prefix-tree-0.97.0-SNAPSHOT.pom
> [JENKINS] Archiving <
> http://54.241.6.143/job/HBase-TRUNK/ws/hbase-prefix-tree/target/hbase-prefix-tree-0.97.0-SNAPSHOT.jar>
> to
> /var/lib/jenkins/jobs/HBase-TRUNK/modules/org.apache.hbase$hbase-prefix-tree/builds/2013-05-07_00-20-20/archive/org.apache.hbase/hbase-prefix-tree/0.97.0-SNAPSHOT/hbase-prefix-tree-0.97.0-SNAPSHOT.jar
> [JENKINS] Archiving <
> http://54.241.6.143/job/HBase-TRUNK/ws/hbase-prefix-tree/target/hbase-prefix-tree-0.97.0-SNAPSHOT-sources.jar>
> to
> /var/lib/jenkins/jobs/HBase-TRUNK/modules/org.apache.hbase$hbase-prefix-tree/builds/2013-05-07_00-20-20/archive/org.apache.hbase/hbase-prefix-tree/0.97.0-SNAPSHOT/hbase-prefix-tree-0.97.0-SNAPSHOT-sources.jar
> [JENKINS] Archiving <
> http://54.241.6.143/job/HBase-TRUNK/ws/hbase-prefix-tree/target/hbase-prefix-tree-0.97.0-SNAPSHOT-tests.jar>
> to
> /var/lib/jenkins/jobs/HBase-TRUNK/modules/org.apache.hbase$hbase-prefix-tree/builds/2013-05-07_00-20-20/archive/org.apache.hbase/hbase-prefix-tree/0.97.0-SNAPSHOT/hbase-prefix-tree-0.97.0-SNAPSHOT-tests.jar
> [JENKINS] Archiving <
> http://54.241.6.143/job/HBase-TRUNK/ws/hbase-protocol/pom.xml> to
> /var/lib/jenkins/jobs/HBase-TRUNK/modules/org.apache.hbase$hbase-protocol/builds/2013-05-07_00-20-19/archive/org.apache.hbase/hbase-protocol/0.97.0-SNAPSHOT/hbase-protocol-0.97.0-SNAPSHOT.pom
> [JENKINS] Archiving <
> http://54.241.6.143/job/HBase-TRUNK/ws/hbase-protocol/target/hbase-protocol-0.97.0-SNAPSHOT.jar>
> to
> /var/lib/jenkins/jobs/HBase-TRUNK/modules/org.apache.hbase$hbase-protocol/builds/2013-05-07_00-20-19/archive/org.apache.hbase/hbase-protocol/0.97.0-SNAPSHOT/hbase-protocol-0.97.0-SNAPSHOT.jar
> [JENKINS] Archiving <
> http://54.241.6.143/job/HBase-TRUNK/ws/hbase-protocol/target/hbase-protocol-0.97.0-SNAPSHOT-sources.jar>
> to
> /var/lib/jenkins/jobs/HBase-TRUNK/modules/org.apache.hbase$hbase-protocol/builds/2013-05-07_00-20-19/archive/org.apache.hbase/hbase-protocol/0.97.0-SNAPSHOT/hbase-protocol-0.97.0-SNAPSHOT-sources.jar
> [JENKINS] Archiving <
> http://54.241.6.143/job/HBase-TRUNK/ws/hbase-protocol/target/hbase-protocol-0.97.0-SNAPSHOT-tests.jar>
> to
> /var/lib/jenkins/jobs/HBase-TRUNK/modules/org.apache.hbase$hbase-protocol/builds/2013-05-07_00-20-19/archive/org.apache.hbase/hbase-protocol/0.97.0-SNAPSHOT/hbase-protocol-0.97.0-SNAPSHOT-tests.jar
> [JENKINS] Archiving <
> http://54.241.6.143/job/HBase-TRUNK/ws/hbase-hadoop1-compat/pom.xml> to
> /var/lib/jenkins/jobs/HBase-TRUNK/modules/org.apache.hbase$hbase-hadoop1-compat/builds/2013-05-07_00-20-20/archive/org.apache.hbase/hbase-hadoop1-compat/0.97.0-SNAPSHOT/hbase-hadoop1-compat-0.97.0-SNAPSHOT.pom
> [JENKINS] Archiving <
> http://54.241.6.143/job/HBase-TRUNK/ws/hbase-hadoop1-compat/target/hbase-hadoop1-compat-0.97.0-SNAPSHOT.jar>
> to
> /var/lib/jenkins/jobs/HBase-TRUNK/modules/org.apache.hbase$hbase-hadoop1-compat/builds/2013-05-07_00-20-20/archive/org.apache.hbase/hbase-hadoop1-compat/0.97.0-SNAPSHOT/hbase-hadoop1-compat-0.97.0-SNAPSHOT.jar
> [JENKINS] Archiving <
> http://54.241.6.143/job/HBase-TRUNK/ws/hbase-hadoop1-compat/target/hbase-hadoop1-compat-0.97.0-SNAPSHOT-sources.jar>
> to
> /var/lib/jenkins/jobs/HBase-TRUNK/modules/org.apache.hbase$hbase-hadoop1-compat/builds/2013-05-07_00-20-20/archive/org.apache.hbase/hbase-hadoop1-compat/0.97.0-SNAPSHOT/hbase-hadoop1-compat-0.97.0-SNAPSHOT-sources.jar
> [JENKINS] Archiving <
> http://54.241.6.143/job/HBase-TRUNK/ws/hbase-hadoop1-compat/target/hbase-hadoop1-compat-0.97.0-SNAPSHOT-tests.jar>
> to
> /var/lib/jenkins/jobs/HBase-TRUNK/modules/org.apache.hbase$hbase-hadoop1-compat/builds/2013-05-07_00-20-20/archive/org.apache.hbase/hbase-hadoop1-compat/0.97.0-SNAPSHOT/hbase-hadoop1-compat-0.97.0-SNAPSHOT-tests.jar
> [JENKINS] Archiving <
> http://54.241.6.143/job/HBase-TRUNK/ws/hbase-server/pom.xml> to
> /var/lib/jenkins/jobs/HBase-TRUNK/modules/org.apache.hbase$hbase-server/builds/2013-05-07_00-20-19/archive/org.apache.hbase/hbase-server/0.97.0-SNAPSHOT/hbase-server-0.97.0-SNAPSHOT.pom
> Waiting for Jenkins to finish collecting data
> mavenExecutionResult exceptions not empty
> message : Failed to execute goal
> org.apache.maven.plugins:maven-surefire-plugin:2.12-TRUNK-HBASE-2:test
> (secondPartTestsExecution) on project hbase-server: Failure or timeout
> cause : Failure or timeout
> Stack trace :
> org.apache.maven.lifecycle.LifecycleExecutionException: Failed to execute
> goal org.apache.maven.plugins:maven-surefire-plugin:2.12-TRUNK-HBASE-2:test
> (secondPartTestsExecution) on project hbase-server: Failure or timeout
>         at
> org.apache.maven.lifecycle.internal.MojoExecutor.execute(MojoExecutor.java:217)
>         at
> org.apache.maven.lifecycle.internal.MojoExecutor.execute(MojoExecutor.java:153)
>         at
> org.apache.maven.lifecycle.internal.MojoExecutor.execute(MojoExecutor.java:145)
>         at
> org.apache.maven.lifecycle.internal.LifecycleModuleBuilder.buildProject(LifecycleModuleBuilder.java:84)
>         at
> org.apache.maven.lifecycle.internal.LifecycleModuleBuilder.buildProject(LifecycleModuleBuilder.java:59)
>         at
> org.apache.maven.lifecycle.internal.LifecycleStarter.singleThreadedBuild(LifecycleStarter.java:183)
>         at
> org.apache.maven.lifecycle.internal.LifecycleStarter.execute(LifecycleStarter.java:161)
>         at org.apache.maven.DefaultMaven.doExecute(DefaultMaven.java:320)
>         at org.apache.maven.DefaultMaven.execute(DefaultMaven.java:156)
>         at
> org.jvnet.hudson.maven3.launcher.Maven3Launcher.main(Maven3Launcher.java:79)
>         at sun.reflect.NativeMethodAccessorImpl.invoke0(Native Method)
>         at
> sun.reflect.NativeMethodAccessorImpl.invoke(NativeMethodAccessorImpl.java:39)
>         at
> sun.reflect.DelegatingMethodAccessorImpl.invoke(DelegatingMethodAccessorImpl.java:25)
>         at java.lang.reflect.Method.invoke(Method.java:597)
>         at
> org.codehaus.plexus.classworlds.launcher.Launcher.launchStandard(Launcher.java:329)
>         at
> org.codehaus.plexus.classworlds.launcher.Launcher.launch(Launcher.java:239)
>         at
> org.jvnet.hudson.maven3.agent.Maven3Main.launch(Maven3Main.java:158)
>         at hudson.maven.Maven3Builder.call(Maven3Builder.java:100)
>         at hudson.maven.Maven3Builder.call(Maven3Builder.java:66)
>         at hudson.remoting.UserRequest.perform(UserRequest.java:118)
>         at hudson.remoting.UserRequest.perform(UserRequest.java:48)
>         at hudson.remoting.Request$2.run(Request.java:326)
>         at
> hudson.remoting.InterceptingExecutorService$1.call(InterceptingExecutorService.java:72)
>         at
> java.util.concurrent.FutureTask$Sync.innerRun(FutureTask.java:303)
>         at java.util.concurrent.FutureTask.run(FutureTask.java:138)
>         at
> java.util.concurrent.ThreadPoolExecutor$Worker.runTask(ThreadPoolExecutor.java:895)
>         at
> java.util.concurrent.ThreadPoolExecutor$Worker.run(ThreadPoolExecutor.java:918)
>         at java.lang.Thread.run(Thread.java:662)
> Caused by: org.apache.maven.plugin.MojoExecutionException: Failure or
> timeout
>         at
> org.apache.maven.plugin.surefire.SurefirePlugin.assertNoFailureOrTimeout(SurefirePlugin.java:643)
>         at
> org.apache.maven.plugin.surefire.SurefirePlugin.handleSummary(SurefirePlugin.java:624)
>         at
> org.apache.maven.plugin.surefire.AbstractSurefireMojo.executeAfterPreconditionsChecked(AbstractSurefireMojo.java:137)
>         at
> org.apache.maven.plugin.surefire.AbstractSurefireMojo.execute(AbstractSurefireMojo.java:98)
>         at
> org.apache.maven.plugin.DefaultBuildPluginManager.executeMojo(DefaultBuildPluginManager.java:101)
>         at
> org.apache.maven.lifecycle.internal.MojoExecutor.execute(MojoExecutor.java:209)
>         ... 27 more
> channel stopped
>



-- 
// Jonathan Hsieh (shay)
// Software Engineer, Cloudera
// jon@cloudera.com

Mime
  • Unnamed multipart/alternative (inline, None, 0 bytes)
View raw message