hbase-dev mailing list archives

Site index · List index
Message view « Date » · « Thread »
Top « Date » · « Thread »
From Jonathan Hsieh <...@cloudera.com>
Subject Re: Build failed in Jenkins: HBase-0.95-Hadoop-2 #207
Date Thu, 02 May 2013 14:38:29 GMT
Most of the second group (MR related) take >4 mins in the sucessful trunk
on hadoop1 cases.  Maybe these are timeout related and related to the
slowdown noted in HBASE-8335?

https://issues.apache.org/jira/browse/HBASE-8335


On Thu, May 2, 2013 at 7:20 AM, Jonathan Hsieh <jon@cloudera.com> wrote:

> Hung tests: 85
>
> TestHRegion (63) - HBASE-8478
> TestJoinedScanner (1)
>
> TestImporExport (5)
> TestMultiTableInputFormat (5)
> TestMultithreadedTableMapper (1)
> TestRowCounter (3)
> TestTableInputFormatScan1 (5)
> TestTableMapReduce (2)
>
>
>
>
>
> On Thu, May 2, 2013 at 3:09 AM, <apurtell@apache.org> wrote:
>
>> See <http://54.241.6.143/job/HBase-0.95-Hadoop-2/207/changes>
>>
>> Changes:
>>
>> [mbertozzi] HBASE-8455 Update ExportSnapshot to reflect changes in
>> HBASE-7419
>>
>> ------------------------------------------
>> [...truncated 7706 lines...]
>> Running org.apache.hadoop.hbase.master.TestAssignmentManager
>> Tests run: 15, Failures: 0, Errors: 0, Skipped: 0, Time elapsed: 7.475 sec
>> Running org.apache.hadoop.hbase.master.TestMasterShutdown
>> Tests run: 2, Failures: 0, Errors: 0, Skipped: 0, Time elapsed: 20.405 sec
>> Running org.apache.hadoop.hbase.master.TestMasterTransitions
>> Tests run: 3, Failures: 0, Errors: 0, Skipped: 3, Time elapsed: 21.045 sec
>> Running
>> org.apache.hadoop.hbase.master.TestMasterFailoverBalancerPersistence
>> Tests run: 1, Failures: 0, Errors: 0, Skipped: 0, Time elapsed: 18.194 sec
>> Running org.apache.hadoop.hbase.rest.TestVersionResource
>> Tests run: 7, Failures: 0, Errors: 0, Skipped: 0, Time elapsed: 11.878 sec
>> Running org.apache.hadoop.hbase.master.TestMasterMetrics
>> Tests run: 2, Failures: 0, Errors: 0, Skipped: 0, Time elapsed: 27.438 sec
>> Running org.apache.hadoop.hbase.rest.TestScannersWithFilters
>> Tests run: 10, Failures: 0, Errors: 0, Skipped: 0, Time elapsed: 17.897
>> sec
>> Running org.apache.hadoop.hbase.rest.TestMultiRowResource
>> Tests run: 3, Failures: 0, Errors: 0, Skipped: 0, Time elapsed: 14.67 sec
>> Running org.apache.hadoop.hbase.rest.TestStatusResource
>> Tests run: 2, Failures: 0, Errors: 0, Skipped: 0, Time elapsed: 13.923 sec
>> Running org.apache.hadoop.hbase.rest.TestRowResource
>> Tests run: 12, Failures: 0, Errors: 0, Skipped: 0, Time elapsed: 20.762
>> sec
>> Running org.apache.hadoop.hbase.rest.TestTableResource
>> Tests run: 8, Failures: 0, Errors: 0, Skipped: 0, Time elapsed: 33.886 sec
>> Running org.apache.hadoop.hbase.rest.TestSchemaResource
>> Tests run: 2, Failures: 0, Errors: 0, Skipped: 0, Time elapsed: 22.751 sec
>> Running org.apache.hadoop.hbase.rest.client.TestRemoteTable
>> Tests run: 4, Failures: 0, Errors: 0, Skipped: 0, Time elapsed: 14.458 sec
>> Running org.apache.hadoop.hbase.rest.TestScannerResource
>> Tests run: 5, Failures: 0, Errors: 0, Skipped: 0, Time elapsed: 33.989 sec
>> Running org.apache.hadoop.hbase.rest.TestGzipFilter
>> Tests run: 2, Failures: 0, Errors: 0, Skipped: 0, Time elapsed: 14.621 sec
>> Running org.apache.hadoop.hbase.rest.client.TestRemoteAdmin
>> Tests run: 5, Failures: 0, Errors: 0, Skipped: 0, Time elapsed: 18.919 sec
>> Running org.apache.hadoop.hbase.client.TestHTableUtil
>> Tests run: 2, Failures: 0, Errors: 0, Skipped: 0, Time elapsed: 13.066 sec
>> Running org.apache.hadoop.hbase.client.TestSnapshotMetadata
>> Tests run: 4, Failures: 0, Errors: 0, Skipped: 0, Time elapsed: 26.207 sec
>> Running org.apache.hadoop.hbase.master.TestTableLockManager
>> Tests run: 5, Failures: 0, Errors: 0, Skipped: 0, Time elapsed: 181.569
>> sec
>> Running org.apache.hadoop.hbase.client.replication.TestReplicationAdmin
>> Tests run: 1, Failures: 0, Errors: 0, Skipped: 0, Time elapsed: 1.918 sec
>> Running org.apache.hadoop.hbase.client.TestMultiParallel
>> Tests run: 11, Failures: 0, Errors: 0, Skipped: 0, Time elapsed: 106.005
>> sec
>> Running org.apache.hadoop.hbase.master.TestDistributedLogSplitting
>> Tests run: 4, Failures: 0, Errors: 0, Skipped: 0, Time elapsed: 238.903
>> sec
>> Running org.apache.hadoop.hbase.client.TestMultipleTimestamps
>> Tests run: 8, Failures: 0, Errors: 0, Skipped: 0, Time elapsed: 23.402 sec
>> Running org.apache.hadoop.hbase.client.TestFromClientSide3
>> Tests run: 5, Failures: 0, Errors: 0, Skipped: 0, Time elapsed: 55.868 sec
>> Running org.apache.hadoop.hbase.client.TestShell
>> Tests run: 1, Failures: 0, Errors: 0, Skipped: 0, Time elapsed: 86.625 sec
>> Running org.apache.hadoop.hbase.client.TestFromClientSideWithCoprocessor
>> Tests run: 61, Failures: 0, Errors: 0, Skipped: 3, Time elapsed: 163.337
>> sec
>> Running org.apache.hadoop.hbase.client.TestClientTimeouts
>> Tests run: 1, Failures: 0, Errors: 0, Skipped: 0, Time elapsed: 18.582 sec
>> Running org.apache.hadoop.hbase.client.TestMetaScanner
>> Tests run: 1, Failures: 0, Errors: 0, Skipped: 0, Time elapsed: 14.595 sec
>> Running org.apache.hadoop.hbase.client.TestFromClientSide
>> Running org.apache.hadoop.hbase.client.TestHTableMultiplexer
>> Tests run: 1, Failures: 0, Errors: 0, Skipped: 0, Time elapsed: 19.491 sec
>> Tests run: 61, Failures: 0, Errors: 0, Skipped: 3, Time elapsed: 169.648
>> sec
>> Running org.apache.hadoop.hbase.client.TestTimestampsFilter
>> Tests run: 3, Failures: 0, Errors: 0, Skipped: 0, Time elapsed: 20.544 sec
>> Running org.apache.hadoop.hbase.client.TestScannersFromClientSide
>> Tests run: 4, Failures: 0, Errors: 0, Skipped: 0, Time elapsed: 22.371 sec
>> Running org.apache.hadoop.hbase.client.TestClientScannerRPCTimeout
>> Tests run: 1, Failures: 0, Errors: 0, Skipped: 0, Time elapsed: 27.693 sec
>> Running org.apache.hadoop.hbase.client.TestHCM
>> Tests run: 12, Failures: 0, Errors: 0, Skipped: 0, Time elapsed: 39.018
>> sec
>> Running org.apache.hadoop.hbase.client.TestRestoreSnapshotFromClient
>> Tests run: 3, Failures: 0, Errors: 0, Skipped: 0, Time elapsed: 112.288
>> sec
>> Running org.apache.hadoop.hbase.client.TestCloneSnapshotFromClient
>> Tests run: 3, Failures: 0, Errors: 0, Skipped: 0, Time elapsed: 99.027 sec
>> Running org.apache.hadoop.hbase.client.TestSnapshotCloneIndependence
>> Tests run: 6, Failures: 0, Errors: 0, Skipped: 0, Time elapsed: 42.989 sec
>> Running
>> org.apache.hadoop.hbase.client.TestHTablePool$TestHTableReusablePool
>> Running org.apache.hadoop.hbase.client.TestScannerTimeout
>> Tests run: 8, Failures: 0, Errors: 0, Skipped: 0, Time elapsed: 4.585 sec
>> Tests run: 4, Failures: 0, Errors: 0, Skipped: 0, Time elapsed: 51.745 sec
>> Running
>> org.apache.hadoop.hbase.client.TestHTablePool$TestHTableThreadLocalPool
>> Tests run: 8, Failures: 0, Errors: 0, Skipped: 0, Time elapsed: 21.53 sec
>> Running
>> org.apache.hadoop.hbase.coprocessor.TestRegionServerCoprocessorExceptionWithRemove
>> Running org.apache.hadoop.hbase.client.TestSnapshotFromClient
>> Tests run: 1, Failures: 0, Errors: 0, Skipped: 0, Time elapsed: 16.568 sec
>> Tests run: 3, Failures: 0, Errors: 0, Skipped: 0, Time elapsed: 25.482 sec
>> Running org.apache.hadoop.hbase.TestClusterBootOrder
>> Tests run: 2, Failures: 0, Errors: 0, Skipped: 0, Time elapsed: 27.204 sec
>> Running org.apache.hadoop.hbase.coprocessor.TestClassLoading
>> Tests run: 8, Failures: 0, Errors: 0, Skipped: 0, Time elapsed: 33.516 sec
>> Running
>> org.apache.hadoop.hbase.coprocessor.TestMasterCoprocessorExceptionWithRemove
>> Tests run: 1, Failures: 0, Errors: 0, Skipped: 0, Time elapsed: 15.064 sec
>> Running org.apache.hadoop.hbase.coprocessor.TestAggregateProtocol
>> Tests run: 45, Failures: 0, Errors: 0, Skipped: 0, Time elapsed: 16.731
>> sec
>> Running org.apache.hadoop.hbase.coprocessor.TestRowProcessorEndpoint
>> Tests run: 4, Failures: 0, Errors: 0, Skipped: 0, Time elapsed: 29.446 sec
>> Running org.apache.hadoop.hbase.coprocessor.TestCoprocessorEndpoint
>> Tests run: 6, Failures: 0, Errors: 0, Skipped: 0, Time elapsed: 14.734 sec
>> Running org.apache.hadoop.hbase.coprocessor.TestRegionObserverBypass
>> Tests run: 2, Failures: 0, Errors: 0, Skipped: 0, Time elapsed: 17.412 sec
>> Running org.apache.hadoop.hbase.coprocessor.TestRegionObserverInterface
>> Tests run: 7, Failures: 0, Errors: 0, Skipped: 0, Time elapsed: 33.441 sec
>> Running
>> org.apache.hadoop.hbase.coprocessor.TestBigDecimalColumnInterpreter
>> Tests run: 38, Failures: 0, Errors: 0, Skipped: 0, Time elapsed: 15.055
>> sec
>> Running org.apache.hadoop.hbase.coprocessor.TestWALObserver
>> Tests run: 3, Failures: 0, Errors: 0, Skipped: 0, Time elapsed: 15.797 sec
>> Running
>> org.apache.hadoop.hbase.coprocessor.TestMasterCoprocessorExceptionWithAbort
>> Tests run: 1, Failures: 0, Errors: 0, Skipped: 0, Time elapsed: 24.476 sec
>> Running
>> org.apache.hadoop.hbase.coprocessor.TestRegionServerCoprocessorExceptionWithAbort
>> Tests run: 1, Failures: 0, Errors: 0, Skipped: 0, Time elapsed: 17.124 sec
>> Running org.apache.hadoop.hbase.zookeeper.TestZKLeaderManager
>> Tests run: 1, Failures: 0, Errors: 0, Skipped: 0, Time elapsed: 1.364 sec
>> Running org.apache.hadoop.hbase.zookeeper.TestZooKeeperACL
>> Tests run: 5, Failures: 0, Errors: 0, Skipped: 0, Time elapsed: 11.22 sec
>> Running org.apache.hadoop.hbase.coprocessor.TestMasterObserver
>> Tests run: 4, Failures: 0, Errors: 0, Skipped: 0, Time elapsed: 38.412 sec
>> Running org.apache.hadoop.hbase.zookeeper.TestRecoverableZooKeeper
>> Tests run: 1, Failures: 0, Errors: 0, Skipped: 0, Time elapsed: 3.519 sec
>> Running org.apache.hadoop.hbase.zookeeper.TestZKTable
>> Tests run: 1, Failures: 0, Errors: 0, Skipped: 0, Time elapsed: 1.463 sec
>> Running org.apache.hadoop.hbase.zookeeper.TestZKMulti
>> Tests run: 6, Failures: 0, Errors: 0, Skipped: 0, Time elapsed: 1.225 sec
>> Running org.apache.hadoop.hbase.zookeeper.TestHQuorumPeer
>> Tests run: 3, Failures: 0, Errors: 0, Skipped: 0, Time elapsed: 1.332 sec
>> Running org.apache.hadoop.hbase.zookeeper.TestZooKeeperNodeTracker
>> Tests run: 3, Failures: 0, Errors: 0, Skipped: 0, Time elapsed: 1.196 sec
>> Running
>> org.apache.hadoop.hbase.zookeeper.lock.TestZKInterProcessReadWriteLock
>> Tests run: 6, Failures: 0, Errors: 0, Skipped: 0, Time elapsed: 26.063 sec
>> Running org.apache.hadoop.hbase.TestRegionRebalancing
>> Tests run: 2, Failures: 0, Errors: 0, Skipped: 0, Time elapsed: 58.085 sec
>> Running org.apache.hadoop.hbase.TestAcidGuarantees
>> Tests run: 3, Failures: 0, Errors: 0, Skipped: 0, Time elapsed: 83.059 sec
>> Running org.apache.hadoop.hbase.client.TestAdmin
>> Tests run: 43, Failures: 0, Errors: 0, Skipped: 0, Time elapsed: 319.289
>> sec
>>
>> Results :
>>
>> Failed tests:
>> testExcludeMinorCompaction(org.apache.hadoop.hbase.mapreduce.TestHFileOutputFormat)
>>
>> testMRIncrementalLoad(org.apache.hadoop.hbase.mapreduce.TestHFileOutputFormat)
>>
>> testScanYZYToEmpty(org.apache.hadoop.hbase.mapreduce.TestTableInputFormatScan2)
>>
>> Tests in error:
>>
>> testRecoveredEditsReplayCompaction(org.apache.hadoop.hbase.regionserver.TestHRegionBusyWait):
>> File <
>> http://54.241.6.143/job/HBase-0.95-Hadoop-2/ws/hbase-server/target/test-data/9df50344-f6c9-46e5-830f-de6b289e8358/TestHRegiontestRecoveredEditsReplayCompaction/testRecoveredEditsReplayCompaction/ec7f3aaaa1caf1a70afcfe67951b4982/.tmp>
>> does not exist
>>
>> Tests run: 1423, Failures: 3, Errors: 1, Skipped: 14
>>
>> [JENKINS] Recording test results
>> [INFO]
>> [INFO]
>> ------------------------------------------------------------------------
>> [INFO] Skipping HBase
>> [INFO] This project has been banned from the build due to previous
>> failures.
>> [INFO]
>> ------------------------------------------------------------------------
>> [INFO]
>> [INFO]
>> ------------------------------------------------------------------------
>> [INFO] Skipping HBase
>> [INFO] This project has been banned from the build due to previous
>> failures.
>> [INFO]
>> ------------------------------------------------------------------------
>> [INFO]
>> ------------------------------------------------------------------------
>> [INFO] Reactor Summary:
>> [INFO]
>> [INFO] HBase ............................................. SUCCESS
>> [39.798s]
>> [INFO] HBase - Common .................................... SUCCESS
>> [1:39.864s]
>> [INFO] HBase - Protocol .................................. SUCCESS
>> [17.265s]
>> [INFO] HBase - Client .................................... SUCCESS
>> [12.204s]
>> [INFO] HBase - Prefix Tree ............................... SUCCESS
>> [4.992s]
>> [INFO] HBase - Hadoop Compatibility ...................... SUCCESS
>> [1.207s]
>> [INFO] HBase - Hadoop Two Compatibility .................. SUCCESS
>> [15.829s]
>> [INFO] HBase - Server .................................... FAILURE
>> [48:43.598s]
>> [INFO] HBase - Integration Tests ......................... SKIPPED
>> [INFO] HBase - Examples .................................. SKIPPED
>> [INFO] HBase - Assembly .................................. SKIPPED
>> [INFO]
>> ------------------------------------------------------------------------
>> [INFO] BUILD FAILURE
>> [INFO]
>> ------------------------------------------------------------------------
>> [INFO] Total time: 52:25.686s
>> [INFO] Finished at: Thu May 02 10:09:15 UTC 2013
>> [INFO] Final Memory: 143M/1490M
>> [INFO]
>> ------------------------------------------------------------------------
>> [JENKINS] Archiving <
>> http://54.241.6.143/job/HBase-0.95-Hadoop-2/ws/hbase-hadoop2-compat/pom.xml>
>> to
>> /var/lib/jenkins/jobs/HBase-0.95-Hadoop-2/modules/org.apache.hbase$hbase-hadoop2-compat/builds/2013-05-02_09-16-42/archive/org.apache.hbase/hbase-hadoop2-compat/0.97.0-SNAPSHOT/hbase-hadoop2-compat-0.97.0-SNAPSHOT.pom
>> [JENKINS] Archiving <
>> http://54.241.6.143/job/HBase-0.95-Hadoop-2/ws/hbase-hadoop2-compat/target/hbase-hadoop2-compat-0.97.0-SNAPSHOT.jar>
>> to
>> /var/lib/jenkins/jobs/HBase-0.95-Hadoop-2/modules/org.apache.hbase$hbase-hadoop2-compat/builds/2013-05-02_09-16-42/archive/org.apache.hbase/hbase-hadoop2-compat/0.97.0-SNAPSHOT/hbase-hadoop2-compat-0.97.0-SNAPSHOT.jar
>> [JENKINS] Archiving <
>> http://54.241.6.143/job/HBase-0.95-Hadoop-2/ws/hbase-hadoop2-compat/target/hbase-hadoop2-compat-0.97.0-SNAPSHOT-sources.jar>
>> to
>> /var/lib/jenkins/jobs/HBase-0.95-Hadoop-2/modules/org.apache.hbase$hbase-hadoop2-compat/builds/2013-05-02_09-16-42/archive/org.apache.hbase/hbase-hadoop2-compat/0.97.0-SNAPSHOT/hbase-hadoop2-compat-0.97.0-SNAPSHOT-sources.jar
>> [JENKINS] Archiving <
>> http://54.241.6.143/job/HBase-0.95-Hadoop-2/ws/hbase-hadoop2-compat/target/hbase-hadoop2-compat-0.97.0-SNAPSHOT-tests.jar>
>> to
>> /var/lib/jenkins/jobs/HBase-0.95-Hadoop-2/modules/org.apache.hbase$hbase-hadoop2-compat/builds/2013-05-02_09-16-42/archive/org.apache.hbase/hbase-hadoop2-compat/0.97.0-SNAPSHOT/hbase-hadoop2-compat-0.97.0-SNAPSHOT-tests.jar
>> [JENKINS] Archiving <
>> http://54.241.6.143/job/HBase-0.95-Hadoop-2/ws/hbase-common/pom.xml> to
>> /var/lib/jenkins/jobs/HBase-0.95-Hadoop-2/modules/org.apache.hbase$hbase-common/builds/2013-05-02_09-16-42/archive/org.apache.hbase/hbase-common/0.97.0-SNAPSHOT/hbase-common-0.97.0-SNAPSHOT.pom
>> [JENKINS] Archiving <
>> http://54.241.6.143/job/HBase-0.95-Hadoop-2/ws/hbase-common/target/hbase-common-0.97.0-SNAPSHOT.jar>
>> to
>> /var/lib/jenkins/jobs/HBase-0.95-Hadoop-2/modules/org.apache.hbase$hbase-common/builds/2013-05-02_09-16-42/archive/org.apache.hbase/hbase-common/0.97.0-SNAPSHOT/hbase-common-0.97.0-SNAPSHOT.jar
>> [JENKINS] Archiving <
>> http://54.241.6.143/job/HBase-0.95-Hadoop-2/ws/hbase-common/target/hbase-common-0.97.0-SNAPSHOT-sources.jar>
>> to
>> /var/lib/jenkins/jobs/HBase-0.95-Hadoop-2/modules/org.apache.hbase$hbase-common/builds/2013-05-02_09-16-42/archive/org.apache.hbase/hbase-common/0.97.0-SNAPSHOT/hbase-common-0.97.0-SNAPSHOT-sources.jar
>> [JENKINS] Archiving <
>> http://54.241.6.143/job/HBase-0.95-Hadoop-2/ws/hbase-common/target/hbase-common-0.97.0-SNAPSHOT-tests.jar>
>> to
>> /var/lib/jenkins/jobs/HBase-0.95-Hadoop-2/modules/org.apache.hbase$hbase-common/builds/2013-05-02_09-16-42/archive/org.apache.hbase/hbase-common/0.97.0-SNAPSHOT/hbase-common-0.97.0-SNAPSHOT-tests.jar
>> [JENKINS] Archiving <
>> http://54.241.6.143/job/HBase-0.95-Hadoop-2/ws/hbase-hadoop-compat/pom.xml>
>> to
>> /var/lib/jenkins/jobs/HBase-0.95-Hadoop-2/modules/org.apache.hbase$hbase-hadoop-compat/builds/2013-05-02_09-16-42/archive/org.apache.hbase/hbase-hadoop-compat/0.97.0-SNAPSHOT/hbase-hadoop-compat-0.97.0-SNAPSHOT.pom
>> [JENKINS] Archiving <
>> http://54.241.6.143/job/HBase-0.95-Hadoop-2/ws/hbase-hadoop-compat/target/hbase-hadoop-compat-0.97.0-SNAPSHOT.jar>
>> to
>> /var/lib/jenkins/jobs/HBase-0.95-Hadoop-2/modules/org.apache.hbase$hbase-hadoop-compat/builds/2013-05-02_09-16-42/archive/org.apache.hbase/hbase-hadoop-compat/0.97.0-SNAPSHOT/hbase-hadoop-compat-0.97.0-SNAPSHOT.jar
>> [JENKINS] Archiving <
>> http://54.241.6.143/job/HBase-0.95-Hadoop-2/ws/hbase-hadoop-compat/target/hbase-hadoop-compat-0.97.0-SNAPSHOT-sources.jar>
>> to
>> /var/lib/jenkins/jobs/HBase-0.95-Hadoop-2/modules/org.apache.hbase$hbase-hadoop-compat/builds/2013-05-02_09-16-42/archive/org.apache.hbase/hbase-hadoop-compat/0.97.0-SNAPSHOT/hbase-hadoop-compat-0.97.0-SNAPSHOT-sources.jar
>> [JENKINS] Archiving <
>> http://54.241.6.143/job/HBase-0.95-Hadoop-2/ws/hbase-hadoop-compat/target/hbase-hadoop-compat-0.97.0-SNAPSHOT-tests.jar>
>> to
>> /var/lib/jenkins/jobs/HBase-0.95-Hadoop-2/modules/org.apache.hbase$hbase-hadoop-compat/builds/2013-05-02_09-16-42/archive/org.apache.hbase/hbase-hadoop-compat/0.97.0-SNAPSHOT/hbase-hadoop-compat-0.97.0-SNAPSHOT-tests.jar
>> [JENKINS] Archiving <
>> http://54.241.6.143/job/HBase-0.95-Hadoop-2/ws/hbase-examples/pom.xml>
>> to
>> /var/lib/jenkins/jobs/HBase-0.95-Hadoop-2/modules/org.apache.hbase$hbase-examples/builds/2013-05-02_09-16-42/archive/org.apache.hbase/hbase-examples/0.97.0-SNAPSHOT/hbase-examples-0.97.0-SNAPSHOT.pom
>> [JENKINS] Archiving <
>> http://54.241.6.143/job/HBase-0.95-Hadoop-2/ws/hbase-it/pom.xml> to
>> /var/lib/jenkins/jobs/HBase-0.95-Hadoop-2/modules/org.apache.hbase$hbase-it/builds/2013-05-02_09-16-42/archive/org.apache.hbase/hbase-it/0.97.0-SNAPSHOT/hbase-it-0.97.0-SNAPSHOT.pom
>> [JENKINS] Archiving <
>> http://54.241.6.143/job/HBase-0.95-Hadoop-2/ws/pom.xml> to
>> /var/lib/jenkins/jobs/HBase-0.95-Hadoop-2/modules/org.apache.hbase$hbase/builds/2013-05-02_09-16-42/archive/org.apache.hbase/hbase/0.97.0-SNAPSHOT/hbase-0.97.0-SNAPSHOT.pom
>> [JENKINS] Archiving <
>> http://54.241.6.143/job/HBase-0.95-Hadoop-2/ws/target/hbase-0.97.0-SNAPSHOT-site.xml>
>> to
>> /var/lib/jenkins/jobs/HBase-0.95-Hadoop-2/modules/org.apache.hbase$hbase/builds/2013-05-02_09-16-42/archive/org.apache.hbase/hbase/0.97.0-SNAPSHOT/hbase-0.97.0-SNAPSHOT-site.xml
>> [JENKINS] Archiving <
>> http://54.241.6.143/job/HBase-0.95-Hadoop-2/ws/hbase-assembly/pom.xml>
>> to
>> /var/lib/jenkins/jobs/HBase-0.95-Hadoop-2/modules/org.apache.hbase$hbase-assembly/builds/2013-05-02_09-16-42/archive/org.apache.hbase/hbase-assembly/0.97.0-SNAPSHOT/hbase-assembly-0.97.0-SNAPSHOT.pom
>> [JENKINS] Archiving <
>> http://54.241.6.143/job/HBase-0.95-Hadoop-2/ws/hbase-client/pom.xml> to
>> /var/lib/jenkins/jobs/HBase-0.95-Hadoop-2/modules/org.apache.hbase$hbase-client/builds/2013-05-02_09-16-42/archive/org.apache.hbase/hbase-client/0.97.0-SNAPSHOT/hbase-client-0.97.0-SNAPSHOT.pom
>> [JENKINS] Archiving <
>> http://54.241.6.143/job/HBase-0.95-Hadoop-2/ws/hbase-client/target/hbase-client-0.97.0-SNAPSHOT.jar>
>> to
>> /var/lib/jenkins/jobs/HBase-0.95-Hadoop-2/modules/org.apache.hbase$hbase-client/builds/2013-05-02_09-16-42/archive/org.apache.hbase/hbase-client/0.97.0-SNAPSHOT/hbase-client-0.97.0-SNAPSHOT.jar
>> [JENKINS] Archiving <
>> http://54.241.6.143/job/HBase-0.95-Hadoop-2/ws/hbase-client/target/hbase-client-0.97.0-SNAPSHOT-sources.jar>
>> to
>> /var/lib/jenkins/jobs/HBase-0.95-Hadoop-2/modules/org.apache.hbase$hbase-client/builds/2013-05-02_09-16-42/archive/org.apache.hbase/hbase-client/0.97.0-SNAPSHOT/hbase-client-0.97.0-SNAPSHOT-sources.jar
>> [JENKINS] Archiving <
>> http://54.241.6.143/job/HBase-0.95-Hadoop-2/ws/hbase-client/target/hbase-client-0.97.0-SNAPSHOT-tests.jar>
>> to
>> /var/lib/jenkins/jobs/HBase-0.95-Hadoop-2/modules/org.apache.hbase$hbase-client/builds/2013-05-02_09-16-42/archive/org.apache.hbase/hbase-client/0.97.0-SNAPSHOT/hbase-client-0.97.0-SNAPSHOT-tests.jar
>> [JENKINS] Archiving <
>> http://54.241.6.143/job/HBase-0.95-Hadoop-2/ws/hbase-prefix-tree/pom.xml>
>> to
>> /var/lib/jenkins/jobs/HBase-0.95-Hadoop-2/modules/org.apache.hbase$hbase-prefix-tree/builds/2013-05-02_09-16-42/archive/org.apache.hbase/hbase-prefix-tree/0.97.0-SNAPSHOT/hbase-prefix-tree-0.97.0-SNAPSHOT.pom
>> [JENKINS] Archiving <
>> http://54.241.6.143/job/HBase-0.95-Hadoop-2/ws/hbase-prefix-tree/target/hbase-prefix-tree-0.97.0-SNAPSHOT.jar>
>> to
>> /var/lib/jenkins/jobs/HBase-0.95-Hadoop-2/modules/org.apache.hbase$hbase-prefix-tree/builds/2013-05-02_09-16-42/archive/org.apache.hbase/hbase-prefix-tree/0.97.0-SNAPSHOT/hbase-prefix-tree-0.97.0-SNAPSHOT.jar
>> [JENKINS] Archiving <
>> http://54.241.6.143/job/HBase-0.95-Hadoop-2/ws/hbase-prefix-tree/target/hbase-prefix-tree-0.97.0-SNAPSHOT-sources.jar>
>> to
>> /var/lib/jenkins/jobs/HBase-0.95-Hadoop-2/modules/org.apache.hbase$hbase-prefix-tree/builds/2013-05-02_09-16-42/archive/org.apache.hbase/hbase-prefix-tree/0.97.0-SNAPSHOT/hbase-prefix-tree-0.97.0-SNAPSHOT-sources.jar
>> [JENKINS] Archiving <
>> http://54.241.6.143/job/HBase-0.95-Hadoop-2/ws/hbase-prefix-tree/target/hbase-prefix-tree-0.97.0-SNAPSHOT-tests.jar>
>> to
>> /var/lib/jenkins/jobs/HBase-0.95-Hadoop-2/modules/org.apache.hbase$hbase-prefix-tree/builds/2013-05-02_09-16-42/archive/org.apache.hbase/hbase-prefix-tree/0.97.0-SNAPSHOT/hbase-prefix-tree-0.97.0-SNAPSHOT-tests.jar
>> [JENKINS] Archiving <
>> http://54.241.6.143/job/HBase-0.95-Hadoop-2/ws/hbase-protocol/pom.xml>
>> to
>> /var/lib/jenkins/jobs/HBase-0.95-Hadoop-2/modules/org.apache.hbase$hbase-protocol/builds/2013-05-02_09-16-42/archive/org.apache.hbase/hbase-protocol/0.97.0-SNAPSHOT/hbase-protocol-0.97.0-SNAPSHOT.pom
>> [JENKINS] Archiving <
>> http://54.241.6.143/job/HBase-0.95-Hadoop-2/ws/hbase-protocol/target/hbase-protocol-0.97.0-SNAPSHOT.jar>
>> to
>> /var/lib/jenkins/jobs/HBase-0.95-Hadoop-2/modules/org.apache.hbase$hbase-protocol/builds/2013-05-02_09-16-42/archive/org.apache.hbase/hbase-protocol/0.97.0-SNAPSHOT/hbase-protocol-0.97.0-SNAPSHOT.jar
>> [JENKINS] Archiving <
>> http://54.241.6.143/job/HBase-0.95-Hadoop-2/ws/hbase-protocol/target/hbase-protocol-0.97.0-SNAPSHOT-sources.jar>
>> to
>> /var/lib/jenkins/jobs/HBase-0.95-Hadoop-2/modules/org.apache.hbase$hbase-protocol/builds/2013-05-02_09-16-42/archive/org.apache.hbase/hbase-protocol/0.97.0-SNAPSHOT/hbase-protocol-0.97.0-SNAPSHOT-sources.jar
>> [JENKINS] Archiving <
>> http://54.241.6.143/job/HBase-0.95-Hadoop-2/ws/hbase-protocol/target/hbase-protocol-0.97.0-SNAPSHOT-tests.jar>
>> to
>> /var/lib/jenkins/jobs/HBase-0.95-Hadoop-2/modules/org.apache.hbase$hbase-protocol/builds/2013-05-02_09-16-42/archive/org.apache.hbase/hbase-protocol/0.97.0-SNAPSHOT/hbase-protocol-0.97.0-SNAPSHOT-tests.jar
>> [JENKINS] Archiving <
>> http://54.241.6.143/job/HBase-0.95-Hadoop-2/ws/hbase-server/pom.xml> to
>> /var/lib/jenkins/jobs/HBase-0.95-Hadoop-2/modules/org.apache.hbase$hbase-server/builds/2013-05-02_09-16-42/archive/org.apache.hbase/hbase-server/0.97.0-SNAPSHOT/hbase-server-0.97.0-SNAPSHOT.pom
>> Waiting for Jenkins to finish collecting data
>> mavenExecutionResult exceptions not empty
>> message : Failed to execute goal
>> org.apache.maven.plugins:maven-surefire-plugin:2.12-TRUNK-HBASE-2:test
>> (secondPartTestsExecution) on project hbase-server: Failure or timeout
>> cause : Failure or timeout
>> Stack trace :
>> org.apache.maven.lifecycle.LifecycleExecutionException: Failed to execute
>> goal org.apache.maven.plugins:maven-surefire-plugin:2.12-TRUNK-HBASE-2:test
>> (secondPartTestsExecution) on project hbase-server: Failure or timeout
>>         at
>> org.apache.maven.lifecycle.internal.MojoExecutor.execute(MojoExecutor.java:217)
>>         at
>> org.apache.maven.lifecycle.internal.MojoExecutor.execute(MojoExecutor.java:153)
>>         at
>> org.apache.maven.lifecycle.internal.MojoExecutor.execute(MojoExecutor.java:145)
>>         at
>> org.apache.maven.lifecycle.internal.LifecycleModuleBuilder.buildProject(LifecycleModuleBuilder.java:84)
>>         at
>> org.apache.maven.lifecycle.internal.LifecycleModuleBuilder.buildProject(LifecycleModuleBuilder.java:59)
>>         at
>> org.apache.maven.lifecycle.internal.LifecycleStarter.singleThreadedBuild(LifecycleStarter.java:183)
>>         at
>> org.apache.maven.lifecycle.internal.LifecycleStarter.execute(LifecycleStarter.java:161)
>>         at org.apache.maven.DefaultMaven.doExecute(DefaultMaven.java:320)
>>         at org.apache.maven.DefaultMaven.execute(DefaultMaven.java:156)
>>         at
>> org.jvnet.hudson.maven3.launcher.Maven3Launcher.main(Maven3Launcher.java:79)
>>         at sun.reflect.NativeMethodAccessorImpl.invoke0(Native Method)
>>         at
>> sun.reflect.NativeMethodAccessorImpl.invoke(NativeMethodAccessorImpl.java:39)
>>         at
>> sun.reflect.DelegatingMethodAccessorImpl.invoke(DelegatingMethodAccessorImpl.java:25)
>>         at java.lang.reflect.Method.invoke(Method.java:597)
>>         at
>> org.codehaus.plexus.classworlds.launcher.Launcher.launchStandard(Launcher.java:329)
>>         at
>> org.codehaus.plexus.classworlds.launcher.Launcher.launch(Launcher.java:239)
>>         at
>> org.jvnet.hudson.maven3.agent.Maven3Main.launch(Maven3Main.java:158)
>>         at hudson.maven.Maven3Builder.call(Maven3Builder.java:100)
>>         at hudson.maven.Maven3Builder.call(Maven3Builder.java:66)
>>         at hudson.remoting.UserRequest.perform(UserRequest.java:118)
>>         at hudson.remoting.UserRequest.perform(UserRequest.java:48)
>>         at hudson.remoting.Request$2.run(Request.java:326)
>>         at
>> hudson.remoting.InterceptingExecutorService$1.call(InterceptingExecutorService.java:72)
>>         at
>> java.util.concurrent.FutureTask$Sync.innerRun(FutureTask.java:303)
>>         at java.util.concurrent.FutureTask.run(FutureTask.java:138)
>>         at
>> java.util.concurrent.ThreadPoolExecutor$Worker.runTask(ThreadPoolExecutor.java:895)
>>         at
>> java.util.concurrent.ThreadPoolExecutor$Worker.run(ThreadPoolExecutor.java:918)
>>         at java.lang.Thread.run(Thread.java:662)
>> Caused by: org.apache.maven.plugin.MojoExecutionException: Failure or
>> timeout
>>         at
>> org.apache.maven.plugin.surefire.SurefirePlugin.assertNoFailureOrTimeout(SurefirePlugin.java:643)
>>         at
>> org.apache.maven.plugin.surefire.SurefirePlugin.handleSummary(SurefirePlugin.java:624)
>>         at
>> org.apache.maven.plugin.surefire.AbstractSurefireMojo.executeAfterPreconditionsChecked(AbstractSurefireMojo.java:137)
>>         at
>> org.apache.maven.plugin.surefire.AbstractSurefireMojo.execute(AbstractSurefireMojo.java:98)
>>         at
>> org.apache.maven.plugin.DefaultBuildPluginManager.executeMojo(DefaultBuildPluginManager.java:101)
>>         at
>> org.apache.maven.lifecycle.internal.MojoExecutor.execute(MojoExecutor.java:209)
>>         ... 27 more
>> channel stopped
>>
>
>
>
> --
> // Jonathan Hsieh (shay)
> // Software Engineer, Cloudera
> // jon@cloudera.com
>
>



-- 
// Jonathan Hsieh (shay)
// Software Engineer, Cloudera
// jon@cloudera.com

Mime
  • Unnamed multipart/alternative (inline, None, 0 bytes)
View raw message