hbase-dev mailing list archives

Site index · List index
Message view « Date » · « Thread »
Top « Date » · « Thread »
From Jonathan Hsieh <...@cloudera.com>
Subject Re: Build failed in Jenkins: HBase-TRUNK #241
Date Mon, 06 May 2013 21:12:21 GMT
TestMultiTableInputFormat hung


On Sat, May 4, 2013 at 6:18 PM, <apurtell@apache.org> wrote:

> See <http://54.241.6.143/job/HBase-TRUNK/241/>
>
> ------------------------------------------
> [...truncated 6726 lines...]
> Tests run: 1, Failures: 0, Errors: 0, Skipped: 0, Time elapsed: 5.03 sec
> Running org.apache.hadoop.hbase.regionserver.TestCompactionState
> Tests run: 5, Failures: 0, Errors: 0, Skipped: 0, Time elapsed: 89.092 sec
> Running org.apache.hadoop.hbase.regionserver.wal.TestWALReplayCompressed
> Tests run: 8, Failures: 0, Errors: 0, Skipped: 0, Time elapsed: 51.456 sec
> Running org.apache.hadoop.hbase.backup.TestHFileArchiving
> Tests run: 5, Failures: 0, Errors: 0, Skipped: 0, Time elapsed: 168.101 sec
> Running org.apache.hadoop.hbase.regionserver.wal.TestHLog
> Tests run: 12, Failures: 0, Errors: 0, Skipped: 0, Time elapsed: 67.939 sec
> Running org.apache.hadoop.hbase.regionserver.wal.TestLogRollAbort
> Tests run: 1, Failures: 0, Errors: 0, Skipped: 0, Time elapsed: 18.659 sec
> Running org.apache.hadoop.hbase.regionserver.wal.TestWALReplay
> Tests run: 8, Failures: 0, Errors: 0, Skipped: 0, Time elapsed: 50.316 sec
> Running org.apache.hadoop.hbase.regionserver.wal.TestHLogSplitCompressed
> Tests run: 34, Failures: 0, Errors: 0, Skipped: 1, Time elapsed: 124.991
> sec
> Running org.apache.hadoop.hbase.regionserver.wal.TestHLogSplit
> Tests run: 34, Failures: 0, Errors: 0, Skipped: 1, Time elapsed: 118.013
> sec
> Running org.apache.hadoop.hbase.regionserver.wal.TestHLogFiltering
> Tests run: 1, Failures: 0, Errors: 0, Skipped: 0, Time elapsed: 27.587 sec
> Running org.apache.hadoop.hbase.regionserver.TestAtomicOperation
> Tests run: 6, Failures: 1, Errors: 0, Skipped: 0, Time elapsed: 37.744 sec
> <<< FAILURE!
> Running org.apache.hadoop.hbase.regionserver.TestHRegion
> Tests run: 63, Failures: 0, Errors: 0, Skipped: 0, Time elapsed: 82.579 sec
> Running org.apache.hadoop.hbase.regionserver.TestHRegionBusyWait
> Tests run: 64, Failures: 0, Errors: 0, Skipped: 0, Time elapsed: 79.084 sec
> Running org.apache.hadoop.hbase.regionserver.TestHRegionServerBulkLoad
> Tests run: 1, Failures: 0, Errors: 0, Skipped: 0, Time elapsed: 47.833 sec
> Running org.apache.hadoop.hbase.regionserver.TestStoreFileBlockCacheSummary
> Tests run: 1, Failures: 0, Errors: 0, Skipped: 0, Time elapsed: 20.024 sec
> Running org.apache.hadoop.hbase.regionserver.TestStore
> Tests run: 15, Failures: 0, Errors: 0, Skipped: 0, Time elapsed: 12.948 sec
> Running org.apache.hadoop.hbase.regionserver.TestFSErrorsExposed
> Tests run: 3, Failures: 0, Errors: 0, Skipped: 1, Time elapsed: 1.313 sec
> Running org.apache.hadoop.hbase.regionserver.TestClusterId
> Tests run: 1, Failures: 0, Errors: 0, Skipped: 0, Time elapsed: 28.106 sec
> Running org.apache.hadoop.hbase.regionserver.TestHRegionOnCluster
> Tests run: 1, Failures: 0, Errors: 0, Skipped: 0, Time elapsed: 21.043 sec
> Running org.apache.hadoop.hbase.regionserver.TestCompaction
> Tests run: 17, Failures: 0, Errors: 0, Skipped: 0, Time elapsed: 81.834 sec
> Running org.apache.hadoop.hbase.regionserver.handler.TestOpenRegionHandler
> Tests run: 5, Failures: 0, Errors: 0, Skipped: 0, Time elapsed: 2.475 sec
> Running org.apache.hadoop.hbase.regionserver.handler.TestCloseRegionHandler
> Tests run: 3, Failures: 0, Errors: 0, Skipped: 0, Time elapsed: 3.103 sec
> Running
> org.apache.hadoop.hbase.regionserver.TestRegionMergeTransactionOnCluster
> Tests run: 2, Failures: 0, Errors: 0, Skipped: 0, Time elapsed: 24.763 sec
> Running org.apache.hadoop.hbase.regionserver.TestGetClosestAtOrBefore
> Tests run: 3, Failures: 0, Errors: 0, Skipped: 0, Time elapsed: 1.808 sec
> Running org.apache.hadoop.hbase.regionserver.wal.TestLogRolling
> Tests run: 2, Failures: 0, Errors: 0, Skipped: 0, Time elapsed: 261.435 sec
> Running
> org.apache.hadoop.hbase.regionserver.TestRSKilledWhenMasterInitializing
> Tests run: 1, Failures: 0, Errors: 0, Skipped: 0, Time elapsed: 38.037 sec
> Running org.apache.hadoop.hbase.regionserver.TestMemStore
> Tests run: 22, Failures: 0, Errors: 0, Skipped: 0, Time elapsed: 34.512 sec
> Running org.apache.hadoop.hbase.regionserver.TestSplitTransactionOnCluster
> Tests run: 9, Failures: 0, Errors: 0, Skipped: 0, Time elapsed: 52.449 sec
> Running org.apache.hadoop.hbase.TestDrainingServer
> Tests run: 2, Failures: 0, Errors: 0, Skipped: 0, Time elapsed: 25.136 sec
> Running org.apache.hadoop.hbase.regionserver.TestRegionServerNoMaster
> Tests run: 7, Failures: 0, Errors: 0, Skipped: 0, Time elapsed: 30.004 sec
> Running org.apache.hadoop.hbase.fs.TestBlockReorder
> Tests run: 3, Failures: 0, Errors: 0, Skipped: 0, Time elapsed: 32.562 sec
> Running org.apache.hadoop.hbase.filter.TestColumnRangeFilter
> Tests run: 1, Failures: 0, Errors: 0, Skipped: 0, Time elapsed: 18.709 sec
> Running org.apache.hadoop.hbase.filter.TestFilterWrapper
> Tests run: 1, Failures: 0, Errors: 0, Skipped: 0, Time elapsed: 14.525 sec
> Running org.apache.hadoop.hbase.filter.TestFilterWithScanLimits
> Tests run: 1, Failures: 0, Errors: 0, Skipped: 0, Time elapsed: 15.758 sec
> Running org.apache.hadoop.hbase.regionserver.TestMultiColumnScanner
> Tests run: 12, Failures: 0, Errors: 0, Skipped: 0, Time elapsed: 59.645 sec
> Running org.apache.hadoop.hbase.master.TestMasterStatusServlet
> Tests run: 4, Failures: 0, Errors: 0, Skipped: 0, Time elapsed: 2.194 sec
> Running org.apache.hadoop.hbase.master.balancer.TestBaseLoadBalancer
> Tests run: 3, Failures: 0, Errors: 0, Skipped: 0, Time elapsed: 0.837 sec
> Running org.apache.hadoop.hbase.master.TestMasterTransitions
> Tests run: 3, Failures: 0, Errors: 0, Skipped: 3, Time elapsed: 14.304 sec
> Running org.apache.hadoop.hbase.master.balancer.TestDefaultLoadBalancer
> Tests run: 1, Failures: 0, Errors: 0, Skipped: 0, Time elapsed: 2.052 sec
> Running org.apache.hadoop.hbase.master.TestRestartCluster
> Tests run: 2, Failures: 0, Errors: 0, Skipped: 0, Time elapsed: 32.488 sec
> Running
> org.apache.hadoop.hbase.master.TestMasterFailoverBalancerPersistence
> Tests run: 1, Failures: 0, Errors: 0, Skipped: 0, Time elapsed: 14.677 sec
> Running org.apache.hadoop.hbase.master.TestMasterFailover
> Tests run: 4, Failures: 0, Errors: 0, Skipped: 0, Time elapsed: 55.475 sec
> Running org.apache.hadoop.hbase.master.TestDeadServer
> Tests run: 3, Failures: 0, Errors: 0, Skipped: 0, Time elapsed: 0.454 sec
> Running org.apache.hadoop.hbase.master.TestRollingRestart
> Tests run: 1, Failures: 0, Errors: 0, Skipped: 0, Time elapsed: 38.553 sec
> Running org.apache.hadoop.hbase.master.TestZKBasedOpenCloseRegion
> Tests run: 4, Failures: 0, Errors: 0, Skipped: 0, Time elapsed: 18.451 sec
> Running org.apache.hadoop.hbase.master.TestMasterNoCluster
> Tests run: 3, Failures: 0, Errors: 0, Skipped: 0, Time elapsed: 4.772 sec
> Running org.apache.hadoop.hbase.master.balancer.TestStochasticLoadBalancer
> Tests run: 9, Failures: 0, Errors: 0, Skipped: 1, Time elapsed: 49.315 sec
> Running org.apache.hadoop.hbase.master.TestMasterFileSystem
> Tests run: 1, Failures: 0, Errors: 0, Skipped: 0, Time elapsed: 9.481 sec
> Running org.apache.hadoop.hbase.master.TestMasterMetrics
> Tests run: 2, Failures: 0, Errors: 0, Skipped: 0, Time elapsed: 23.225 sec
> Running org.apache.hadoop.hbase.master.TestSplitLogManager
> Tests run: 13, Failures: 0, Errors: 0, Skipped: 0, Time elapsed: 84.254 sec
> Running org.apache.hadoop.hbase.master.cleaner.TestHFileCleaner
> Tests run: 3, Failures: 0, Errors: 0, Skipped: 0, Time elapsed: 8.65 sec
> Running org.apache.hadoop.hbase.master.cleaner.TestLogsCleaner
> Tests run: 1, Failures: 0, Errors: 0, Skipped: 0, Time elapsed: 15.427 sec
> Running org.apache.hadoop.hbase.master.TestAssignmentManagerOnCluster
> Tests run: 7, Failures: 0, Errors: 0, Skipped: 0, Time elapsed: 38.365 sec
> Running org.apache.hadoop.hbase.master.TestActiveMasterManager
> Tests run: 2, Failures: 0, Errors: 0, Skipped: 0, Time elapsed: 1.819 sec
> Running org.apache.hadoop.hbase.master.TestHMasterRPCException
> Tests run: 1, Failures: 0, Errors: 0, Skipped: 0, Time elapsed: 2.593 sec
> Running org.apache.hadoop.hbase.master.TestMaster
> Tests run: 4, Failures: 0, Errors: 0, Skipped: 0, Time elapsed: 28.206 sec
> Running org.apache.hadoop.hbase.master.TestAssignmentManager
> Tests run: 15, Failures: 0, Errors: 0, Skipped: 0, Time elapsed: 5.126 sec
> Running org.apache.hadoop.hbase.master.TestMasterMetricsWrapper
> Tests run: 1, Failures: 0, Errors: 0, Skipped: 0, Time elapsed: 15.984 sec
> Running org.apache.hadoop.hbase.master.snapshot.TestSnapshotFileCache
> Tests run: 4, Failures: 0, Errors: 0, Skipped: 0, Time elapsed: 4.781 sec
> Running org.apache.hadoop.hbase.master.cleaner.TestSnapshotFromMaster
> Tests run: 4, Failures: 0, Errors: 0, Skipped: 0, Time elapsed: 31.645 sec
> Running org.apache.hadoop.hbase.master.TestMasterShutdown
> Tests run: 2, Failures: 0, Errors: 0, Skipped: 0, Time elapsed: 24.18 sec
> Running org.apache.hadoop.hbase.master.TestOpenedRegionHandler
> Tests run: 2, Failures: 0, Errors: 0, Skipped: 0, Time elapsed: 11.936 sec
> Running org.apache.hadoop.hbase.master.handler.TestCreateTableHandler
> Tests run: 2, Failures: 0, Errors: 0, Skipped: 0, Time elapsed: 19.739 sec
> Running
> org.apache.hadoop.hbase.master.handler.TestTableDescriptorModification
> Tests run: 3, Failures: 0, Errors: 0, Skipped: 0, Time elapsed: 20.373 sec
> Running org.apache.hadoop.hbase.master.TestMasterRestartAfterDisablingTable
> Tests run: 1, Failures: 0, Errors: 0, Skipped: 0, Time elapsed: 14.878 sec
> Running org.apache.hadoop.hbase.master.TestClusterStatusPublisher
> Tests run: 3, Failures: 0, Errors: 0, Skipped: 0, Time elapsed: 0.884 sec
> Running org.apache.hadoop.hbase.master.handler.TestTableDeleteFamilyHandler
> Tests run: 1, Failures: 0, Errors: 0, Skipped: 0, Time elapsed: 39.536 sec
> Running org.apache.hadoop.hbase.master.TestTableLockManager
> Tests run: 5, Failures: 0, Errors: 0, Skipped: 0, Time elapsed: 147.015 sec
> Running org.apache.hadoop.hbase.master.TestDistributedLogSplitting
> Tests run: 4, Failures: 0, Errors: 0, Skipped: 0, Time elapsed: 78.823 sec
>
> Results :
>
> Failed tests:
> testMultiRowMutationMultiThreads(org.apache.hadoop.hbase.regionserver.TestAtomicOperation):
> expected:<0> but was:<2>
>
> Tests run: 1503, Failures: 1, Errors: 0, Skipped: 14
>
> [JENKINS] Recording test results
> [INFO]
> [INFO]
> ------------------------------------------------------------------------
> [INFO] Skipping HBase
> [INFO] This project has been banned from the build due to previous
> failures.
> [INFO]
> ------------------------------------------------------------------------
> [INFO]
> [INFO]
> ------------------------------------------------------------------------
> [INFO] Skipping HBase
> [INFO] This project has been banned from the build due to previous
> failures.
> [INFO]
> ------------------------------------------------------------------------
> [INFO]
> ------------------------------------------------------------------------
> [INFO] Reactor Summary:
> [INFO]
> [INFO] HBase ............................................. SUCCESS
> [54.640s]
> [INFO] HBase - Common .................................... SUCCESS
> [1:02.866s]
> [INFO] HBase - Protocol .................................. SUCCESS
> [19.503s]
> [INFO] HBase - Client .................................... SUCCESS
> [12.562s]
> [INFO] HBase - Prefix Tree ............................... SUCCESS [4.808s]
> [INFO] HBase - Hadoop Compatibility ...................... SUCCESS [1.223s]
> [INFO] HBase - Hadoop One Compatibility .................. SUCCESS [9.768s]
> [INFO] HBase - Server .................................... FAILURE
> [51:34.803s]
> [INFO] HBase - Integration Tests ......................... SKIPPED
> [INFO] HBase - Examples .................................. SKIPPED
> [INFO] HBase - Assembly .................................. SKIPPED
> [INFO]
> ------------------------------------------------------------------------
> [INFO] BUILD FAILURE
> [INFO]
> ------------------------------------------------------------------------
> [INFO] Total time: 54:30.161s
> [INFO] Finished at: Sun May 05 01:18:35 UTC 2013
> [INFO] Final Memory: 64M/442M
> [INFO]
> ------------------------------------------------------------------------
> [JENKINS] Archiving <
> http://54.241.6.143/job/HBase-TRUNK/ws/hbase-common/pom.xml> to
> /var/lib/jenkins/jobs/HBase-TRUNK/modules/org.apache.hbase$hbase-common/builds/2013-05-05_00-23-57/archive/org.apache.hbase/hbase-common/0.97.0-SNAPSHOT/hbase-common-0.97.0-SNAPSHOT.pom
> [JENKINS] Archiving <
> http://54.241.6.143/job/HBase-TRUNK/ws/hbase-common/target/hbase-common-0.97.0-SNAPSHOT.jar>
> to
> /var/lib/jenkins/jobs/HBase-TRUNK/modules/org.apache.hbase$hbase-common/builds/2013-05-05_00-23-57/archive/org.apache.hbase/hbase-common/0.97.0-SNAPSHOT/hbase-common-0.97.0-SNAPSHOT.jar
> [JENKINS] Archiving <
> http://54.241.6.143/job/HBase-TRUNK/ws/hbase-common/target/hbase-common-0.97.0-SNAPSHOT-sources.jar>
> to
> /var/lib/jenkins/jobs/HBase-TRUNK/modules/org.apache.hbase$hbase-common/builds/2013-05-05_00-23-57/archive/org.apache.hbase/hbase-common/0.97.0-SNAPSHOT/hbase-common-0.97.0-SNAPSHOT-sources.jar
> [JENKINS] Archiving <
> http://54.241.6.143/job/HBase-TRUNK/ws/hbase-common/target/hbase-common-0.97.0-SNAPSHOT-tests.jar>
> to
> /var/lib/jenkins/jobs/HBase-TRUNK/modules/org.apache.hbase$hbase-common/builds/2013-05-05_00-23-57/archive/org.apache.hbase/hbase-common/0.97.0-SNAPSHOT/hbase-common-0.97.0-SNAPSHOT-tests.jar
> [JENKINS] Archiving <
> http://54.241.6.143/job/HBase-TRUNK/ws/hbase-hadoop-compat/pom.xml> to
> /var/lib/jenkins/jobs/HBase-TRUNK/modules/org.apache.hbase$hbase-hadoop-compat/builds/2013-05-05_00-23-57/archive/org.apache.hbase/hbase-hadoop-compat/0.97.0-SNAPSHOT/hbase-hadoop-compat-0.97.0-SNAPSHOT.pom
> [JENKINS] Archiving <
> http://54.241.6.143/job/HBase-TRUNK/ws/hbase-hadoop-compat/target/hbase-hadoop-compat-0.97.0-SNAPSHOT.jar>
> to
> /var/lib/jenkins/jobs/HBase-TRUNK/modules/org.apache.hbase$hbase-hadoop-compat/builds/2013-05-05_00-23-57/archive/org.apache.hbase/hbase-hadoop-compat/0.97.0-SNAPSHOT/hbase-hadoop-compat-0.97.0-SNAPSHOT.jar
> [JENKINS] Archiving <
> http://54.241.6.143/job/HBase-TRUNK/ws/hbase-hadoop-compat/target/hbase-hadoop-compat-0.97.0-SNAPSHOT-sources.jar>
> to
> /var/lib/jenkins/jobs/HBase-TRUNK/modules/org.apache.hbase$hbase-hadoop-compat/builds/2013-05-05_00-23-57/archive/org.apache.hbase/hbase-hadoop-compat/0.97.0-SNAPSHOT/hbase-hadoop-compat-0.97.0-SNAPSHOT-sources.jar
> [JENKINS] Archiving <
> http://54.241.6.143/job/HBase-TRUNK/ws/hbase-hadoop-compat/target/hbase-hadoop-compat-0.97.0-SNAPSHOT-tests.jar>
> to
> /var/lib/jenkins/jobs/HBase-TRUNK/modules/org.apache.hbase$hbase-hadoop-compat/builds/2013-05-05_00-23-57/archive/org.apache.hbase/hbase-hadoop-compat/0.97.0-SNAPSHOT/hbase-hadoop-compat-0.97.0-SNAPSHOT-tests.jar
> [JENKINS] Archiving <
> http://54.241.6.143/job/HBase-TRUNK/ws/hbase-examples/pom.xml> to
> /var/lib/jenkins/jobs/HBase-TRUNK/modules/org.apache.hbase$hbase-examples/builds/2013-05-05_00-23-57/archive/org.apache.hbase/hbase-examples/0.97.0-SNAPSHOT/hbase-examples-0.97.0-SNAPSHOT.pom
> [JENKINS] Archiving <
> http://54.241.6.143/job/HBase-TRUNK/ws/hbase-it/pom.xml> to
> /var/lib/jenkins/jobs/HBase-TRUNK/modules/org.apache.hbase$hbase-it/builds/2013-05-05_00-23-57/archive/org.apache.hbase/hbase-it/0.97.0-SNAPSHOT/hbase-it-0.97.0-SNAPSHOT.pom
> [JENKINS] Archiving <http://54.241.6.143/job/HBase-TRUNK/ws/pom.xml> to
> /var/lib/jenkins/jobs/HBase-TRUNK/modules/org.apache.hbase$hbase/builds/2013-05-05_00-23-57/archive/org.apache.hbase/hbase/0.97.0-SNAPSHOT/hbase-0.97.0-SNAPSHOT.pom
> [JENKINS] Archiving <
> http://54.241.6.143/job/HBase-TRUNK/ws/target/hbase-0.97.0-SNAPSHOT-site.xml>
> to
> /var/lib/jenkins/jobs/HBase-TRUNK/modules/org.apache.hbase$hbase/builds/2013-05-05_00-23-57/archive/org.apache.hbase/hbase/0.97.0-SNAPSHOT/hbase-0.97.0-SNAPSHOT-site.xml
> [JENKINS] Archiving <
> http://54.241.6.143/job/HBase-TRUNK/ws/hbase-assembly/pom.xml> to
> /var/lib/jenkins/jobs/HBase-TRUNK/modules/org.apache.hbase$hbase-assembly/builds/2013-05-05_00-23-57/archive/org.apache.hbase/hbase-assembly/0.97.0-SNAPSHOT/hbase-assembly-0.97.0-SNAPSHOT.pom
> [JENKINS] Archiving <
> http://54.241.6.143/job/HBase-TRUNK/ws/hbase-client/pom.xml> to
> /var/lib/jenkins/jobs/HBase-TRUNK/modules/org.apache.hbase$hbase-client/builds/2013-05-05_00-23-57/archive/org.apache.hbase/hbase-client/0.97.0-SNAPSHOT/hbase-client-0.97.0-SNAPSHOT.pom
> [JENKINS] Archiving <
> http://54.241.6.143/job/HBase-TRUNK/ws/hbase-client/target/hbase-client-0.97.0-SNAPSHOT.jar>
> to
> /var/lib/jenkins/jobs/HBase-TRUNK/modules/org.apache.hbase$hbase-client/builds/2013-05-05_00-23-57/archive/org.apache.hbase/hbase-client/0.97.0-SNAPSHOT/hbase-client-0.97.0-SNAPSHOT.jar
> [JENKINS] Archiving <
> http://54.241.6.143/job/HBase-TRUNK/ws/hbase-client/target/hbase-client-0.97.0-SNAPSHOT-sources.jar>
> to
> /var/lib/jenkins/jobs/HBase-TRUNK/modules/org.apache.hbase$hbase-client/builds/2013-05-05_00-23-57/archive/org.apache.hbase/hbase-client/0.97.0-SNAPSHOT/hbase-client-0.97.0-SNAPSHOT-sources.jar
> [JENKINS] Archiving <
> http://54.241.6.143/job/HBase-TRUNK/ws/hbase-client/target/hbase-client-0.97.0-SNAPSHOT-tests.jar>
> to
> /var/lib/jenkins/jobs/HBase-TRUNK/modules/org.apache.hbase$hbase-client/builds/2013-05-05_00-23-57/archive/org.apache.hbase/hbase-client/0.97.0-SNAPSHOT/hbase-client-0.97.0-SNAPSHOT-tests.jar
> [JENKINS] Archiving <
> http://54.241.6.143/job/HBase-TRUNK/ws/hbase-prefix-tree/pom.xml> to
> /var/lib/jenkins/jobs/HBase-TRUNK/modules/org.apache.hbase$hbase-prefix-tree/builds/2013-05-05_00-23-57/archive/org.apache.hbase/hbase-prefix-tree/0.97.0-SNAPSHOT/hbase-prefix-tree-0.97.0-SNAPSHOT.pom
> [JENKINS] Archiving <
> http://54.241.6.143/job/HBase-TRUNK/ws/hbase-prefix-tree/target/hbase-prefix-tree-0.97.0-SNAPSHOT.jar>
> to
> /var/lib/jenkins/jobs/HBase-TRUNK/modules/org.apache.hbase$hbase-prefix-tree/builds/2013-05-05_00-23-57/archive/org.apache.hbase/hbase-prefix-tree/0.97.0-SNAPSHOT/hbase-prefix-tree-0.97.0-SNAPSHOT.jar
> [JENKINS] Archiving <
> http://54.241.6.143/job/HBase-TRUNK/ws/hbase-prefix-tree/target/hbase-prefix-tree-0.97.0-SNAPSHOT-sources.jar>
> to
> /var/lib/jenkins/jobs/HBase-TRUNK/modules/org.apache.hbase$hbase-prefix-tree/builds/2013-05-05_00-23-57/archive/org.apache.hbase/hbase-prefix-tree/0.97.0-SNAPSHOT/hbase-prefix-tree-0.97.0-SNAPSHOT-sources.jar
> [JENKINS] Archiving <
> http://54.241.6.143/job/HBase-TRUNK/ws/hbase-prefix-tree/target/hbase-prefix-tree-0.97.0-SNAPSHOT-tests.jar>
> to
> /var/lib/jenkins/jobs/HBase-TRUNK/modules/org.apache.hbase$hbase-prefix-tree/builds/2013-05-05_00-23-57/archive/org.apache.hbase/hbase-prefix-tree/0.97.0-SNAPSHOT/hbase-prefix-tree-0.97.0-SNAPSHOT-tests.jar
> [JENKINS] Archiving <
> http://54.241.6.143/job/HBase-TRUNK/ws/hbase-protocol/pom.xml> to
> /var/lib/jenkins/jobs/HBase-TRUNK/modules/org.apache.hbase$hbase-protocol/builds/2013-05-05_00-23-57/archive/org.apache.hbase/hbase-protocol/0.97.0-SNAPSHOT/hbase-protocol-0.97.0-SNAPSHOT.pom
> [JENKINS] Archiving <
> http://54.241.6.143/job/HBase-TRUNK/ws/hbase-protocol/target/hbase-protocol-0.97.0-SNAPSHOT.jar>
> to
> /var/lib/jenkins/jobs/HBase-TRUNK/modules/org.apache.hbase$hbase-protocol/builds/2013-05-05_00-23-57/archive/org.apache.hbase/hbase-protocol/0.97.0-SNAPSHOT/hbase-protocol-0.97.0-SNAPSHOT.jar
> [JENKINS] Archiving <
> http://54.241.6.143/job/HBase-TRUNK/ws/hbase-protocol/target/hbase-protocol-0.97.0-SNAPSHOT-sources.jar>
> to
> /var/lib/jenkins/jobs/HBase-TRUNK/modules/org.apache.hbase$hbase-protocol/builds/2013-05-05_00-23-57/archive/org.apache.hbase/hbase-protocol/0.97.0-SNAPSHOT/hbase-protocol-0.97.0-SNAPSHOT-sources.jar
> [JENKINS] Archiving <
> http://54.241.6.143/job/HBase-TRUNK/ws/hbase-protocol/target/hbase-protocol-0.97.0-SNAPSHOT-tests.jar>
> to
> /var/lib/jenkins/jobs/HBase-TRUNK/modules/org.apache.hbase$hbase-protocol/builds/2013-05-05_00-23-57/archive/org.apache.hbase/hbase-protocol/0.97.0-SNAPSHOT/hbase-protocol-0.97.0-SNAPSHOT-tests.jar
> [JENKINS] Archiving <
> http://54.241.6.143/job/HBase-TRUNK/ws/hbase-hadoop1-compat/pom.xml> to
> /var/lib/jenkins/jobs/HBase-TRUNK/modules/org.apache.hbase$hbase-hadoop1-compat/builds/2013-05-05_00-23-57/archive/org.apache.hbase/hbase-hadoop1-compat/0.97.0-SNAPSHOT/hbase-hadoop1-compat-0.97.0-SNAPSHOT.pom
> [JENKINS] Archiving <
> http://54.241.6.143/job/HBase-TRUNK/ws/hbase-hadoop1-compat/target/hbase-hadoop1-compat-0.97.0-SNAPSHOT.jar>
> to
> /var/lib/jenkins/jobs/HBase-TRUNK/modules/org.apache.hbase$hbase-hadoop1-compat/builds/2013-05-05_00-23-57/archive/org.apache.hbase/hbase-hadoop1-compat/0.97.0-SNAPSHOT/hbase-hadoop1-compat-0.97.0-SNAPSHOT.jar
> [JENKINS] Archiving <
> http://54.241.6.143/job/HBase-TRUNK/ws/hbase-hadoop1-compat/target/hbase-hadoop1-compat-0.97.0-SNAPSHOT-sources.jar>
> to
> /var/lib/jenkins/jobs/HBase-TRUNK/modules/org.apache.hbase$hbase-hadoop1-compat/builds/2013-05-05_00-23-57/archive/org.apache.hbase/hbase-hadoop1-compat/0.97.0-SNAPSHOT/hbase-hadoop1-compat-0.97.0-SNAPSHOT-sources.jar
> [JENKINS] Archiving <
> http://54.241.6.143/job/HBase-TRUNK/ws/hbase-hadoop1-compat/target/hbase-hadoop1-compat-0.97.0-SNAPSHOT-tests.jar>
> to
> /var/lib/jenkins/jobs/HBase-TRUNK/modules/org.apache.hbase$hbase-hadoop1-compat/builds/2013-05-05_00-23-57/archive/org.apache.hbase/hbase-hadoop1-compat/0.97.0-SNAPSHOT/hbase-hadoop1-compat-0.97.0-SNAPSHOT-tests.jar
> [JENKINS] Archiving <
> http://54.241.6.143/job/HBase-TRUNK/ws/hbase-server/pom.xml> to
> /var/lib/jenkins/jobs/HBase-TRUNK/modules/org.apache.hbase$hbase-server/builds/2013-05-05_00-23-57/archive/org.apache.hbase/hbase-server/0.97.0-SNAPSHOT/hbase-server-0.97.0-SNAPSHOT.pom
> Waiting for Jenkins to finish collecting data
> mavenExecutionResult exceptions not empty
> message : Failed to execute goal
> org.apache.maven.plugins:maven-surefire-plugin:2.12-TRUNK-HBASE-2:test
> (secondPartTestsExecution) on project hbase-server: Failure or timeout
> cause : Failure or timeout
> Stack trace :
> org.apache.maven.lifecycle.LifecycleExecutionException: Failed to execute
> goal org.apache.maven.plugins:maven-surefire-plugin:2.12-TRUNK-HBASE-2:test
> (secondPartTestsExecution) on project hbase-server: Failure or timeout
>         at
> org.apache.maven.lifecycle.internal.MojoExecutor.execute(MojoExecutor.java:217)
>         at
> org.apache.maven.lifecycle.internal.MojoExecutor.execute(MojoExecutor.java:153)
>         at
> org.apache.maven.lifecycle.internal.MojoExecutor.execute(MojoExecutor.java:145)
>         at
> org.apache.maven.lifecycle.internal.LifecycleModuleBuilder.buildProject(LifecycleModuleBuilder.java:84)
>         at
> org.apache.maven.lifecycle.internal.LifecycleModuleBuilder.buildProject(LifecycleModuleBuilder.java:59)
>         at
> org.apache.maven.lifecycle.internal.LifecycleStarter.singleThreadedBuild(LifecycleStarter.java:183)
>         at
> org.apache.maven.lifecycle.internal.LifecycleStarter.execute(LifecycleStarter.java:161)
>         at org.apache.maven.DefaultMaven.doExecute(DefaultMaven.java:320)
>         at org.apache.maven.DefaultMaven.execute(DefaultMaven.java:156)
>         at
> org.jvnet.hudson.maven3.launcher.Maven3Launcher.main(Maven3Launcher.java:79)
>         at sun.reflect.NativeMethodAccessorImpl.invoke0(Native Method)
>         at
> sun.reflect.NativeMethodAccessorImpl.invoke(NativeMethodAccessorImpl.java:39)
>         at
> sun.reflect.DelegatingMethodAccessorImpl.invoke(DelegatingMethodAccessorImpl.java:25)
>         at java.lang.reflect.Method.invoke(Method.java:597)
>         at
> org.codehaus.plexus.classworlds.launcher.Launcher.launchStandard(Launcher.java:329)
>         at
> org.codehaus.plexus.classworlds.launcher.Launcher.launch(Launcher.java:239)
>         at
> org.jvnet.hudson.maven3.agent.Maven3Main.launch(Maven3Main.java:158)
>         at hudson.maven.Maven3Builder.call(Maven3Builder.java:100)
>         at hudson.maven.Maven3Builder.call(Maven3Builder.java:66)
>         at hudson.remoting.UserRequest.perform(UserRequest.java:118)
>         at hudson.remoting.UserRequest.perform(UserRequest.java:48)
>         at hudson.remoting.Request$2.run(Request.java:326)
>         at
> hudson.remoting.InterceptingExecutorService$1.call(InterceptingExecutorService.java:72)
>         at
> java.util.concurrent.FutureTask$Sync.innerRun(FutureTask.java:303)
>         at java.util.concurrent.FutureTask.run(FutureTask.java:138)
>         at
> java.util.concurrent.ThreadPoolExecutor$Worker.runTask(ThreadPoolExecutor.java:895)
>         at
> java.util.concurrent.ThreadPoolExecutor$Worker.run(ThreadPoolExecutor.java:918)
>         at java.lang.Thread.run(Thread.java:662)
> Caused by: org.apache.maven.plugin.MojoExecutionException: Failure or
> timeout
>         at
> org.apache.maven.plugin.surefire.SurefirePlugin.assertNoFailureOrTimeout(SurefirePlugin.java:643)
>         at
> org.apache.maven.plugin.surefire.SurefirePlugin.handleSummary(SurefirePlugin.java:624)
>         at
> org.apache.maven.plugin.surefire.AbstractSurefireMojo.executeAfterPreconditionsChecked(AbstractSurefireMojo.java:137)
>         at
> org.apache.maven.plugin.surefire.AbstractSurefireMojo.execute(AbstractSurefireMojo.java:98)
>         at
> org.apache.maven.plugin.DefaultBuildPluginManager.executeMojo(DefaultBuildPluginManager.java:101)
>         at
> org.apache.maven.lifecycle.internal.MojoExecutor.execute(MojoExecutor.java:209)
>         ... 27 more
> channel stopped
>



-- 
// Jonathan Hsieh (shay)
// Software Engineer, Cloudera
// jon@cloudera.com

Mime
  • Unnamed multipart/alternative (inline, None, 0 bytes)
View raw message