hbase-dev mailing list archives

Site index · List index
Message view « Date » · « Thread »
Top « Date » · « Thread »
From Jonathan Hsieh <...@cloudera.com>
Subject Re: Build failed in Jenkins: HBase-TRUNK-Hadoop-2 #225
Date Wed, 08 May 2013 16:59:36 GMT
First one is new, we've seen draining server before.

< Running org.apache.hadoop.hbase.fs.TestBlockReorder
< Running org.apache.hadoop.hbase.mapreduce.TestImportTsv
< Running org.apache.hadoop.hbase.mapreduce.TestMultiTableInputFormat
< Running org.apache.hadoop.hbase.mapreduce.TestMultithreadedTableMapper
< Running org.apache.hadoop.hbase.mapreduce.TestTableInputFormatScan1
< Running org.apache.hadoop.hbase.mapreduce.TestTableInputFormatScan2
< Running org.apache.hadoop.hbase.mapreduce.TestTableMapReduce
< Running org.apache.hadoop.hbase.TestDrainingServer
< Running org.apache.hadoop.hbase.TestZooKeeper



On Wed, May 8, 2013 at 12:18 AM, <apurtell@apache.org> wrote:

> See <http://54.241.6.143/job/HBase-TRUNK-Hadoop-2/225/changes>
>
> Changes:
>
> [Michael Stack] Fixup how to maven release after my experience sitting by
> Lars -- there was a critical piece missing from the doc
>
> ------------------------------------------
> [...truncated 7592 lines...]
> Running org.apache.hadoop.hbase.client.TestSnapshotFromClient
> Tests run: 3, Failures: 0, Errors: 0, Skipped: 0, Time elapsed: 26.447 sec
> Tests run: 5, Failures: 0, Errors: 0, Skipped: 0, Time elapsed: 79.732 sec
> Running org.apache.hadoop.hbase.backup.TestHFileArchiving
> Tests run: 5, Failures: 0, Errors: 0, Skipped: 0, Time elapsed: 89.285 sec
> Running org.apache.hadoop.hbase.client.TestMultipleTimestamps
> Tests run: 8, Failures: 0, Errors: 0, Skipped: 0, Time elapsed: 24.467 sec
> Running org.apache.hadoop.hbase.client.TestClientScannerRPCTimeout
> Tests run: 1, Failures: 0, Errors: 0, Skipped: 0, Time elapsed: 23.2 sec
> Running org.apache.hadoop.hbase.client.TestScannersFromClientSide
> Tests run: 4, Failures: 0, Errors: 0, Skipped: 0, Time elapsed: 20.013 sec
> Running org.apache.hadoop.hbase.client.TestHTableMultiplexer
> Tests run: 1, Failures: 0, Errors: 0, Skipped: 0, Time elapsed: 15.649 sec
> Running org.apache.hadoop.hbase.client.TestFromClientSide3
> Tests run: 5, Failures: 0, Errors: 0, Skipped: 0, Time elapsed: 55.046 sec
> Running org.apache.hadoop.hbase.client.TestFromClientSide
> Running org.apache.hadoop.hbase.client.TestMultiParallel
> Running org.apache.hadoop.hbase.client.TestRestoreSnapshotFromClient
> Tests run: 11, Failures: 0, Errors: 0, Skipped: 0, Time elapsed: 101.824
> sec
> Tests run: 3, Failures: 0, Errors: 0, Skipped: 0, Time elapsed: 95.114 sec
> Tests run: 61, Failures: 0, Errors: 0, Skipped: 3, Time elapsed: 164.624
> sec
> Running org.apache.hadoop.hbase.client.replication.TestReplicationAdmin
> Tests run: 1, Failures: 0, Errors: 0, Skipped: 0, Time elapsed: 2.634 sec
> Running org.apache.hadoop.hbase.client.TestHTableUtil
> Tests run: 2, Failures: 0, Errors: 0, Skipped: 0, Time elapsed: 12.979 sec
> Running
> org.apache.hadoop.hbase.client.TestHTablePool$TestHTableReusablePool
> Tests run: 8, Failures: 0, Errors: 0, Skipped: 0, Time elapsed: 4.466 sec
> Running
> org.apache.hadoop.hbase.client.TestHTablePool$TestHTableThreadLocalPool
> Tests run: 8, Failures: 0, Errors: 0, Skipped: 0, Time elapsed: 22.354 sec
> Running org.apache.hadoop.hbase.client.TestScannerTimeout
> Tests run: 4, Failures: 0, Errors: 0, Skipped: 0, Time elapsed: 48.572 sec
> Running org.apache.hadoop.hbase.client.TestHCM
> Tests run: 13, Failures: 0, Errors: 0, Skipped: 0, Time elapsed: 36.329 sec
> Running org.apache.hadoop.hbase.client.TestAdmin
> Tests run: 43, Failures: 0, Errors: 0, Skipped: 0, Time elapsed: 204.202
> sec
> Running org.apache.hadoop.hbase.client.TestClientTimeouts
> Tests run: 1, Failures: 0, Errors: 0, Skipped: 0, Time elapsed: 18.096 sec
> Running org.apache.hadoop.hbase.client.TestSnapshotMetadata
> Tests run: 4, Failures: 0, Errors: 0, Skipped: 0, Time elapsed: 25.695 sec
> Running org.apache.hadoop.hbase.client.TestCloneSnapshotFromClient
> Tests run: 3, Failures: 0, Errors: 0, Skipped: 0, Time elapsed: 98.036 sec
> Running org.apache.hadoop.hbase.client.TestMetaScanner
> Tests run: 1, Failures: 0, Errors: 0, Skipped: 0, Time elapsed: 11.163 sec
> Running org.apache.hadoop.hbase.client.TestShell
> Tests run: 1, Failures: 0, Errors: 0, Skipped: 0, Time elapsed: 79.379 sec
> Running
> org.apache.hadoop.hbase.replication.regionserver.TestReplicationSink
> Tests run: 5, Failures: 0, Errors: 0, Skipped: 0, Time elapsed: 12.631 sec
> Running
> org.apache.hadoop.hbase.replication.regionserver.TestReplicationSourceManager
> Tests run: 3, Failures: 0, Errors: 0, Skipped: 0, Time elapsed: 2.297 sec
> Running
> org.apache.hadoop.hbase.replication.TestReplicationDisableInactivePeer
> Tests run: 1, Failures: 0, Errors: 0, Skipped: 0, Time elapsed: 33.106 sec
> Running org.apache.hadoop.hbase.replication.TestReplicationStateZKImpl
> Tests run: 2, Failures: 0, Errors: 0, Skipped: 0, Time elapsed: 1.714 sec
> Running org.apache.hadoop.hbase.client.TestFromClientSideWithCoprocessor
> Tests run: 61, Failures: 0, Errors: 0, Skipped: 3, Time elapsed: 154.918
> sec
> Running org.apache.hadoop.hbase.replication.TestReplicationQueueFailover
> Tests run: 1, Failures: 0, Errors: 0, Skipped: 0, Time elapsed: 113.534 sec
> Running org.apache.hadoop.hbase.replication.TestReplicationSource
> Tests run: 1, Failures: 0, Errors: 0, Skipped: 0, Time elapsed: 4.378 sec
> Running org.apache.hadoop.hbase.replication.TestReplicationZookeeper
> Tests run: 4, Failures: 0, Errors: 0, Skipped: 0, Time elapsed: 1.138 sec
> Running org.apache.hadoop.hbase.replication.TestMultiSlaveReplication
> Tests run: 1, Failures: 0, Errors: 0, Skipped: 0, Time elapsed: 25.074 sec
> Running org.apache.hadoop.hbase.replication.TestReplicationSmallTests
> Tests run: 8, Failures: 0, Errors: 0, Skipped: 0, Time elapsed: 82.553 sec
> Running org.apache.hadoop.hbase.replication.TestMasterReplication
> Tests run: 2, Failures: 0, Errors: 0, Skipped: 0, Time elapsed: 36.618 sec
> Running org.apache.hadoop.hbase.TestInfoServers
> Tests run: 3, Failures: 0, Errors: 0, Skipped: 0, Time elapsed: 10.857 sec
> Running org.apache.hadoop.hbase.TestLocalHBaseCluster
> Tests run: 1, Failures: 0, Errors: 0, Skipped: 0, Time elapsed: 8.619 sec
> Running org.apache.hadoop.hbase.rest.TestMultiRowResource
> Tests run: 3, Failures: 0, Errors: 0, Skipped: 0, Time elapsed: 12.572 sec
> Running org.apache.hadoop.hbase.TestMultiVersions
> Tests run: 3, Failures: 0, Errors: 0, Skipped: 0, Time elapsed: 16.631 sec
> Running org.apache.hadoop.hbase.rest.TestStatusResource
> Tests run: 2, Failures: 0, Errors: 0, Skipped: 0, Time elapsed: 10.927 sec
> Running org.apache.hadoop.hbase.rest.TestVersionResource
> Tests run: 7, Failures: 0, Errors: 0, Skipped: 0, Time elapsed: 10.498 sec
> Running
> org.apache.hadoop.hbase.replication.TestReplicationQueueFailoverCompressed
> Tests run: 1, Failures: 0, Errors: 0, Skipped: 0, Time elapsed: 89.888 sec
> Running org.apache.hadoop.hbase.rest.TestGzipFilter
> Tests run: 2, Failures: 0, Errors: 0, Skipped: 0, Time elapsed: 12.31 sec
> Running org.apache.hadoop.hbase.rest.TestScannersWithFilters
> Tests run: 10, Failures: 0, Errors: 0, Skipped: 0, Time elapsed: 17.774 sec
> Running org.apache.hadoop.hbase.rest.client.TestRemoteTable
> Tests run: 4, Failures: 0, Errors: 0, Skipped: 0, Time elapsed: 13.339 sec
> Running org.apache.hadoop.hbase.rest.client.TestRemoteAdmin
> Tests run: 5, Failures: 0, Errors: 0, Skipped: 0, Time elapsed: 16.853 sec
> Running org.apache.hadoop.hbase.rest.TestSchemaResource
> Tests run: 2, Failures: 0, Errors: 0, Skipped: 0, Time elapsed: 18.643 sec
> Running org.apache.hadoop.hbase.rest.TestRowResource
> Tests run: 12, Failures: 0, Errors: 0, Skipped: 0, Time elapsed: 16.04 sec
> Running org.apache.hadoop.hbase.ipc.TestDelayedRpc
> Tests run: 4, Failures: 0, Errors: 0, Skipped: 0, Time elapsed: 5.238 sec
> Running org.apache.hadoop.hbase.ipc.TestHBaseClient
> Tests run: 1, Failures: 0, Errors: 0, Skipped: 0, Time elapsed: 0.414 sec
> Running org.apache.hadoop.hbase.ipc.TestProtoBufRpc
> Tests run: 1, Failures: 0, Errors: 0, Skipped: 0, Time elapsed: 2.242 sec
> Running org.apache.hadoop.hbase.rest.TestScannerResource
> Tests run: 5, Failures: 0, Errors: 0, Skipped: 0, Time elapsed: 33.363 sec
> Running org.apache.hadoop.hbase.rest.TestTableResource
> Tests run: 8, Failures: 0, Errors: 0, Skipped: 0, Time elapsed: 29.414 sec
> Running org.apache.hadoop.hbase.TestGlobalMemStoreSize
> Tests run: 1, Failures: 0, Errors: 0, Skipped: 0, Time elapsed: 16.827 sec
> Running org.apache.hadoop.hbase.trace.TestHTraceHooks
> Tests run: 1, Failures: 0, Errors: 0, Skipped: 0, Time elapsed: 12.441 sec
> Running
> org.apache.hadoop.hbase.coprocessor.TestMasterCoprocessorExceptionWithAbort
> Tests run: 1, Failures: 0, Errors: 0, Skipped: 0, Time elapsed: 24.252 sec
> Running org.apache.hadoop.hbase.coprocessor.TestClassLoading
> Tests run: 8, Failures: 0, Errors: 0, Skipped: 0, Time elapsed: 30.456 sec
> Running
> org.apache.hadoop.hbase.coprocessor.TestRegionServerCoprocessorExceptionWithRemove
> Tests run: 1, Failures: 0, Errors: 0, Skipped: 0, Time elapsed: 16.7 sec
> Running org.apache.hadoop.hbase.coprocessor.TestRegionObserverBypass
> Tests run: 2, Failures: 0, Errors: 0, Skipped: 0, Time elapsed: 14.028 sec
> Running org.apache.hadoop.hbase.coprocessor.TestRegionObserverInterface
> Tests run: 7, Failures: 0, Errors: 0, Skipped: 0, Time elapsed: 29.835 sec
> Running org.apache.hadoop.hbase.coprocessor.TestRowProcessorEndpoint
> Tests run: 4, Failures: 0, Errors: 0, Skipped: 0, Time elapsed: 25.612 sec
> Running org.apache.hadoop.hbase.TestIOFencing
> Tests run: 2, Failures: 0, Errors: 0, Skipped: 0, Time elapsed: 80.849 sec
> Running org.apache.hadoop.hbase.coprocessor.TestAggregateProtocol
> Tests run: 45, Failures: 0, Errors: 0, Skipped: 0, Time elapsed: 15.694 sec
> Running org.apache.hadoop.hbase.coprocessor.TestBigDecimalColumnInterpreter
> Tests run: 38, Failures: 0, Errors: 0, Skipped: 0, Time elapsed: 14.375 sec
> Running
> org.apache.hadoop.hbase.coprocessor.TestRegionServerCoprocessorExceptionWithAbort
> Tests run: 1, Failures: 0, Errors: 0, Skipped: 0, Time elapsed: 16.483 sec
> Running
> org.apache.hadoop.hbase.coprocessor.TestMasterCoprocessorExceptionWithRemove
> Tests run: 1, Failures: 0, Errors: 0, Skipped: 0, Time elapsed: 13.83 sec
> Running org.apache.hadoop.hbase.coprocessor.TestWALObserver
> Tests run: 3, Failures: 0, Errors: 0, Skipped: 0, Time elapsed: 16.031 sec
> Running org.apache.hadoop.hbase.coprocessor.TestCoprocessorEndpoint
> Tests run: 6, Failures: 0, Errors: 0, Skipped: 0, Time elapsed: 11.333 sec
> Running org.apache.hadoop.hbase.coprocessor.TestMasterObserver
> Tests run: 4, Failures: 0, Errors: 0, Skipped: 0, Time elapsed: 34.732 sec
>
> Results :
>
> Failed tests:
> testSimpleCase(org.apache.hadoop.hbase.mapreduce.TestImportExport)
>   testWithFilter(org.apache.hadoop.hbase.mapreduce.TestImportExport)
>
> testExcludeAllFromMinorCompaction(org.apache.hadoop.hbase.mapreduce.TestHFileOutputFormat)
>
> Tests run: 1470, Failures: 3, Errors: 0, Skipped: 14
>
> [JENKINS] Recording test results
> [INFO]
> [INFO]
> ------------------------------------------------------------------------
> [INFO] Skipping HBase
> [INFO] This project has been banned from the build due to previous
> failures.
> [INFO]
> ------------------------------------------------------------------------
> [INFO]
> [INFO]
> ------------------------------------------------------------------------
> [INFO] Skipping HBase
> [INFO] This project has been banned from the build due to previous
> failures.
> [INFO]
> ------------------------------------------------------------------------
> [INFO]
> ------------------------------------------------------------------------
> [INFO] Reactor Summary:
> [INFO]
> [INFO] HBase ............................................. SUCCESS
> [54.064s]
> [INFO] HBase - Common .................................... SUCCESS
> [1:43.921s]
> [INFO] HBase - Protocol .................................. SUCCESS
> [17.448s]
> [INFO] HBase - Client .................................... SUCCESS
> [12.247s]
> [INFO] HBase - Prefix Tree ............................... SUCCESS [5.127s]
> [INFO] HBase - Hadoop Compatibility ...................... SUCCESS [1.358s]
> [INFO] HBase - Hadoop Two Compatibility .................. SUCCESS
> [16.438s]
> [INFO] HBase - Server .................................... FAILURE
> [53:46.143s]
> [INFO] HBase - Integration Tests ......................... SKIPPED
> [INFO] HBase - Examples .................................. SKIPPED
> [INFO] HBase - Assembly .................................. SKIPPED
> [INFO]
> ------------------------------------------------------------------------
> [INFO] BUILD FAILURE
> [INFO]
> ------------------------------------------------------------------------
> [INFO] Total time: 57:26.939s
> [INFO] Finished at: Wed May 08 07:18:19 UTC 2013
> [INFO] Final Memory: 135M/821M
> [INFO]
> ------------------------------------------------------------------------
> [JENKINS] Archiving <
> http://54.241.6.143/job/HBase-TRUNK-Hadoop-2/ws/hbase-hadoop2-compat/pom.xml>
> to
> /var/lib/jenkins/jobs/HBase-TRUNK-Hadoop-2/modules/org.apache.hbase$hbase-hadoop2-compat/builds/2013-05-08_06-20-40/archive/org.apache.hbase/hbase-hadoop2-compat/0.97.0-SNAPSHOT/hbase-hadoop2-compat-0.97.0-SNAPSHOT.pom
> [JENKINS] Archiving <
> http://54.241.6.143/job/HBase-TRUNK-Hadoop-2/ws/hbase-hadoop2-compat/target/hbase-hadoop2-compat-0.97.0-SNAPSHOT.jar>
> to
> /var/lib/jenkins/jobs/HBase-TRUNK-Hadoop-2/modules/org.apache.hbase$hbase-hadoop2-compat/builds/2013-05-08_06-20-40/archive/org.apache.hbase/hbase-hadoop2-compat/0.97.0-SNAPSHOT/hbase-hadoop2-compat-0.97.0-SNAPSHOT.jar
> [JENKINS] Archiving <
> http://54.241.6.143/job/HBase-TRUNK-Hadoop-2/ws/hbase-hadoop2-compat/target/hbase-hadoop2-compat-0.97.0-SNAPSHOT-sources.jar>
> to
> /var/lib/jenkins/jobs/HBase-TRUNK-Hadoop-2/modules/org.apache.hbase$hbase-hadoop2-compat/builds/2013-05-08_06-20-40/archive/org.apache.hbase/hbase-hadoop2-compat/0.97.0-SNAPSHOT/hbase-hadoop2-compat-0.97.0-SNAPSHOT-sources.jar
> [JENKINS] Archiving <
> http://54.241.6.143/job/HBase-TRUNK-Hadoop-2/ws/hbase-hadoop2-compat/target/hbase-hadoop2-compat-0.97.0-SNAPSHOT-tests.jar>
> to
> /var/lib/jenkins/jobs/HBase-TRUNK-Hadoop-2/modules/org.apache.hbase$hbase-hadoop2-compat/builds/2013-05-08_06-20-40/archive/org.apache.hbase/hbase-hadoop2-compat/0.97.0-SNAPSHOT/hbase-hadoop2-compat-0.97.0-SNAPSHOT-tests.jar
> [JENKINS] Archiving <
> http://54.241.6.143/job/HBase-TRUNK-Hadoop-2/ws/hbase-common/pom.xml> to
> /var/lib/jenkins/jobs/HBase-TRUNK-Hadoop-2/modules/org.apache.hbase$hbase-common/builds/2013-05-08_06-20-40/archive/org.apache.hbase/hbase-common/0.97.0-SNAPSHOT/hbase-common-0.97.0-SNAPSHOT.pom
> [JENKINS] Archiving <
> http://54.241.6.143/job/HBase-TRUNK-Hadoop-2/ws/hbase-common/target/hbase-common-0.97.0-SNAPSHOT.jar>
> to
> /var/lib/jenkins/jobs/HBase-TRUNK-Hadoop-2/modules/org.apache.hbase$hbase-common/builds/2013-05-08_06-20-40/archive/org.apache.hbase/hbase-common/0.97.0-SNAPSHOT/hbase-common-0.97.0-SNAPSHOT.jar
> [JENKINS] Archiving <
> http://54.241.6.143/job/HBase-TRUNK-Hadoop-2/ws/hbase-common/target/hbase-common-0.97.0-SNAPSHOT-sources.jar>
> to
> /var/lib/jenkins/jobs/HBase-TRUNK-Hadoop-2/modules/org.apache.hbase$hbase-common/builds/2013-05-08_06-20-40/archive/org.apache.hbase/hbase-common/0.97.0-SNAPSHOT/hbase-common-0.97.0-SNAPSHOT-sources.jar
> [JENKINS] Archiving <
> http://54.241.6.143/job/HBase-TRUNK-Hadoop-2/ws/hbase-common/target/hbase-common-0.97.0-SNAPSHOT-tests.jar>
> to
> /var/lib/jenkins/jobs/HBase-TRUNK-Hadoop-2/modules/org.apache.hbase$hbase-common/builds/2013-05-08_06-20-40/archive/org.apache.hbase/hbase-common/0.97.0-SNAPSHOT/hbase-common-0.97.0-SNAPSHOT-tests.jar
> [JENKINS] Archiving <
> http://54.241.6.143/job/HBase-TRUNK-Hadoop-2/ws/hbase-hadoop-compat/pom.xml>
> to
> /var/lib/jenkins/jobs/HBase-TRUNK-Hadoop-2/modules/org.apache.hbase$hbase-hadoop-compat/builds/2013-05-08_06-20-39/archive/org.apache.hbase/hbase-hadoop-compat/0.97.0-SNAPSHOT/hbase-hadoop-compat-0.97.0-SNAPSHOT.pom
> [JENKINS] Archiving <
> http://54.241.6.143/job/HBase-TRUNK-Hadoop-2/ws/hbase-hadoop-compat/target/hbase-hadoop-compat-0.97.0-SNAPSHOT.jar>
> to
> /var/lib/jenkins/jobs/HBase-TRUNK-Hadoop-2/modules/org.apache.hbase$hbase-hadoop-compat/builds/2013-05-08_06-20-39/archive/org.apache.hbase/hbase-hadoop-compat/0.97.0-SNAPSHOT/hbase-hadoop-compat-0.97.0-SNAPSHOT.jar
> [JENKINS] Archiving <
> http://54.241.6.143/job/HBase-TRUNK-Hadoop-2/ws/hbase-hadoop-compat/target/hbase-hadoop-compat-0.97.0-SNAPSHOT-sources.jar>
> to
> /var/lib/jenkins/jobs/HBase-TRUNK-Hadoop-2/modules/org.apache.hbase$hbase-hadoop-compat/builds/2013-05-08_06-20-39/archive/org.apache.hbase/hbase-hadoop-compat/0.97.0-SNAPSHOT/hbase-hadoop-compat-0.97.0-SNAPSHOT-sources.jar
> [JENKINS] Archiving <
> http://54.241.6.143/job/HBase-TRUNK-Hadoop-2/ws/hbase-hadoop-compat/target/hbase-hadoop-compat-0.97.0-SNAPSHOT-tests.jar>
> to
> /var/lib/jenkins/jobs/HBase-TRUNK-Hadoop-2/modules/org.apache.hbase$hbase-hadoop-compat/builds/2013-05-08_06-20-39/archive/org.apache.hbase/hbase-hadoop-compat/0.97.0-SNAPSHOT/hbase-hadoop-compat-0.97.0-SNAPSHOT-tests.jar
> [JENKINS] Archiving <
> http://54.241.6.143/job/HBase-TRUNK-Hadoop-2/ws/hbase-examples/pom.xml>
> to
> /var/lib/jenkins/jobs/HBase-TRUNK-Hadoop-2/modules/org.apache.hbase$hbase-examples/builds/2013-05-08_06-20-40/archive/org.apache.hbase/hbase-examples/0.97.0-SNAPSHOT/hbase-examples-0.97.0-SNAPSHOT.pom
> [JENKINS] Archiving <
> http://54.241.6.143/job/HBase-TRUNK-Hadoop-2/ws/hbase-it/pom.xml> to
> /var/lib/jenkins/jobs/HBase-TRUNK-Hadoop-2/modules/org.apache.hbase$hbase-it/builds/2013-05-08_06-20-40/archive/org.apache.hbase/hbase-it/0.97.0-SNAPSHOT/hbase-it-0.97.0-SNAPSHOT.pom
> [JENKINS] Archiving <
> http://54.241.6.143/job/HBase-TRUNK-Hadoop-2/ws/pom.xml> to
> /var/lib/jenkins/jobs/HBase-TRUNK-Hadoop-2/modules/org.apache.hbase$hbase/builds/2013-05-08_06-20-39/archive/org.apache.hbase/hbase/0.97.0-SNAPSHOT/hbase-0.97.0-SNAPSHOT.pom
> [JENKINS] Archiving <
> http://54.241.6.143/job/HBase-TRUNK-Hadoop-2/ws/target/hbase-0.97.0-SNAPSHOT-site.xml>
> to
> /var/lib/jenkins/jobs/HBase-TRUNK-Hadoop-2/modules/org.apache.hbase$hbase/builds/2013-05-08_06-20-39/archive/org.apache.hbase/hbase/0.97.0-SNAPSHOT/hbase-0.97.0-SNAPSHOT-site.xml
> [JENKINS] Archiving <
> http://54.241.6.143/job/HBase-TRUNK-Hadoop-2/ws/hbase-assembly/pom.xml>
> to
> /var/lib/jenkins/jobs/HBase-TRUNK-Hadoop-2/modules/org.apache.hbase$hbase-assembly/builds/2013-05-08_06-20-40/archive/org.apache.hbase/hbase-assembly/0.97.0-SNAPSHOT/hbase-assembly-0.97.0-SNAPSHOT.pom
> [JENKINS] Archiving <
> http://54.241.6.143/job/HBase-TRUNK-Hadoop-2/ws/hbase-client/pom.xml> to
> /var/lib/jenkins/jobs/HBase-TRUNK-Hadoop-2/modules/org.apache.hbase$hbase-client/builds/2013-05-08_06-20-39/archive/org.apache.hbase/hbase-client/0.97.0-SNAPSHOT/hbase-client-0.97.0-SNAPSHOT.pom
> [JENKINS] Archiving <
> http://54.241.6.143/job/HBase-TRUNK-Hadoop-2/ws/hbase-client/target/hbase-client-0.97.0-SNAPSHOT.jar>
> to
> /var/lib/jenkins/jobs/HBase-TRUNK-Hadoop-2/modules/org.apache.hbase$hbase-client/builds/2013-05-08_06-20-39/archive/org.apache.hbase/hbase-client/0.97.0-SNAPSHOT/hbase-client-0.97.0-SNAPSHOT.jar
> [JENKINS] Archiving <
> http://54.241.6.143/job/HBase-TRUNK-Hadoop-2/ws/hbase-client/target/hbase-client-0.97.0-SNAPSHOT-sources.jar>
> to
> /var/lib/jenkins/jobs/HBase-TRUNK-Hadoop-2/modules/org.apache.hbase$hbase-client/builds/2013-05-08_06-20-39/archive/org.apache.hbase/hbase-client/0.97.0-SNAPSHOT/hbase-client-0.97.0-SNAPSHOT-sources.jar
> [JENKINS] Archiving <
> http://54.241.6.143/job/HBase-TRUNK-Hadoop-2/ws/hbase-client/target/hbase-client-0.97.0-SNAPSHOT-tests.jar>
> to
> /var/lib/jenkins/jobs/HBase-TRUNK-Hadoop-2/modules/org.apache.hbase$hbase-client/builds/2013-05-08_06-20-39/archive/org.apache.hbase/hbase-client/0.97.0-SNAPSHOT/hbase-client-0.97.0-SNAPSHOT-tests.jar
> [JENKINS] Archiving <
> http://54.241.6.143/job/HBase-TRUNK-Hadoop-2/ws/hbase-prefix-tree/pom.xml>
> to
> /var/lib/jenkins/jobs/HBase-TRUNK-Hadoop-2/modules/org.apache.hbase$hbase-prefix-tree/builds/2013-05-08_06-20-40/archive/org.apache.hbase/hbase-prefix-tree/0.97.0-SNAPSHOT/hbase-prefix-tree-0.97.0-SNAPSHOT.pom
> [JENKINS] Archiving <
> http://54.241.6.143/job/HBase-TRUNK-Hadoop-2/ws/hbase-prefix-tree/target/hbase-prefix-tree-0.97.0-SNAPSHOT.jar>
> to
> /var/lib/jenkins/jobs/HBase-TRUNK-Hadoop-2/modules/org.apache.hbase$hbase-prefix-tree/builds/2013-05-08_06-20-40/archive/org.apache.hbase/hbase-prefix-tree/0.97.0-SNAPSHOT/hbase-prefix-tree-0.97.0-SNAPSHOT.jar
> [JENKINS] Archiving <
> http://54.241.6.143/job/HBase-TRUNK-Hadoop-2/ws/hbase-prefix-tree/target/hbase-prefix-tree-0.97.0-SNAPSHOT-sources.jar>
> to
> /var/lib/jenkins/jobs/HBase-TRUNK-Hadoop-2/modules/org.apache.hbase$hbase-prefix-tree/builds/2013-05-08_06-20-40/archive/org.apache.hbase/hbase-prefix-tree/0.97.0-SNAPSHOT/hbase-prefix-tree-0.97.0-SNAPSHOT-sources.jar
> [JENKINS] Archiving <
> http://54.241.6.143/job/HBase-TRUNK-Hadoop-2/ws/hbase-prefix-tree/target/hbase-prefix-tree-0.97.0-SNAPSHOT-tests.jar>
> to
> /var/lib/jenkins/jobs/HBase-TRUNK-Hadoop-2/modules/org.apache.hbase$hbase-prefix-tree/builds/2013-05-08_06-20-40/archive/org.apache.hbase/hbase-prefix-tree/0.97.0-SNAPSHOT/hbase-prefix-tree-0.97.0-SNAPSHOT-tests.jar
> [JENKINS] Archiving <
> http://54.241.6.143/job/HBase-TRUNK-Hadoop-2/ws/hbase-protocol/pom.xml>
> to
> /var/lib/jenkins/jobs/HBase-TRUNK-Hadoop-2/modules/org.apache.hbase$hbase-protocol/builds/2013-05-08_06-20-39/archive/org.apache.hbase/hbase-protocol/0.97.0-SNAPSHOT/hbase-protocol-0.97.0-SNAPSHOT.pom
> [JENKINS] Archiving <
> http://54.241.6.143/job/HBase-TRUNK-Hadoop-2/ws/hbase-protocol/target/hbase-protocol-0.97.0-SNAPSHOT.jar>
> to
> /var/lib/jenkins/jobs/HBase-TRUNK-Hadoop-2/modules/org.apache.hbase$hbase-protocol/builds/2013-05-08_06-20-39/archive/org.apache.hbase/hbase-protocol/0.97.0-SNAPSHOT/hbase-protocol-0.97.0-SNAPSHOT.jar
> [JENKINS] Archiving <
> http://54.241.6.143/job/HBase-TRUNK-Hadoop-2/ws/hbase-protocol/target/hbase-protocol-0.97.0-SNAPSHOT-sources.jar>
> to
> /var/lib/jenkins/jobs/HBase-TRUNK-Hadoop-2/modules/org.apache.hbase$hbase-protocol/builds/2013-05-08_06-20-39/archive/org.apache.hbase/hbase-protocol/0.97.0-SNAPSHOT/hbase-protocol-0.97.0-SNAPSHOT-sources.jar
> [JENKINS] Archiving <
> http://54.241.6.143/job/HBase-TRUNK-Hadoop-2/ws/hbase-protocol/target/hbase-protocol-0.97.0-SNAPSHOT-tests.jar>
> to
> /var/lib/jenkins/jobs/HBase-TRUNK-Hadoop-2/modules/org.apache.hbase$hbase-protocol/builds/2013-05-08_06-20-39/archive/org.apache.hbase/hbase-protocol/0.97.0-SNAPSHOT/hbase-protocol-0.97.0-SNAPSHOT-tests.jar
> [JENKINS] Archiving <
> http://54.241.6.143/job/HBase-TRUNK-Hadoop-2/ws/hbase-server/pom.xml> to
> /var/lib/jenkins/jobs/HBase-TRUNK-Hadoop-2/modules/org.apache.hbase$hbase-server/builds/2013-05-08_06-20-39/archive/org.apache.hbase/hbase-server/0.97.0-SNAPSHOT/hbase-server-0.97.0-SNAPSHOT.pom
> Waiting for Jenkins to finish collecting data
> mavenExecutionResult exceptions not empty
> message : Failed to execute goal
> org.apache.maven.plugins:maven-surefire-plugin:2.12-TRUNK-HBASE-2:test
> (secondPartTestsExecution) on project hbase-server: Failure or timeout
> cause : Failure or timeout
> Stack trace :
> org.apache.maven.lifecycle.LifecycleExecutionException: Failed to execute
> goal org.apache.maven.plugins:maven-surefire-plugin:2.12-TRUNK-HBASE-2:test
> (secondPartTestsExecution) on project hbase-server: Failure or timeout
>         at
> org.apache.maven.lifecycle.internal.MojoExecutor.execute(MojoExecutor.java:217)
>         at
> org.apache.maven.lifecycle.internal.MojoExecutor.execute(MojoExecutor.java:153)
>         at
> org.apache.maven.lifecycle.internal.MojoExecutor.execute(MojoExecutor.java:145)
>         at
> org.apache.maven.lifecycle.internal.LifecycleModuleBuilder.buildProject(LifecycleModuleBuilder.java:84)
>         at
> org.apache.maven.lifecycle.internal.LifecycleModuleBuilder.buildProject(LifecycleModuleBuilder.java:59)
>         at
> org.apache.maven.lifecycle.internal.LifecycleStarter.singleThreadedBuild(LifecycleStarter.java:183)
>         at
> org.apache.maven.lifecycle.internal.LifecycleStarter.execute(LifecycleStarter.java:161)
>         at org.apache.maven.DefaultMaven.doExecute(DefaultMaven.java:320)
>         at org.apache.maven.DefaultMaven.execute(DefaultMaven.java:156)
>         at
> org.jvnet.hudson.maven3.launcher.Maven3Launcher.main(Maven3Launcher.java:79)
>         at sun.reflect.NativeMethodAccessorImpl.invoke0(Native Method)
>         at
> sun.reflect.NativeMethodAccessorImpl.invoke(NativeMethodAccessorImpl.java:39)
>         at
> sun.reflect.DelegatingMethodAccessorImpl.invoke(DelegatingMethodAccessorImpl.java:25)
>         at java.lang.reflect.Method.invoke(Method.java:597)
>         at
> org.codehaus.plexus.classworlds.launcher.Launcher.launchStandard(Launcher.java:329)
>         at
> org.codehaus.plexus.classworlds.launcher.Launcher.launch(Launcher.java:239)
>         at
> org.jvnet.hudson.maven3.agent.Maven3Main.launch(Maven3Main.java:158)
>         at hudson.maven.Maven3Builder.call(Maven3Builder.java:100)
>         at hudson.maven.Maven3Builder.call(Maven3Builder.java:66)
>         at hudson.remoting.UserRequest.perform(UserRequest.java:118)
>         at hudson.remoting.UserRequest.perform(UserRequest.java:48)
>         at hudson.remoting.Request$2.run(Request.java:326)
>         at
> hudson.remoting.InterceptingExecutorService$1.call(InterceptingExecutorService.java:72)
>         at
> java.util.concurrent.FutureTask$Sync.innerRun(FutureTask.java:303)
>         at java.util.concurrent.FutureTask.run(FutureTask.java:138)
>         at
> java.util.concurrent.ThreadPoolExecutor$Worker.runTask(ThreadPoolExecutor.java:895)
>         at
> java.util.concurrent.ThreadPoolExecutor$Worker.run(ThreadPoolExecutor.java:918)
>         at java.lang.Thread.run(Thread.java:662)
> Caused by: org.apache.maven.plugin.MojoExecutionException: Failure or
> timeout
>         at
> org.apache.maven.plugin.surefire.SurefirePlugin.assertNoFailureOrTimeout(SurefirePlugin.java:643)
>         at
> org.apache.maven.plugin.surefire.SurefirePlugin.handleSummary(SurefirePlugin.java:624)
>         at
> org.apache.maven.plugin.surefire.AbstractSurefireMojo.executeAfterPreconditionsChecked(AbstractSurefireMojo.java:137)
>         at
> org.apache.maven.plugin.surefire.AbstractSurefireMojo.execute(AbstractSurefireMojo.java:98)
>         at
> org.apache.maven.plugin.DefaultBuildPluginManager.executeMojo(DefaultBuildPluginManager.java:101)
>         at
> org.apache.maven.lifecycle.internal.MojoExecutor.execute(MojoExecutor.java:209)
>         ... 27 more
> channel stopped
>



-- 
// Jonathan Hsieh (shay)
// Software Engineer, Cloudera
// jon@cloudera.com

Mime
  • Unnamed multipart/alternative (inline, None, 0 bytes)
View raw message