hbase-dev mailing list archives

Site index · List index
Message view « Date » · « Thread »
Top « Date » · « Thread »
From Apache Jenkins Server <jenk...@builds.apache.org>
Subject Build failed in Jenkins: HBase-0.94 #992
Date Tue, 21 May 2013 11:10:23 GMT
See <https://builds.apache.org/job/HBase-0.94/992/changes>

Changes:

[larsh] HBASE-8282 User triggered flushes does not allow compaction to get triggered even
if compaction criteria is met (Ram)

------------------------------------------
[...truncated 6001 lines...]
Running org.apache.hadoop.hbase.coprocessor.TestRegionObserverScannerOpenHook
Tests run: 1, Failures: 0, Errors: 0, Skipped: 0, Time elapsed: 22.084 sec
Running org.apache.hadoop.hbase.coprocessor.TestClassLoading
Tests run: 8, Failures: 0, Errors: 0, Skipped: 0, Time elapsed: 50.641 sec
Running org.apache.hadoop.hbase.coprocessor.TestAggregateProtocol
Tests run: 45, Failures: 0, Errors: 0, Skipped: 0, Time elapsed: 29.899 sec
Running org.apache.hadoop.hbase.coprocessor.TestRegionServerCoprocessorExceptionWithAbort
Tests run: 1, Failures: 0, Errors: 0, Skipped: 0, Time elapsed: 32.046 sec
Running org.apache.hadoop.hbase.coprocessor.TestRegionServerCoprocessorExceptionWithRemove
Tests run: 1, Failures: 0, Errors: 0, Skipped: 0, Time elapsed: 37.118 sec
Running org.apache.hadoop.hbase.coprocessor.TestWALObserver
Tests run: 3, Failures: 0, Errors: 0, Skipped: 0, Time elapsed: 30.571 sec
Running org.apache.hadoop.hbase.coprocessor.TestCoprocessorEndpoint
Tests run: 4, Failures: 0, Errors: 0, Skipped: 1, Time elapsed: 39.475 sec
Running org.apache.hadoop.hbase.coprocessor.TestMasterCoprocessorExceptionWithAbort
Tests run: 1, Failures: 0, Errors: 0, Skipped: 0, Time elapsed: 33.54 sec
Running org.apache.hadoop.hbase.coprocessor.TestMasterObserver
Tests run: 4, Failures: 0, Errors: 0, Skipped: 0, Time elapsed: 63.405 sec
Running org.apache.hadoop.hbase.coprocessor.example.TestZooKeeperScanPolicyObserver
Tests run: 1, Failures: 0, Errors: 0, Skipped: 0, Time elapsed: 20.742 sec
Running org.apache.hadoop.hbase.coprocessor.TestMasterCoprocessorExceptionWithRemove
Tests run: 1, Failures: 0, Errors: 0, Skipped: 0, Time elapsed: 25.319 sec
Running org.apache.hadoop.hbase.coprocessor.TestBigDecimalColumnInterpreter
Tests run: 38, Failures: 0, Errors: 0, Skipped: 0, Time elapsed: 23.652 sec
Running org.apache.hadoop.hbase.coprocessor.example.TestBulkDeleteProtocol
Tests run: 8, Failures: 0, Errors: 0, Skipped: 0, Time elapsed: 47.94 sec
Running org.apache.hadoop.hbase.coprocessor.TestRegionObserverBypass
Tests run: 2, Failures: 0, Errors: 0, Skipped: 0, Time elapsed: 20.715 sec
Running org.apache.hadoop.hbase.coprocessor.TestRegionObserverInterface
Tests run: 7, Failures: 0, Errors: 0, Skipped: 0, Time elapsed: 54.867 sec
Running org.apache.hadoop.hbase.procedure.TestZKProcedureControllers
Tests run: 4, Failures: 0, Errors: 0, Skipped: 0, Time elapsed: 5.108 sec
Running org.apache.hadoop.hbase.procedure.TestZKProcedure
Tests run: 4, Failures: 0, Errors: 0, Skipped: 0, Time elapsed: 3.108 sec
Running org.apache.hadoop.hbase.mapred.TestTableInputFormat
Tests run: 10, Failures: 0, Errors: 0, Skipped: 0, Time elapsed: 50.317 sec
Running org.apache.hadoop.hbase.TestGlobalMemStoreSize
Tests run: 1, Failures: 0, Errors: 0, Skipped: 0, Time elapsed: 35.628 sec
Running org.apache.hadoop.hbase.mapreduce.TestHLogRecordReader
Tests run: 2, Failures: 0, Errors: 0, Skipped: 0, Time elapsed: 20.762 sec
Running org.apache.hadoop.hbase.mapred.TestTableMapReduce
Tests run: 1, Failures: 0, Errors: 0, Skipped: 0, Time elapsed: 154.066 sec
Running org.apache.hadoop.hbase.mapreduce.TestLoadIncrementalHFilesSplitRecovery
Tests run: 4, Failures: 0, Errors: 0, Skipped: 0, Time elapsed: 160.557 sec
Running org.apache.hadoop.hbase.mapreduce.TestTableMapReduce
Tests run: 1, Failures: 0, Errors: 0, Skipped: 0, Time elapsed: 213.572 sec
Running org.apache.hadoop.hbase.mapreduce.TestWALPlayer
Tests run: 1, Failures: 0, Errors: 0, Skipped: 0, Time elapsed: 91.762 sec
Running org.apache.hadoop.hbase.mapreduce.TestTableInputFormatScan1
Tests run: 5, Failures: 0, Errors: 0, Skipped: 0, Time elapsed: 459.542 sec
Running org.apache.hadoop.hbase.mapreduce.TestMultithreadedTableMapper
Tests run: 1, Failures: 0, Errors: 0, Skipped: 0, Time elapsed: 184.08 sec
Running org.apache.hadoop.hbase.mapreduce.TestImportTsv
Tests run: 13, Failures: 0, Errors: 0, Skipped: 0, Time elapsed: 430.082 sec
Running org.apache.hadoop.hbase.mapreduce.TestHFileOutputFormat
Tests run: 10, Failures: 0, Errors: 0, Skipped: 0, Time elapsed: 621.996 sec
Running org.apache.hadoop.hbase.mapreduce.TestTimeRangeMapRed
Tests run: 1, Failures: 0, Errors: 0, Skipped: 0, Time elapsed: 84.851 sec
Running org.apache.hadoop.hbase.mapreduce.TestLoadIncrementalHFiles
Tests run: 7, Failures: 0, Errors: 0, Skipped: 0, Time elapsed: 84.037 sec
Running org.apache.hadoop.hbase.mapreduce.TestMultiTableInputFormat
Tests run: 5, Failures: 0, Errors: 0, Skipped: 0, Time elapsed: 584.577 sec
Running org.apache.hadoop.hbase.mapreduce.TestImportExport
Tests run: 4, Failures: 0, Errors: 0, Skipped: 0, Time elapsed: 155.778 sec
Running org.apache.hadoop.hbase.snapshot.TestSnapshotDescriptionUtils
Tests run: 2, Failures: 0, Errors: 0, Skipped: 0, Time elapsed: 0.513 sec
Running org.apache.hadoop.hbase.snapshot.TestExportSnapshot
Tests run: 4, Failures: 0, Errors: 0, Skipped: 0, Time elapsed: 97.942 sec
Running org.apache.hadoop.hbase.TestAcidGuarantees
Tests run: 3, Failures: 0, Errors: 0, Skipped: 0, Time elapsed: 160.194 sec
Running org.apache.hadoop.hbase.thrift2.TestThriftHBaseServiceHandler
Tests run: 12, Failures: 0, Errors: 0, Skipped: 0, Time elapsed: 34.49 sec
Running org.apache.hadoop.hbase.catalog.TestMetaReaderEditorNoCluster
Tests run: 1, Failures: 0, Errors: 0, Skipped: 0, Time elapsed: 5.111 sec
Running org.apache.hadoop.hbase.snapshot.TestFlushSnapshotFromClient
Tests run: 5, Failures: 0, Errors: 0, Skipped: 0, Time elapsed: 104.138 sec
Running org.apache.hadoop.hbase.catalog.TestCatalogTracker
Tests run: 10, Failures: 0, Errors: 0, Skipped: 1, Time elapsed: 9.924 sec
Running org.apache.hadoop.hbase.catalog.TestMetaReaderEditor
Tests run: 5, Failures: 0, Errors: 0, Skipped: 0, Time elapsed: 67.74 sec
Running org.apache.hadoop.hbase.client.TestTimestampsFilter
Tests run: 3, Failures: 0, Errors: 0, Skipped: 0, Time elapsed: 42.376 sec
Running org.apache.hadoop.hbase.client.TestFromClientSide3
Tests run: 1, Failures: 0, Errors: 0, Skipped: 0, Time elapsed: 52.375 sec
Running org.apache.hadoop.hbase.mapreduce.TestTableInputFormatScan2
Tests run: 7, Failures: 0, Errors: 0, Skipped: 0, Time elapsed: 581.789 sec
Running org.apache.hadoop.hbase.client.TestHCM
Tests run: 8, Failures: 0, Errors: 0, Skipped: 0, Time elapsed: 55.933 sec
Running org.apache.hadoop.hbase.client.TestShell
Tests run: 1, Failures: 0, Errors: 0, Skipped: 0, Time elapsed: 162.536 sec
Running org.apache.hadoop.hbase.snapshot.TestRestoreFlushSnapshotFromClient
Tests run: 5, Failures: 0, Errors: 0, Skipped: 0, Time elapsed: 411.611 sec
Running org.apache.hadoop.hbase.client.TestScannerTimeout
Tests run: 4, Failures: 0, Errors: 0, Skipped: 0, Time elapsed: 64.337 sec
Running org.apache.hadoop.hbase.client.TestHTableUtil
Tests run: 2, Failures: 0, Errors: 0, Skipped: 0, Time elapsed: 19.501 sec
Running org.apache.hadoop.hbase.client.TestMetaScanner
Tests run: 2, Failures: 0, Errors: 0, Skipped: 0, Time elapsed: 72.37 sec
Running org.apache.hadoop.hbase.client.TestFromClientSide
Tests run: 59, Failures: 0, Errors: 0, Skipped: 3, Time elapsed: 288.505 sec
Running org.apache.hadoop.hbase.client.TestMetaMigrationRemovingHTD
Tests run: 3, Failures: 0, Errors: 0, Skipped: 0, Time elapsed: 48.619 sec
Running org.apache.hadoop.hbase.client.TestHTablePool$TestHTableReusablePool
Tests run: 8, Failures: 0, Errors: 0, Skipped: 0, Time elapsed: 6.641 sec
Running org.apache.hadoop.hbase.client.TestSnapshotFromClient
Tests run: 3, Failures: 0, Errors: 0, Skipped: 0, Time elapsed: 38.708 sec
Running org.apache.hadoop.hbase.client.TestHTablePool$TestHTableThreadLocalPool
Tests run: 8, Failures: 0, Errors: 0, Skipped: 0, Time elapsed: 36.001 sec
Running org.apache.hadoop.hbase.client.replication.TestReplicationAdmin
Tests run: 1, Failures: 0, Errors: 0, Skipped: 0, Time elapsed: 1.667 sec
Running org.apache.hadoop.hbase.client.TestMultipleTimestamps
Tests run: 8, Failures: 0, Errors: 0, Skipped: 0, Time elapsed: 47.39 sec
Running org.apache.hadoop.hbase.client.TestHConnection
Tests run: 2, Failures: 0, Errors: 0, Skipped: 0, Time elapsed: 47.524 sec
Running org.apache.hadoop.hbase.client.TestMultiParallel
Tests run: 11, Failures: 0, Errors: 0, Skipped: 0, Time elapsed: 94.137 sec
Running org.apache.hadoop.hbase.client.TestFromClientSideWithCoprocessor
Tests run: 59, Failures: 0, Errors: 1, Skipped: 3, Time elapsed: 322.428 sec <<<
FAILURE!
Running org.apache.hadoop.hbase.metrics.TestMetricsMBeanBase
Tests run: 3, Failures: 0, Errors: 0, Skipped: 0, Time elapsed: 1.292 sec
Running org.apache.hadoop.hbase.constraint.TestConstraint
Tests run: 5, Failures: 0, Errors: 0, Skipped: 0, Time elapsed: 47.578 sec
Running org.apache.hadoop.hbase.rest.TestGzipFilter
Tests run: 3, Failures: 0, Errors: 0, Skipped: 0, Time elapsed: 34.525 sec
Running org.apache.hadoop.hbase.rest.TestMultiRowResource
Tests run: 3, Failures: 0, Errors: 0, Skipped: 0, Time elapsed: 30.547 sec
Running org.apache.hadoop.hbase.rest.TestScannersWithFilters
Tests run: 10, Failures: 0, Errors: 0, Skipped: 0, Time elapsed: 35.27 sec
Running org.apache.hadoop.hbase.rest.TestRowResource
Tests run: 11, Failures: 0, Errors: 0, Skipped: 0, Time elapsed: 31.172 sec
Running org.apache.hadoop.hbase.client.TestAdmin
Tests run: 42, Failures: 0, Errors: 0, Skipped: 0, Time elapsed: 240.232 sec
Running org.apache.hadoop.hbase.client.TestRestoreSnapshotFromClient
Tests run: 3, Failures: 0, Errors: 0, Skipped: 0, Time elapsed: 459.602 sec
Running org.apache.hadoop.hbase.rest.client.TestRemoteTable
Tests run: 4, Failures: 0, Errors: 0, Skipped: 0, Time elapsed: 25.648 sec
Running org.apache.hadoop.hbase.rest.client.TestRemoteAdmin
Tests run: 5, Failures: 0, Errors: 0, Skipped: 0, Time elapsed: 29.329 sec
Running org.apache.hadoop.hbase.rest.TestVersionResource
Tests run: 7, Failures: 0, Errors: 0, Skipped: 0, Time elapsed: 20.7 sec
Running org.apache.hadoop.hbase.rest.TestStatusResource
Tests run: 2, Failures: 0, Errors: 0, Skipped: 0, Time elapsed: 19.079 sec
Running org.apache.hadoop.hbase.rest.TestScannerResource
Running org.apache.hadoop.hbase.rest.TestTableResource
Tests run: 5, Failures: 0, Errors: 0, Skipped: 0, Time elapsed: 39.654 sec
Tests run: 8, Failures: 0, Errors: 0, Skipped: 0, Time elapsed: 37.237 sec
Running org.apache.hadoop.hbase.rest.TestSchemaResource
Tests run: 2, Failures: 0, Errors: 0, Skipped: 0, Time elapsed: 28.64 sec
Running org.apache.hadoop.hbase.client.TestCloneSnapshotFromClient
Tests run: 3, Failures: 0, Errors: 0, Skipped: 0, Time elapsed: 358.235 sec
Running org.apache.hadoop.hbase.io.encoding.TestLoadAndSwitchEncodeOnDisk
Tests run: 1, Failures: 0, Errors: 0, Skipped: 0, Time elapsed: 39.213 sec
Running org.apache.hadoop.hbase.thrift.TestThriftServer
Tests run: 1, Failures: 0, Errors: 0, Skipped: 0, Time elapsed: 62.676 sec
Running org.apache.hadoop.hbase.io.encoding.TestUpgradeFromHFileV1ToEncoding
Tests run: 1, Failures: 0, Errors: 0, Skipped: 0, Time elapsed: 123.207 sec
Running org.apache.hadoop.hbase.io.hfile.TestHFileSeek
Tests run: 1, Failures: 0, Errors: 0, Skipped: 0, Time elapsed: 5.695 sec
Running org.apache.hadoop.hbase.io.encoding.TestDataBlockEncoders
Tests run: 12, Failures: 0, Errors: 0, Skipped: 0, Time elapsed: 137.946 sec
Running org.apache.hadoop.hbase.io.hfile.slab.TestSlabCache
Tests run: 7, Failures: 0, Errors: 0, Skipped: 0, Time elapsed: 21.148 sec
Running org.apache.hadoop.hbase.io.hfile.TestChecksum
Tests run: 3, Failures: 0, Errors: 0, Skipped: 0, Time elapsed: 0.84 sec
Running org.apache.hadoop.hbase.io.hfile.TestHFileBlockIndex
Tests run: 10, Failures: 0, Errors: 0, Skipped: 0, Time elapsed: 10.021 sec
Running org.apache.hadoop.hbase.io.hfile.slab.TestSingleSizeCache
Tests run: 5, Failures: 0, Errors: 0, Skipped: 0, Time elapsed: 27.482 sec
Running org.apache.hadoop.hbase.io.hfile.TestLruBlockCache
Tests run: 16, Failures: 0, Errors: 0, Skipped: 0, Time elapsed: 0.872 sec
Running org.apache.hadoop.hbase.io.hfile.TestFixedFileTrailer
Tests run: 2, Failures: 0, Errors: 0, Skipped: 0, Time elapsed: 0.542 sec
Running org.apache.hadoop.hbase.io.hfile.TestHFileBlockCompatibility
Tests run: 10, Failures: 0, Errors: 0, Skipped: 0, Time elapsed: 1.002 sec
Running org.apache.hadoop.hbase.io.hfile.TestHFilePerformance
Tests run: 1, Failures: 0, Errors: 0, Skipped: 0, Time elapsed: 6.52 sec
Running org.apache.hadoop.hbase.io.hfile.TestHFileBlock
Tests run: 16, Failures: 0, Errors: 0, Skipped: 0, Time elapsed: 51.622 sec
Running org.apache.hadoop.hbase.io.hfile.TestForceCacheImportantBlocks
Tests run: 4, Failures: 0, Errors: 0, Skipped: 0, Time elapsed: 67.938 sec
Running org.apache.hadoop.hbase.io.hfile.TestCacheOnWrite
Tests run: 36, Failures: 0, Errors: 0, Skipped: 0, Time elapsed: 33.83 sec
Running org.apache.hadoop.hbase.io.TestFileLink
Tests run: 3, Failures: 0, Errors: 0, Skipped: 0, Time elapsed: 36.919 sec
Running org.apache.hadoop.hbase.TestClusterBootOrder
Tests run: 2, Failures: 0, Errors: 0, Skipped: 0, Time elapsed: 64.142 sec
Running org.apache.hadoop.hbase.avro.TestAvroServer
Tests run: 3, Failures: 0, Errors: 0, Skipped: 0, Time elapsed: 52.176 sec
Running org.apache.hadoop.hbase.io.encoding.TestChangingEncoding
Tests run: 4, Failures: 0, Errors: 0, Skipped: 0, Time elapsed: 380.801 sec
Running org.apache.hadoop.hbase.replication.regionserver.TestReplicationSourceManager
Tests run: 3, Failures: 0, Errors: 0, Skipped: 0, Time elapsed: 2.922 sec
Running org.apache.hadoop.hbase.replication.TestMultiSlaveReplication
Tests run: 1, Failures: 0, Errors: 0, Skipped: 0, Time elapsed: 69.253 sec
Running org.apache.hadoop.hbase.replication.regionserver.TestReplicationSink
Tests run: 5, Failures: 0, Errors: 0, Skipped: 0, Time elapsed: 26.323 sec
Running org.apache.hadoop.hbase.replication.TestReplicationSource
Tests run: 1, Failures: 0, Errors: 0, Skipped: 0, Time elapsed: 5.351 sec
Running org.apache.hadoop.hbase.replication.TestReplicationDisableInactivePeer
Tests run: 1, Failures: 0, Errors: 0, Skipped: 0, Time elapsed: 109.273 sec
Running org.apache.hadoop.hbase.replication.TestReplicationZookeeper
Tests run: 1, Failures: 0, Errors: 0, Skipped: 0, Time elapsed: 0.982 sec
Running org.apache.hadoop.hbase.thrift.TestThriftServerCmdLine
Tests run: 20, Failures: 0, Errors: 0, Skipped: 0, Time elapsed: 504.161 sec
Running org.apache.hadoop.hbase.replication.TestMasterReplication
Tests run: 2, Failures: 0, Errors: 0, Skipped: 0, Time elapsed: 118.201 sec
Running org.apache.hadoop.hbase.ipc.TestDelayedRpc
Tests run: 4, Failures: 0, Errors: 0, Skipped: 0, Time elapsed: 2.932 sec
Running org.apache.hadoop.hbase.ipc.TestPBOnWritableRpc
Tests run: 1, Failures: 0, Errors: 0, Skipped: 0, Time elapsed: 0.975 sec
Running org.apache.hadoop.hbase.replication.TestReplicationQueueFailover
Tests run: 1, Failures: 0, Errors: 0, Skipped: 0, Time elapsed: 107.952 sec
Running org.apache.hadoop.hbase.replication.TestReplicationQueueFailoverCompressed
Tests run: 1, Failures: 0, Errors: 0, Skipped: 0, Time elapsed: 102.979 sec
Running org.apache.hadoop.hbase.TestZooKeeper
Tests run: 9, Failures: 0, Errors: 0, Skipped: 0, Time elapsed: 39.067 sec
Running org.apache.hadoop.hbase.TestHBaseTestingUtility
Tests run: 7, Failures: 0, Errors: 0, Skipped: 0, Time elapsed: 99.01 sec
Running org.apache.hadoop.hbase.replication.TestReplicationSmallTests
Tests run: 8, Failures: 0, Errors: 0, Skipped: 0, Time elapsed: 306.788 sec

Results :

Tests in error: 
  testCheckAndPut(org.apache.hadoop.hbase.client.TestFromClientSideWithCoprocessor): Failed
after attempts=10, exceptions:(..)

Tests run: 1355, Failures: 0, Errors: 1, Skipped: 13

[INFO] ------------------------------------------------------------------------
[INFO] BUILD FAILURE
[INFO] ------------------------------------------------------------------------
[INFO] Total time: 1:23:59.656s
[INFO] Finished at: Tue May 21 11:09:40 UTC 2013
[INFO] Final Memory: 42M/543M
[INFO] ------------------------------------------------------------------------
[ERROR] Failed to execute goal org.apache.maven.plugins:maven-surefire-plugin:2.12-TRUNK-HBASE-2:test
(secondPartTestsExecution) on project hbase: There are test failures.
[ERROR] 
[ERROR] Please refer to <https://builds.apache.org/job/HBase-0.94/ws/trunk/target/surefire-reports>
for the individual test results.
[ERROR] -> [Help 1]
[ERROR] 
[ERROR] To see the full stack trace of the errors, re-run Maven with the -e switch.
[ERROR] Re-run Maven using the -X switch to enable full debug logging.
[ERROR] 
[ERROR] For more information about the errors and possible solutions, please read the following
articles:
[ERROR] [Help 1] http://cwiki.apache.org/confluence/display/MAVEN/MojoFailureException
Build step 'Invoke top-level Maven targets' marked build as failure
Archiving artifacts
Updating HBASE-8282
Recording test results

Mime
View raw message