hbase-dev mailing list archives

Site index · List index
Message view « Date » · « Thread »
Top « Date » · « Thread »
From Apache Jenkins Server <jenk...@builds.apache.org>
Subject Build failed in Jenkins: hbase-0.95-on-hadoop2 #118
Date Fri, 31 May 2013 09:59:57 GMT
See <https://builds.apache.org/job/hbase-0.95-on-hadoop2/118/changes>

Changes:

[sershe] HBASE-8659 LruBlockCache logs too much

[stack] HBASE-8658 hbase clean is deaf to the --config DIR option

[sershe] HBASE-8653 master seems to be deleting region tmp directory from under compaction

[sershe] HBASE-8638 add logging to compaction policy

[stack] HBASE-8657 Miscellaneous log fixups for hbase-it; tidier logging, fix a few NPEs

[stack] HBASE-8631 Meta Region First Recovery

[stack] HBASE-7244 Provide a command or argument to startup, that formats znodes if provided;
FORGOT TO SVN ADD bin/hbase-cleanup.sh

------------------------------------------
[...truncated 24542 lines...]
Running org.apache.hadoop.hbase.rest.TestVersionResource
Tests run: 7, Failures: 0, Errors: 0, Skipped: 0, Time elapsed: 8.198 sec
Forking command line: /bin/sh -c cd /x1/jenkins/jenkins-slave/workspace/hbase-0.95-on-hadoop2/0.95-on-hadoop2/hbase-server
&& /x1/jenkins/tools/java/jdk1.6.0_45-32/jre/bin/java -enableassertions -Xmx1900m
-Djava.security.egd=file:/dev/./urandom -Djava.net.preferIPv4Stack=true -jar /x1/jenkins/jenkins-slave/workspace/hbase-0.95-on-hadoop2/0.95-on-hadoop2/hbase-server/target/surefire/surefirebooter5431934059740611848.jar
/x1/jenkins/jenkins-slave/workspace/hbase-0.95-on-hadoop2/0.95-on-hadoop2/hbase-server/target/surefire/surefire9071188077433877115tmp
/x1/jenkins/jenkins-slave/workspace/hbase-0.95-on-hadoop2/0.95-on-hadoop2/hbase-server/target/surefire/surefire_1977797904553200624484tmp
Running org.apache.hadoop.hbase.rest.TestStatusResource
Tests run: 2, Failures: 0, Errors: 0, Skipped: 0, Time elapsed: 8.076 sec
Forking command line: /bin/sh -c cd /x1/jenkins/jenkins-slave/workspace/hbase-0.95-on-hadoop2/0.95-on-hadoop2/hbase-server
&& /x1/jenkins/tools/java/jdk1.6.0_45-32/jre/bin/java -enableassertions -Xmx1900m
-Djava.security.egd=file:/dev/./urandom -Djava.net.preferIPv4Stack=true -jar /x1/jenkins/jenkins-slave/workspace/hbase-0.95-on-hadoop2/0.95-on-hadoop2/hbase-server/target/surefire/surefirebooter657896496151786172.jar
/x1/jenkins/jenkins-slave/workspace/hbase-0.95-on-hadoop2/0.95-on-hadoop2/hbase-server/target/surefire/surefire4438221734403415896tmp
/x1/jenkins/jenkins-slave/workspace/hbase-0.95-on-hadoop2/0.95-on-hadoop2/hbase-server/target/surefire/surefire_1987393052360888778985tmp
Running org.apache.hadoop.hbase.trace.TestHTraceHooks
Tests run: 1, Failures: 0, Errors: 0, Skipped: 0, Time elapsed: 8.109 sec
Forking command line: /bin/sh -c cd /x1/jenkins/jenkins-slave/workspace/hbase-0.95-on-hadoop2/0.95-on-hadoop2/hbase-server
&& /x1/jenkins/tools/java/jdk1.6.0_45-32/jre/bin/java -enableassertions -Xmx1900m
-Djava.security.egd=file:/dev/./urandom -Djava.net.preferIPv4Stack=true -jar /x1/jenkins/jenkins-slave/workspace/hbase-0.95-on-hadoop2/0.95-on-hadoop2/hbase-server/target/surefire/surefirebooter5217492686369897811.jar
/x1/jenkins/jenkins-slave/workspace/hbase-0.95-on-hadoop2/0.95-on-hadoop2/hbase-server/target/surefire/surefire677982800301114844tmp
/x1/jenkins/jenkins-slave/workspace/hbase-0.95-on-hadoop2/0.95-on-hadoop2/hbase-server/target/surefire/surefire_1991931571311685266195tmp
Running org.apache.hadoop.hbase.rest.TestScannerResource
Tests run: 5, Failures: 0, Errors: 0, Skipped: 0, Time elapsed: 22.321 sec
Forking command line: /bin/sh -c cd /x1/jenkins/jenkins-slave/workspace/hbase-0.95-on-hadoop2/0.95-on-hadoop2/hbase-server
&& /x1/jenkins/tools/java/jdk1.6.0_45-32/jre/bin/java -enableassertions -Xmx1900m
-Djava.security.egd=file:/dev/./urandom -Djava.net.preferIPv4Stack=true -jar /x1/jenkins/jenkins-slave/workspace/hbase-0.95-on-hadoop2/0.95-on-hadoop2/hbase-server/target/surefire/surefirebooter4611905994491298420.jar
/x1/jenkins/jenkins-slave/workspace/hbase-0.95-on-hadoop2/0.95-on-hadoop2/hbase-server/target/surefire/surefire709537728779724447tmp
/x1/jenkins/jenkins-slave/workspace/hbase-0.95-on-hadoop2/0.95-on-hadoop2/hbase-server/target/surefire/surefire_2007044783700706810713tmp
Running org.apache.hadoop.hbase.rest.TestScannersWithFilters
Tests run: 10, Failures: 0, Errors: 0, Skipped: 0, Time elapsed: 13.285 sec
Forking command line: /bin/sh -c cd /x1/jenkins/jenkins-slave/workspace/hbase-0.95-on-hadoop2/0.95-on-hadoop2/hbase-server
&& /x1/jenkins/tools/java/jdk1.6.0_45-32/jre/bin/java -enableassertions -Xmx1900m
-Djava.security.egd=file:/dev/./urandom -Djava.net.preferIPv4Stack=true -jar /x1/jenkins/jenkins-slave/workspace/hbase-0.95-on-hadoop2/0.95-on-hadoop2/hbase-server/target/surefire/surefirebooter7834584866849806864.jar
/x1/jenkins/jenkins-slave/workspace/hbase-0.95-on-hadoop2/0.95-on-hadoop2/hbase-server/target/surefire/surefire3613561694367833342tmp
/x1/jenkins/jenkins-slave/workspace/hbase-0.95-on-hadoop2/0.95-on-hadoop2/hbase-server/target/surefire/surefire_2017011721553789699577tmp
Running org.apache.hadoop.hbase.io.hfile.TestHFileSeek
Tests run: 1, Failures: 0, Errors: 0, Skipped: 0, Time elapsed: 3.512 sec
Forking command line: /bin/sh -c cd /x1/jenkins/jenkins-slave/workspace/hbase-0.95-on-hadoop2/0.95-on-hadoop2/hbase-server
&& /x1/jenkins/tools/java/jdk1.6.0_45-32/jre/bin/java -enableassertions -Xmx1900m
-Djava.security.egd=file:/dev/./urandom -Djava.net.preferIPv4Stack=true -jar /x1/jenkins/jenkins-slave/workspace/hbase-0.95-on-hadoop2/0.95-on-hadoop2/hbase-server/target/surefire/surefirebooter7503246123949434275.jar
/x1/jenkins/jenkins-slave/workspace/hbase-0.95-on-hadoop2/0.95-on-hadoop2/hbase-server/target/surefire/surefire215764526136216733tmp
/x1/jenkins/jenkins-slave/workspace/hbase-0.95-on-hadoop2/0.95-on-hadoop2/hbase-server/target/surefire/surefire_2022329835631781235793tmp
Running org.apache.hadoop.hbase.io.hfile.TestHFileBlockIndex
Tests run: 10, Failures: 0, Errors: 0, Skipped: 0, Time elapsed: 8.063 sec
Forking command line: /bin/sh -c cd /x1/jenkins/jenkins-slave/workspace/hbase-0.95-on-hadoop2/0.95-on-hadoop2/hbase-server
&& /x1/jenkins/tools/java/jdk1.6.0_45-32/jre/bin/java -enableassertions -Xmx1900m
-Djava.security.egd=file:/dev/./urandom -Djava.net.preferIPv4Stack=true -jar /x1/jenkins/jenkins-slave/workspace/hbase-0.95-on-hadoop2/0.95-on-hadoop2/hbase-server/target/surefire/surefirebooter5573881539146809288.jar
/x1/jenkins/jenkins-slave/workspace/hbase-0.95-on-hadoop2/0.95-on-hadoop2/hbase-server/target/surefire/surefire1728802463116378075tmp
/x1/jenkins/jenkins-slave/workspace/hbase-0.95-on-hadoop2/0.95-on-hadoop2/hbase-server/target/surefire/surefire_2034525634271918287394tmp
Running org.apache.hadoop.hbase.io.hfile.TestHFilePerformance
Tests run: 1, Failures: 0, Errors: 0, Skipped: 0, Time elapsed: 4.65 sec
Forking command line: /bin/sh -c cd /x1/jenkins/jenkins-slave/workspace/hbase-0.95-on-hadoop2/0.95-on-hadoop2/hbase-server
&& /x1/jenkins/tools/java/jdk1.6.0_45-32/jre/bin/java -enableassertions -Xmx1900m
-Djava.security.egd=file:/dev/./urandom -Djava.net.preferIPv4Stack=true -jar /x1/jenkins/jenkins-slave/workspace/hbase-0.95-on-hadoop2/0.95-on-hadoop2/hbase-server/target/surefire/surefirebooter9167185678569533930.jar
/x1/jenkins/jenkins-slave/workspace/hbase-0.95-on-hadoop2/0.95-on-hadoop2/hbase-server/target/surefire/surefire3378489817750325464tmp
/x1/jenkins/jenkins-slave/workspace/hbase-0.95-on-hadoop2/0.95-on-hadoop2/hbase-server/target/surefire/surefire_2048730109231513347029tmp
Running org.apache.hadoop.hbase.io.hfile.TestForceCacheImportantBlocks
Tests run: 2, Failures: 0, Errors: 0, Skipped: 0, Time elapsed: 23.976 sec
Forking command line: /bin/sh -c cd /x1/jenkins/jenkins-slave/workspace/hbase-0.95-on-hadoop2/0.95-on-hadoop2/hbase-server
&& /x1/jenkins/tools/java/jdk1.6.0_45-32/jre/bin/java -enableassertions -Xmx1900m
-Djava.security.egd=file:/dev/./urandom -Djava.net.preferIPv4Stack=true -jar /x1/jenkins/jenkins-slave/workspace/hbase-0.95-on-hadoop2/0.95-on-hadoop2/hbase-server/target/surefire/surefirebooter8911695000016098055.jar
/x1/jenkins/jenkins-slave/workspace/hbase-0.95-on-hadoop2/0.95-on-hadoop2/hbase-server/target/surefire/surefire6469796508730421490tmp
/x1/jenkins/jenkins-slave/workspace/hbase-0.95-on-hadoop2/0.95-on-hadoop2/hbase-server/target/surefire/surefire_2054322162025196064468tmp
Running org.apache.hadoop.hbase.io.hfile.TestCacheOnWrite
Tests run: 36, Failures: 0, Errors: 0, Skipped: 0, Time elapsed: 36.545 sec
Forking command line: /bin/sh -c cd /x1/jenkins/jenkins-slave/workspace/hbase-0.95-on-hadoop2/0.95-on-hadoop2/hbase-server
&& /x1/jenkins/tools/java/jdk1.6.0_45-32/jre/bin/java -enableassertions -Xmx1900m
-Djava.security.egd=file:/dev/./urandom -Djava.net.preferIPv4Stack=true -jar /x1/jenkins/jenkins-slave/workspace/hbase-0.95-on-hadoop2/0.95-on-hadoop2/hbase-server/target/surefire/surefirebooter8971742114241924664.jar
/x1/jenkins/jenkins-slave/workspace/hbase-0.95-on-hadoop2/0.95-on-hadoop2/hbase-server/target/surefire/surefire7934419469815954233tmp
/x1/jenkins/jenkins-slave/workspace/hbase-0.95-on-hadoop2/0.95-on-hadoop2/hbase-server/target/surefire/surefire_206411409457307143012tmp
Running org.apache.hadoop.hbase.io.hfile.slab.TestSlabCache
Tests run: 7, Failures: 0, Errors: 0, Skipped: 0, Time elapsed: 17.603 sec
Forking command line: /bin/sh -c cd /x1/jenkins/jenkins-slave/workspace/hbase-0.95-on-hadoop2/0.95-on-hadoop2/hbase-server
&& /x1/jenkins/tools/java/jdk1.6.0_45-32/jre/bin/java -enableassertions -Xmx1900m
-Djava.security.egd=file:/dev/./urandom -Djava.net.preferIPv4Stack=true -jar /x1/jenkins/jenkins-slave/workspace/hbase-0.95-on-hadoop2/0.95-on-hadoop2/hbase-server/target/surefire/surefirebooter506664096294102978.jar
/x1/jenkins/jenkins-slave/workspace/hbase-0.95-on-hadoop2/0.95-on-hadoop2/hbase-server/target/surefire/surefire8091809752427364986tmp
/x1/jenkins/jenkins-slave/workspace/hbase-0.95-on-hadoop2/0.95-on-hadoop2/hbase-server/target/surefire/surefire_207327289874308299900tmp
Running org.apache.hadoop.hbase.io.hfile.TestHFileBlock
Tests run: 14, Failures: 0, Errors: 0, Skipped: 0, Time elapsed: 49.721 sec
Forking command line: /bin/sh -c cd /x1/jenkins/jenkins-slave/workspace/hbase-0.95-on-hadoop2/0.95-on-hadoop2/hbase-server
&& /x1/jenkins/tools/java/jdk1.6.0_45-32/jre/bin/java -enableassertions -Xmx1900m
-Djava.security.egd=file:/dev/./urandom -Djava.net.preferIPv4Stack=true -jar /x1/jenkins/jenkins-slave/workspace/hbase-0.95-on-hadoop2/0.95-on-hadoop2/hbase-server/target/surefire/surefirebooter8992548895786563959.jar
/x1/jenkins/jenkins-slave/workspace/hbase-0.95-on-hadoop2/0.95-on-hadoop2/hbase-server/target/surefire/surefire144921030249619000tmp
/x1/jenkins/jenkins-slave/workspace/hbase-0.95-on-hadoop2/0.95-on-hadoop2/hbase-server/target/surefire/surefire_208385204591338882727tmp
Running org.apache.hadoop.hbase.security.access.TestAccessController
Tests run: 37, Failures: 0, Errors: 0, Skipped: 0, Time elapsed: 132.048 sec
Forking command line: /bin/sh -c cd /x1/jenkins/jenkins-slave/workspace/hbase-0.95-on-hadoop2/0.95-on-hadoop2/hbase-server
&& /x1/jenkins/tools/java/jdk1.6.0_45-32/jre/bin/java -enableassertions -Xmx1900m
-Djava.security.egd=file:/dev/./urandom -Djava.net.preferIPv4Stack=true -jar /x1/jenkins/jenkins-slave/workspace/hbase-0.95-on-hadoop2/0.95-on-hadoop2/hbase-server/target/surefire/surefirebooter6392508434553191000.jar
/x1/jenkins/jenkins-slave/workspace/hbase-0.95-on-hadoop2/0.95-on-hadoop2/hbase-server/target/surefire/surefire7239463352237601719tmp
/x1/jenkins/jenkins-slave/workspace/hbase-0.95-on-hadoop2/0.95-on-hadoop2/hbase-server/target/surefire/surefire_2096375292040321605293tmp
Running org.apache.hadoop.hbase.io.TestFileLink
Tests run: 3, Failures: 0, Errors: 0, Skipped: 0, Time elapsed: 16.761 sec
Forking command line: /bin/sh -c cd /x1/jenkins/jenkins-slave/workspace/hbase-0.95-on-hadoop2/0.95-on-hadoop2/hbase-server
&& /x1/jenkins/tools/java/jdk1.6.0_45-32/jre/bin/java -enableassertions -Xmx1900m
-Djava.security.egd=file:/dev/./urandom -Djava.net.preferIPv4Stack=true -jar /x1/jenkins/jenkins-slave/workspace/hbase-0.95-on-hadoop2/0.95-on-hadoop2/hbase-server/target/surefire/surefirebooter3825969609597090153.jar
/x1/jenkins/jenkins-slave/workspace/hbase-0.95-on-hadoop2/0.95-on-hadoop2/hbase-server/target/surefire/surefire8564089471871658220tmp
/x1/jenkins/jenkins-slave/workspace/hbase-0.95-on-hadoop2/0.95-on-hadoop2/hbase-server/target/surefire/surefire_210240735805741561617tmp
Running org.apache.hadoop.hbase.io.hfile.TestScannerSelectionUsingTTL
Tests run: 6, Failures: 0, Errors: 0, Skipped: 0, Time elapsed: 62.172 sec
Forking command line: /bin/sh -c cd /x1/jenkins/jenkins-slave/workspace/hbase-0.95-on-hadoop2/0.95-on-hadoop2/hbase-server
&& /x1/jenkins/tools/java/jdk1.6.0_45-32/jre/bin/java -enableassertions -Xmx1900m
-Djava.security.egd=file:/dev/./urandom -Djava.net.preferIPv4Stack=true -jar /x1/jenkins/jenkins-slave/workspace/hbase-0.95-on-hadoop2/0.95-on-hadoop2/hbase-server/target/surefire/surefirebooter3578912355406680661.jar
/x1/jenkins/jenkins-slave/workspace/hbase-0.95-on-hadoop2/0.95-on-hadoop2/hbase-server/target/surefire/surefire6234620783655426822tmp
/x1/jenkins/jenkins-slave/workspace/hbase-0.95-on-hadoop2/0.95-on-hadoop2/hbase-server/target/surefire/surefire_2115730621378431561731tmp
Running org.apache.hadoop.hbase.io.hfile.slab.TestSingleSizeCache
Tests run: 5, Failures: 0, Errors: 0, Skipped: 0, Time elapsed: 28.903 sec
Forking command line: /bin/sh -c cd /x1/jenkins/jenkins-slave/workspace/hbase-0.95-on-hadoop2/0.95-on-hadoop2/hbase-server
&& /x1/jenkins/tools/java/jdk1.6.0_45-32/jre/bin/java -enableassertions -Xmx1900m
-Djava.security.egd=file:/dev/./urandom -Djava.net.preferIPv4Stack=true -jar /x1/jenkins/jenkins-slave/workspace/hbase-0.95-on-hadoop2/0.95-on-hadoop2/hbase-server/target/surefire/surefirebooter3039820740444436104.jar
/x1/jenkins/jenkins-slave/workspace/hbase-0.95-on-hadoop2/0.95-on-hadoop2/hbase-server/target/surefire/surefire8736233417279687439tmp
/x1/jenkins/jenkins-slave/workspace/hbase-0.95-on-hadoop2/0.95-on-hadoop2/hbase-server/target/surefire/surefire_2128996756316715113711tmp
Running org.apache.hadoop.hbase.io.encoding.TestBufferedDataBlockEncoder
Tests run: 1, Failures: 0, Errors: 0, Skipped: 0, Time elapsed: 17.238 sec
Forking command line: /bin/sh -c cd /x1/jenkins/jenkins-slave/workspace/hbase-0.95-on-hadoop2/0.95-on-hadoop2/hbase-server
&& /x1/jenkins/tools/java/jdk1.6.0_45-32/jre/bin/java -enableassertions -Xmx1900m
-Djava.security.egd=file:/dev/./urandom -Djava.net.preferIPv4Stack=true -jar /x1/jenkins/jenkins-slave/workspace/hbase-0.95-on-hadoop2/0.95-on-hadoop2/hbase-server/target/surefire/surefirebooter5943206363935257394.jar
/x1/jenkins/jenkins-slave/workspace/hbase-0.95-on-hadoop2/0.95-on-hadoop2/hbase-server/target/surefire/surefire3862348352831214819tmp
/x1/jenkins/jenkins-slave/workspace/hbase-0.95-on-hadoop2/0.95-on-hadoop2/hbase-server/target/surefire/surefire_2134619407274501636491tmp
Running org.apache.hadoop.hbase.io.encoding.TestEncodedSeekers
Tests run: 10, Failures: 0, Errors: 0, Skipped: 0, Time elapsed: 32.673 sec
Forking command line: /bin/sh -c cd /x1/jenkins/jenkins-slave/workspace/hbase-0.95-on-hadoop2/0.95-on-hadoop2/hbase-server
&& /x1/jenkins/tools/java/jdk1.6.0_45-32/jre/bin/java -enableassertions -Xmx1900m
-Djava.security.egd=file:/dev/./urandom -Djava.net.preferIPv4Stack=true -jar /x1/jenkins/jenkins-slave/workspace/hbase-0.95-on-hadoop2/0.95-on-hadoop2/hbase-server/target/surefire/surefirebooter5697311320188764206.jar
/x1/jenkins/jenkins-slave/workspace/hbase-0.95-on-hadoop2/0.95-on-hadoop2/hbase-server/target/surefire/surefire8987789986683534554tmp
/x1/jenkins/jenkins-slave/workspace/hbase-0.95-on-hadoop2/0.95-on-hadoop2/hbase-server/target/surefire/surefire_2144411481672696678348tmp
Running org.apache.hadoop.hbase.TestRegionRebalancing
Tests run: 2, Failures: 0, Errors: 0, Skipped: 0, Time elapsed: 21.855 sec
Forking command line: /bin/sh -c cd /x1/jenkins/jenkins-slave/workspace/hbase-0.95-on-hadoop2/0.95-on-hadoop2/hbase-server
&& /x1/jenkins/tools/java/jdk1.6.0_45-32/jre/bin/java -enableassertions -Xmx1900m
-Djava.security.egd=file:/dev/./urandom -Djava.net.preferIPv4Stack=true -jar /x1/jenkins/jenkins-slave/workspace/hbase-0.95-on-hadoop2/0.95-on-hadoop2/hbase-server/target/surefire/surefirebooter7385583715151322198.jar
/x1/jenkins/jenkins-slave/workspace/hbase-0.95-on-hadoop2/0.95-on-hadoop2/hbase-server/target/surefire/surefire1208914415842629942tmp
/x1/jenkins/jenkins-slave/workspace/hbase-0.95-on-hadoop2/0.95-on-hadoop2/hbase-server/target/surefire/surefire_2159223213122700156035tmp
Running org.apache.hadoop.hbase.io.encoding.TestLoadAndSwitchEncodeOnDisk
Tests run: 1, Failures: 0, Errors: 0, Skipped: 0, Time elapsed: 35.742 sec
Forking command line: /bin/sh -c cd /x1/jenkins/jenkins-slave/workspace/hbase-0.95-on-hadoop2/0.95-on-hadoop2/hbase-server
&& /x1/jenkins/tools/java/jdk1.6.0_45-32/jre/bin/java -enableassertions -Xmx1900m
-Djava.security.egd=file:/dev/./urandom -Djava.net.preferIPv4Stack=true -jar /x1/jenkins/jenkins-slave/workspace/hbase-0.95-on-hadoop2/0.95-on-hadoop2/hbase-server/target/surefire/surefirebooter928596187963303012.jar
/x1/jenkins/jenkins-slave/workspace/hbase-0.95-on-hadoop2/0.95-on-hadoop2/hbase-server/target/surefire/surefire1273321645513260600tmp
/x1/jenkins/jenkins-slave/workspace/hbase-0.95-on-hadoop2/0.95-on-hadoop2/hbase-server/target/surefire/surefire_216503577761928153155tmp
Running org.apache.hadoop.hbase.mapred.TestTableInputFormat
Tests run: 10, Failures: 0, Errors: 0, Skipped: 0, Time elapsed: 18.746 sec
Forking command line: /bin/sh -c cd /x1/jenkins/jenkins-slave/workspace/hbase-0.95-on-hadoop2/0.95-on-hadoop2/hbase-server
&& /x1/jenkins/tools/java/jdk1.6.0_45-32/jre/bin/java -enableassertions -Xmx1900m
-Djava.security.egd=file:/dev/./urandom -Djava.net.preferIPv4Stack=true -jar /x1/jenkins/jenkins-slave/workspace/hbase-0.95-on-hadoop2/0.95-on-hadoop2/hbase-server/target/surefire/surefirebooter7088600241860634664.jar
/x1/jenkins/jenkins-slave/workspace/hbase-0.95-on-hadoop2/0.95-on-hadoop2/hbase-server/target/surefire/surefire6813066153826634270tmp
/x1/jenkins/jenkins-slave/workspace/hbase-0.95-on-hadoop2/0.95-on-hadoop2/hbase-server/target/surefire/surefire_2171636867376735206005tmp
Running org.apache.hadoop.hbase.replication.TestReplicationDisableInactivePeer
Tests run: 1, Failures: 0, Errors: 0, Skipped: 0, Time elapsed: 31.129 sec
Forking command line: /bin/sh -c cd /x1/jenkins/jenkins-slave/workspace/hbase-0.95-on-hadoop2/0.95-on-hadoop2/hbase-server
&& /x1/jenkins/tools/java/jdk1.6.0_45-32/jre/bin/java -enableassertions -Xmx1900m
-Djava.security.egd=file:/dev/./urandom -Djava.net.preferIPv4Stack=true -jar /x1/jenkins/jenkins-slave/workspace/hbase-0.95-on-hadoop2/0.95-on-hadoop2/hbase-server/target/surefire/surefirebooter3061973030025124176.jar
/x1/jenkins/jenkins-slave/workspace/hbase-0.95-on-hadoop2/0.95-on-hadoop2/hbase-server/target/surefire/surefire1858157206997731926tmp
/x1/jenkins/jenkins-slave/workspace/hbase-0.95-on-hadoop2/0.95-on-hadoop2/hbase-server/target/surefire/surefire_21838045337643119257tmp
Running org.apache.hadoop.hbase.mapred.TestTableMapReduce
Tests run: 1, Failures: 0, Errors: 0, Skipped: 0, Time elapsed: 38.446 sec
Forking command line: /bin/sh -c cd /x1/jenkins/jenkins-slave/workspace/hbase-0.95-on-hadoop2/0.95-on-hadoop2/hbase-server
&& /x1/jenkins/tools/java/jdk1.6.0_45-32/jre/bin/java -enableassertions -Xmx1900m
-Djava.security.egd=file:/dev/./urandom -Djava.net.preferIPv4Stack=true -jar /x1/jenkins/jenkins-slave/workspace/hbase-0.95-on-hadoop2/0.95-on-hadoop2/hbase-server/target/surefire/surefirebooter5811796471597394883.jar
/x1/jenkins/jenkins-slave/workspace/hbase-0.95-on-hadoop2/0.95-on-hadoop2/hbase-server/target/surefire/surefire5704916385990329161tmp
/x1/jenkins/jenkins-slave/workspace/hbase-0.95-on-hadoop2/0.95-on-hadoop2/hbase-server/target/surefire/surefire_2193504094112560767720tmp
Running org.apache.hadoop.hbase.replication.TestReplicationZookeeper
Tests run: 4, Failures: 0, Errors: 0, Skipped: 0, Time elapsed: 0.871 sec
Forking command line: /bin/sh -c cd /x1/jenkins/jenkins-slave/workspace/hbase-0.95-on-hadoop2/0.95-on-hadoop2/hbase-server
&& /x1/jenkins/tools/java/jdk1.6.0_45-32/jre/bin/java -enableassertions -Xmx1900m
-Djava.security.egd=file:/dev/./urandom -Djava.net.preferIPv4Stack=true -jar /x1/jenkins/jenkins-slave/workspace/hbase-0.95-on-hadoop2/0.95-on-hadoop2/hbase-server/target/surefire/surefirebooter1327935738574874061.jar
/x1/jenkins/jenkins-slave/workspace/hbase-0.95-on-hadoop2/0.95-on-hadoop2/hbase-server/target/surefire/surefire2058488152371393334tmp
/x1/jenkins/jenkins-slave/workspace/hbase-0.95-on-hadoop2/0.95-on-hadoop2/hbase-server/target/surefire/surefire_2202008140162836247305tmp
Running org.apache.hadoop.hbase.io.encoding.TestDataBlockEncoders
Tests run: 12, Failures: 0, Errors: 0, Skipped: 0, Time elapsed: 87.616 sec
Forking command line: /bin/sh -c cd /x1/jenkins/jenkins-slave/workspace/hbase-0.95-on-hadoop2/0.95-on-hadoop2/hbase-server
&& /x1/jenkins/tools/java/jdk1.6.0_45-32/jre/bin/java -enableassertions -Xmx1900m
-Djava.security.egd=file:/dev/./urandom -Djava.net.preferIPv4Stack=true -jar /x1/jenkins/jenkins-slave/workspace/hbase-0.95-on-hadoop2/0.95-on-hadoop2/hbase-server/target/surefire/surefirebooter48440746382190359.jar
/x1/jenkins/jenkins-slave/workspace/hbase-0.95-on-hadoop2/0.95-on-hadoop2/hbase-server/target/surefire/surefire5249077239735340000tmp
/x1/jenkins/jenkins-slave/workspace/hbase-0.95-on-hadoop2/0.95-on-hadoop2/hbase-server/target/surefire/surefire_2216787261085130654629tmp
Running org.apache.hadoop.hbase.replication.regionserver.TestReplicationSourceManager
Tests run: 3, Failures: 0, Errors: 0, Skipped: 0, Time elapsed: 1.73 sec
Forking command line: /bin/sh -c cd /x1/jenkins/jenkins-slave/workspace/hbase-0.95-on-hadoop2/0.95-on-hadoop2/hbase-server
&& /x1/jenkins/tools/java/jdk1.6.0_45-32/jre/bin/java -enableassertions -Xmx1900m
-Djava.security.egd=file:/dev/./urandom -Djava.net.preferIPv4Stack=true -jar /x1/jenkins/jenkins-slave/workspace/hbase-0.95-on-hadoop2/0.95-on-hadoop2/hbase-server/target/surefire/surefirebooter7090583883463158546.jar
/x1/jenkins/jenkins-slave/workspace/hbase-0.95-on-hadoop2/0.95-on-hadoop2/hbase-server/target/surefire/surefire773580231485027106tmp
/x1/jenkins/jenkins-slave/workspace/hbase-0.95-on-hadoop2/0.95-on-hadoop2/hbase-server/target/surefire/surefire_2224236599109275001400tmp
Running org.apache.hadoop.hbase.replication.TestReplicationSource
Tests run: 1, Failures: 0, Errors: 0, Skipped: 0, Time elapsed: 3.64 sec
Forking command line: /bin/sh -c cd /x1/jenkins/jenkins-slave/workspace/hbase-0.95-on-hadoop2/0.95-on-hadoop2/hbase-server
&& /x1/jenkins/tools/java/jdk1.6.0_45-32/jre/bin/java -enableassertions -Xmx1900m
-Djava.security.egd=file:/dev/./urandom -Djava.net.preferIPv4Stack=true -jar /x1/jenkins/jenkins-slave/workspace/hbase-0.95-on-hadoop2/0.95-on-hadoop2/hbase-server/target/surefire/surefirebooter282238983843806496.jar
/x1/jenkins/jenkins-slave/workspace/hbase-0.95-on-hadoop2/0.95-on-hadoop2/hbase-server/target/surefire/surefire8833662216027877442tmp
/x1/jenkins/jenkins-slave/workspace/hbase-0.95-on-hadoop2/0.95-on-hadoop2/hbase-server/target/surefire/surefire_2233465814028643476321tmp
Running org.apache.hadoop.hbase.replication.regionserver.TestReplicationSink
Tests run: 5, Failures: 0, Errors: 0, Skipped: 0, Time elapsed: 11.191 sec
Forking command line: /bin/sh -c cd /x1/jenkins/jenkins-slave/workspace/hbase-0.95-on-hadoop2/0.95-on-hadoop2/hbase-server
&& /x1/jenkins/tools/java/jdk1.6.0_45-32/jre/bin/java -enableassertions -Xmx1900m
-Djava.security.egd=file:/dev/./urandom -Djava.net.preferIPv4Stack=true -jar /x1/jenkins/jenkins-slave/workspace/hbase-0.95-on-hadoop2/0.95-on-hadoop2/hbase-server/target/surefire/surefirebooter847276087726020006.jar
/x1/jenkins/jenkins-slave/workspace/hbase-0.95-on-hadoop2/0.95-on-hadoop2/hbase-server/target/surefire/surefire272252853713967450tmp
/x1/jenkins/jenkins-slave/workspace/hbase-0.95-on-hadoop2/0.95-on-hadoop2/hbase-server/target/surefire/surefire_2245852808177811405843tmp
Running org.apache.hadoop.hbase.replication.TestReplicationStateZKImpl
Tests run: 3, Failures: 0, Errors: 0, Skipped: 0, Time elapsed: 1.973 sec
Forking command line: /bin/sh -c cd /x1/jenkins/jenkins-slave/workspace/hbase-0.95-on-hadoop2/0.95-on-hadoop2/hbase-server
&& /x1/jenkins/tools/java/jdk1.6.0_45-32/jre/bin/java -enableassertions -Xmx1900m
-Djava.security.egd=file:/dev/./urandom -Djava.net.preferIPv4Stack=true -jar /x1/jenkins/jenkins-slave/workspace/hbase-0.95-on-hadoop2/0.95-on-hadoop2/hbase-server/target/surefire/surefirebooter4433595992361844319.jar
/x1/jenkins/jenkins-slave/workspace/hbase-0.95-on-hadoop2/0.95-on-hadoop2/hbase-server/target/surefire/surefire1547954928024510222tmp
/x1/jenkins/jenkins-slave/workspace/hbase-0.95-on-hadoop2/0.95-on-hadoop2/hbase-server/target/surefire/surefire_2257260215286997892450tmp
Running org.apache.hadoop.hbase.replication.TestMultiSlaveReplication
Tests run: 1, Failures: 0, Errors: 0, Skipped: 0, Time elapsed: 23.302 sec
Forking command line: /bin/sh -c cd /x1/jenkins/jenkins-slave/workspace/hbase-0.95-on-hadoop2/0.95-on-hadoop2/hbase-server
&& /x1/jenkins/tools/java/jdk1.6.0_45-32/jre/bin/java -enableassertions -Xmx1900m
-Djava.security.egd=file:/dev/./urandom -Djava.net.preferIPv4Stack=true -jar /x1/jenkins/jenkins-slave/workspace/hbase-0.95-on-hadoop2/0.95-on-hadoop2/hbase-server/target/surefire/surefirebooter894563491181531111.jar
/x1/jenkins/jenkins-slave/workspace/hbase-0.95-on-hadoop2/0.95-on-hadoop2/hbase-server/target/surefire/surefire4567835618437509894tmp
/x1/jenkins/jenkins-slave/workspace/hbase-0.95-on-hadoop2/0.95-on-hadoop2/hbase-server/target/surefire/surefire_2264021224185036279779tmp
Running org.apache.hadoop.hbase.replication.TestReplicationQueueFailoverCompressed
Tests run: 1, Failures: 0, Errors: 0, Skipped: 0, Time elapsed: 76.874 sec
Forking command line: /bin/sh -c cd /x1/jenkins/jenkins-slave/workspace/hbase-0.95-on-hadoop2/0.95-on-hadoop2/hbase-server
&& /x1/jenkins/tools/java/jdk1.6.0_45-32/jre/bin/java -enableassertions -Xmx1900m
-Djava.security.egd=file:/dev/./urandom -Djava.net.preferIPv4Stack=true -jar /x1/jenkins/jenkins-slave/workspace/hbase-0.95-on-hadoop2/0.95-on-hadoop2/hbase-server/target/surefire/surefirebooter1085359288556778842.jar
/x1/jenkins/jenkins-slave/workspace/hbase-0.95-on-hadoop2/0.95-on-hadoop2/hbase-server/target/surefire/surefire5447473119324509890tmp
/x1/jenkins/jenkins-slave/workspace/hbase-0.95-on-hadoop2/0.95-on-hadoop2/hbase-server/target/surefire/surefire_227366170634190735723tmp
Running org.apache.hadoop.hbase.util.TestMergeTool
Tests run: 1, Failures: 0, Errors: 0, Skipped: 0, Time elapsed: 14.73 sec
Forking command line: /bin/sh -c cd /x1/jenkins/jenkins-slave/workspace/hbase-0.95-on-hadoop2/0.95-on-hadoop2/hbase-server
&& /x1/jenkins/tools/java/jdk1.6.0_45-32/jre/bin/java -enableassertions -Xmx1900m
-Djava.security.egd=file:/dev/./urandom -Djava.net.preferIPv4Stack=true -jar /x1/jenkins/jenkins-slave/workspace/hbase-0.95-on-hadoop2/0.95-on-hadoop2/hbase-server/target/surefire/surefirebooter4069814180752098914.jar
/x1/jenkins/jenkins-slave/workspace/hbase-0.95-on-hadoop2/0.95-on-hadoop2/hbase-server/target/surefire/surefire631954133738270993tmp
/x1/jenkins/jenkins-slave/workspace/hbase-0.95-on-hadoop2/0.95-on-hadoop2/hbase-server/target/surefire/surefire_2281704155064288028405tmp
Running org.apache.hadoop.hbase.util.TestFSTableDescriptors
Tests run: 12, Failures: 0, Errors: 0, Skipped: 0, Time elapsed: 1.761 sec
Forking command line: /bin/sh -c cd /x1/jenkins/jenkins-slave/workspace/hbase-0.95-on-hadoop2/0.95-on-hadoop2/hbase-server
&& /x1/jenkins/tools/java/jdk1.6.0_45-32/jre/bin/java -enableassertions -Xmx1900m
-Djava.security.egd=file:/dev/./urandom -Djava.net.preferIPv4Stack=true -jar /x1/jenkins/jenkins-slave/workspace/hbase-0.95-on-hadoop2/0.95-on-hadoop2/hbase-server/target/surefire/surefirebooter1485337330059017009.jar
/x1/jenkins/jenkins-slave/workspace/hbase-0.95-on-hadoop2/0.95-on-hadoop2/hbase-server/target/surefire/surefire1544189413420666867tmp
/x1/jenkins/jenkins-slave/workspace/hbase-0.95-on-hadoop2/0.95-on-hadoop2/hbase-server/target/surefire/surefire_2296655280603333590020tmp
Running org.apache.hadoop.hbase.replication.TestMasterReplication
Tests run: 2, Failures: 0, Errors: 0, Skipped: 0, Time elapsed: 35.442 sec
Forking command line: /bin/sh -c cd /x1/jenkins/jenkins-slave/workspace/hbase-0.95-on-hadoop2/0.95-on-hadoop2/hbase-server
&& /x1/jenkins/tools/java/jdk1.6.0_45-32/jre/bin/java -enableassertions -Xmx1900m
-Djava.security.egd=file:/dev/./urandom -Djava.net.preferIPv4Stack=true -jar /x1/jenkins/jenkins-slave/workspace/hbase-0.95-on-hadoop2/0.95-on-hadoop2/hbase-server/target/surefire/surefirebooter1373952506749008037.jar
/x1/jenkins/jenkins-slave/workspace/hbase-0.95-on-hadoop2/0.95-on-hadoop2/hbase-server/target/surefire/surefire4725648264616147346tmp
/x1/jenkins/jenkins-slave/workspace/hbase-0.95-on-hadoop2/0.95-on-hadoop2/hbase-server/target/surefire/surefire_2301073699724330105663tmp
Running org.apache.hadoop.hbase.io.encoding.TestChangingEncoding
Tests run: 4, Failures: 0, Errors: 0, Skipped: 0, Time elapsed: 159.149 sec
Forking command line: /bin/sh -c cd /x1/jenkins/jenkins-slave/workspace/hbase-0.95-on-hadoop2/0.95-on-hadoop2/hbase-server
&& /x1/jenkins/tools/java/jdk1.6.0_45-32/jre/bin/java -enableassertions -Xmx1900m
-Djava.security.egd=file:/dev/./urandom -Djava.net.preferIPv4Stack=true -jar /x1/jenkins/jenkins-slave/workspace/hbase-0.95-on-hadoop2/0.95-on-hadoop2/hbase-server/target/surefire/surefirebooter960502828869241394.jar
/x1/jenkins/jenkins-slave/workspace/hbase-0.95-on-hadoop2/0.95-on-hadoop2/hbase-server/target/surefire/surefire4774212448533286100tmp
/x1/jenkins/jenkins-slave/workspace/hbase-0.95-on-hadoop2/0.95-on-hadoop2/hbase-server/target/surefire/surefire_2317947946673267479984tmp
Running org.apache.hadoop.hbase.util.TestIdLock
Tests run: 1, Failures: 0, Errors: 0, Skipped: 0, Time elapsed: 15.567 sec
Forking command line: /bin/sh -c cd /x1/jenkins/jenkins-slave/workspace/hbase-0.95-on-hadoop2/0.95-on-hadoop2/hbase-server
&& /x1/jenkins/tools/java/jdk1.6.0_45-32/jre/bin/java -enableassertions -Xmx1900m
-Djava.security.egd=file:/dev/./urandom -Djava.net.preferIPv4Stack=true -jar /x1/jenkins/jenkins-slave/workspace/hbase-0.95-on-hadoop2/0.95-on-hadoop2/hbase-server/target/surefire/surefirebooter1233853015332224152.jar
/x1/jenkins/jenkins-slave/workspace/hbase-0.95-on-hadoop2/0.95-on-hadoop2/hbase-server/target/surefire/surefire2271002752391291250tmp
/x1/jenkins/jenkins-slave/workspace/hbase-0.95-on-hadoop2/0.95-on-hadoop2/hbase-server/target/surefire/surefire_2325680177301287254712tmp
Running org.apache.hadoop.hbase.util.TestMergeTable
Tests run: 1, Failures: 0, Errors: 0, Skipped: 0, Time elapsed: 20.202 sec
Forking command line: /bin/sh -c cd /x1/jenkins/jenkins-slave/workspace/hbase-0.95-on-hadoop2/0.95-on-hadoop2/hbase-server
&& /x1/jenkins/tools/java/jdk1.6.0_45-32/jre/bin/java -enableassertions -Xmx1900m
-Djava.security.egd=file:/dev/./urandom -Djava.net.preferIPv4Stack=true -jar /x1/jenkins/jenkins-slave/workspace/hbase-0.95-on-hadoop2/0.95-on-hadoop2/hbase-server/target/surefire/surefirebooter248235725786889931.jar
/x1/jenkins/jenkins-slave/workspace/hbase-0.95-on-hadoop2/0.95-on-hadoop2/hbase-server/target/surefire/surefire9133602489314577738tmp
/x1/jenkins/jenkins-slave/workspace/hbase-0.95-on-hadoop2/0.95-on-hadoop2/hbase-server/target/surefire/surefire_23341020097303119755tmp
Running org.apache.hadoop.hbase.replication.TestReplicationSmallTests
Tests run: 8, Failures: 0, Errors: 0, Skipped: 0, Time elapsed: 75.758 sec
Forking command line: /bin/sh -c cd /x1/jenkins/jenkins-slave/workspace/hbase-0.95-on-hadoop2/0.95-on-hadoop2/hbase-server
&& /x1/jenkins/tools/java/jdk1.6.0_45-32/jre/bin/java -enableassertions -Xmx1900m
-Djava.security.egd=file:/dev/./urandom -Djava.net.preferIPv4Stack=true -jar /x1/jenkins/jenkins-slave/workspace/hbase-0.95-on-hadoop2/0.95-on-hadoop2/hbase-server/target/surefire/surefirebooter4628939704365783924.jar
/x1/jenkins/jenkins-slave/workspace/hbase-0.95-on-hadoop2/0.95-on-hadoop2/hbase-server/target/surefire/surefire4304064810122696638tmp
/x1/jenkins/jenkins-slave/workspace/hbase-0.95-on-hadoop2/0.95-on-hadoop2/hbase-server/target/surefire/surefire_2343631326810676530334tmp
Running org.apache.hadoop.hbase.replication.TestReplicationQueueFailover
Tests run: 1, Failures: 0, Errors: 0, Skipped: 0, Time elapsed: 108.668 sec
Forking command line: /bin/sh -c cd /x1/jenkins/jenkins-slave/workspace/hbase-0.95-on-hadoop2/0.95-on-hadoop2/hbase-server
&& /x1/jenkins/tools/java/jdk1.6.0_45-32/jre/bin/java -enableassertions -Xmx1900m
-Djava.security.egd=file:/dev/./urandom -Djava.net.preferIPv4Stack=true -jar /x1/jenkins/jenkins-slave/workspace/hbase-0.95-on-hadoop2/0.95-on-hadoop2/hbase-server/target/surefire/surefirebooter2881262508424164743.jar
/x1/jenkins/jenkins-slave/workspace/hbase-0.95-on-hadoop2/0.95-on-hadoop2/hbase-server/target/surefire/surefire8979626655657566889tmp
/x1/jenkins/jenkins-slave/workspace/hbase-0.95-on-hadoop2/0.95-on-hadoop2/hbase-server/target/surefire/surefire_2359075407954458335657tmp
Running org.apache.hadoop.hbase.util.TestFSUtils
Tests run: 7, Failures: 0, Errors: 0, Skipped: 0, Time elapsed: 10.062 sec
Forking command line: /bin/sh -c cd /x1/jenkins/jenkins-slave/workspace/hbase-0.95-on-hadoop2/0.95-on-hadoop2/hbase-server
&& /x1/jenkins/tools/java/jdk1.6.0_45-32/jre/bin/java -enableassertions -Xmx1900m
-Djava.security.egd=file:/dev/./urandom -Djava.net.preferIPv4Stack=true -jar /x1/jenkins/jenkins-slave/workspace/hbase-0.95-on-hadoop2/0.95-on-hadoop2/hbase-server/target/surefire/surefirebooter3702046706163562794.jar
/x1/jenkins/jenkins-slave/workspace/hbase-0.95-on-hadoop2/0.95-on-hadoop2/hbase-server/target/surefire/surefire3623553482940382405tmp
/x1/jenkins/jenkins-slave/workspace/hbase-0.95-on-hadoop2/0.95-on-hadoop2/hbase-server/target/surefire/surefire_2368660071766499205689tmp
Running org.apache.hadoop.hbase.util.TestProcessBasedCluster
Tests run: 1, Failures: 0, Errors: 0, Skipped: 0, Time elapsed: 0.374 sec
Forking command line: /bin/sh -c cd /x1/jenkins/jenkins-slave/workspace/hbase-0.95-on-hadoop2/0.95-on-hadoop2/hbase-server
&& /x1/jenkins/tools/java/jdk1.6.0_45-32/jre/bin/java -enableassertions -Xmx1900m
-Djava.security.egd=file:/dev/./urandom -Djava.net.preferIPv4Stack=true -jar /x1/jenkins/jenkins-slave/workspace/hbase-0.95-on-hadoop2/0.95-on-hadoop2/hbase-server/target/surefire/surefirebooter7823977021393630652.jar
/x1/jenkins/jenkins-slave/workspace/hbase-0.95-on-hadoop2/0.95-on-hadoop2/hbase-server/target/surefire/surefire6811311153943567418tmp
/x1/jenkins/jenkins-slave/workspace/hbase-0.95-on-hadoop2/0.95-on-hadoop2/hbase-server/target/surefire/surefire_2372538190473518027711tmp
Running org.apache.hadoop.hbase.util.TestRegionSplitter
Tests run: 5, Failures: 0, Errors: 0, Skipped: 0, Time elapsed: 10.991 sec
Forking command line: /bin/sh -c cd /x1/jenkins/jenkins-slave/workspace/hbase-0.95-on-hadoop2/0.95-on-hadoop2/hbase-server
&& /x1/jenkins/tools/java/jdk1.6.0_45-32/jre/bin/java -enableassertions -Xmx1900m
-Djava.security.egd=file:/dev/./urandom -Djava.net.preferIPv4Stack=true -jar /x1/jenkins/jenkins-slave/workspace/hbase-0.95-on-hadoop2/0.95-on-hadoop2/hbase-server/target/surefire/surefirebooter2805702972810182414.jar
/x1/jenkins/jenkins-slave/workspace/hbase-0.95-on-hadoop2/0.95-on-hadoop2/hbase-server/target/surefire/surefire3116820261245043578tmp
/x1/jenkins/jenkins-slave/workspace/hbase-0.95-on-hadoop2/0.95-on-hadoop2/hbase-server/target/surefire/surefire_2384290586083490045365tmp
Running org.apache.hadoop.hbase.util.TestCoprocessorScanPolicy
Tests run: 4, Failures: 0, Errors: 0, Skipped: 0, Time elapsed: 16.284 sec
Forking command line: /bin/sh -c cd /x1/jenkins/jenkins-slave/workspace/hbase-0.95-on-hadoop2/0.95-on-hadoop2/hbase-server
&& /x1/jenkins/tools/java/jdk1.6.0_45-32/jre/bin/java -enableassertions -Xmx1900m
-Djava.security.egd=file:/dev/./urandom -Djava.net.preferIPv4Stack=true -jar /x1/jenkins/jenkins-slave/workspace/hbase-0.95-on-hadoop2/0.95-on-hadoop2/hbase-server/target/surefire/surefirebooter7790741472195788949.jar
/x1/jenkins/jenkins-slave/workspace/hbase-0.95-on-hadoop2/0.95-on-hadoop2/hbase-server/target/surefire/surefire272851276864980612tmp
/x1/jenkins/jenkins-slave/workspace/hbase-0.95-on-hadoop2/0.95-on-hadoop2/hbase-server/target/surefire/surefire_2391380179395469713843tmp
Running org.apache.hadoop.hbase.util.TestFSVisitor
Tests run: 3, Failures: 0, Errors: 0, Skipped: 0, Time elapsed: 3.957 sec
Forking command line: /bin/sh -c cd /x1/jenkins/jenkins-slave/workspace/hbase-0.95-on-hadoop2/0.95-on-hadoop2/hbase-server
&& /x1/jenkins/tools/java/jdk1.6.0_45-32/jre/bin/java -enableassertions -Xmx1900m
-Djava.security.egd=file:/dev/./urandom -Djava.net.preferIPv4Stack=true -jar /x1/jenkins/jenkins-slave/workspace/hbase-0.95-on-hadoop2/0.95-on-hadoop2/hbase-server/target/surefire/surefirebooter3279430895163252914.jar
/x1/jenkins/jenkins-slave/workspace/hbase-0.95-on-hadoop2/0.95-on-hadoop2/hbase-server/target/surefire/surefire6422319365959378836tmp
/x1/jenkins/jenkins-slave/workspace/hbase-0.95-on-hadoop2/0.95-on-hadoop2/hbase-server/target/surefire/surefire_2403902796750262487984tmp
Running org.apache.hadoop.hbase.util.hbck.TestOfflineMetaRebuildBase
Tests run: 1, Failures: 0, Errors: 0, Skipped: 0, Time elapsed: 18.43 sec
Forking command line: /bin/sh -c cd /x1/jenkins/jenkins-slave/workspace/hbase-0.95-on-hadoop2/0.95-on-hadoop2/hbase-server
&& /x1/jenkins/tools/java/jdk1.6.0_45-32/jre/bin/java -enableassertions -Xmx1900m
-Djava.security.egd=file:/dev/./urandom -Djava.net.preferIPv4Stack=true -jar /x1/jenkins/jenkins-slave/workspace/hbase-0.95-on-hadoop2/0.95-on-hadoop2/hbase-server/target/surefire/surefirebooter920761826838882488.jar
/x1/jenkins/jenkins-slave/workspace/hbase-0.95-on-hadoop2/0.95-on-hadoop2/hbase-server/target/surefire/surefire2637302213250291322tmp
/x1/jenkins/jenkins-slave/workspace/hbase-0.95-on-hadoop2/0.95-on-hadoop2/hbase-server/target/surefire/surefire_2412659618499124075387tmp
Running org.apache.hadoop.hbase.util.TestMiniClusterLoadEncoded
Tests run: 5, Failures: 0, Errors: 0, Skipped: 0, Time elapsed: 53.512 sec
Forking command line: /bin/sh -c cd /x1/jenkins/jenkins-slave/workspace/hbase-0.95-on-hadoop2/0.95-on-hadoop2/hbase-server
&& /x1/jenkins/tools/java/jdk1.6.0_45-32/jre/bin/java -enableassertions -Xmx1900m
-Djava.security.egd=file:/dev/./urandom -Djava.net.preferIPv4Stack=true -jar /x1/jenkins/jenkins-slave/workspace/hbase-0.95-on-hadoop2/0.95-on-hadoop2/hbase-server/target/surefire/surefirebooter2284071081681868931.jar
/x1/jenkins/jenkins-slave/workspace/hbase-0.95-on-hadoop2/0.95-on-hadoop2/hbase-server/target/surefire/surefire5063866136398637179tmp
/x1/jenkins/jenkins-slave/workspace/hbase-0.95-on-hadoop2/0.95-on-hadoop2/hbase-server/target/surefire/surefire_2422438056172045010574tmp
Running org.apache.hadoop.hbase.util.hbck.TestOfflineMetaRebuildOverlap
Tests run: 1, Failures: 0, Errors: 0, Skipped: 0, Time elapsed: 17.279 sec
Forking command line: /bin/sh -c cd /x1/jenkins/jenkins-slave/workspace/hbase-0.95-on-hadoop2/0.95-on-hadoop2/hbase-server
&& /x1/jenkins/tools/java/jdk1.6.0_45-32/jre/bin/java -enableassertions -Xmx1900m
-Djava.security.egd=file:/dev/./urandom -Djava.net.preferIPv4Stack=true -jar /x1/jenkins/jenkins-slave/workspace/hbase-0.95-on-hadoop2/0.95-on-hadoop2/hbase-server/target/surefire/surefirebooter7805831394485861413.jar
/x1/jenkins/jenkins-slave/workspace/hbase-0.95-on-hadoop2/0.95-on-hadoop2/hbase-server/target/surefire/surefire7890544800478778066tmp
/x1/jenkins/jenkins-slave/workspace/hbase-0.95-on-hadoop2/0.95-on-hadoop2/hbase-server/target/surefire/surefire_2434403195499305862464tmp
Running org.apache.hadoop.hbase.util.TestDefaultEnvironmentEdge
Tests run: 1, Failures: 0, Errors: 0, Skipped: 0, Time elapsed: 0.288 sec
Forking command line: /bin/sh -c cd /x1/jenkins/jenkins-slave/workspace/hbase-0.95-on-hadoop2/0.95-on-hadoop2/hbase-server
&& /x1/jenkins/tools/java/jdk1.6.0_45-32/jre/bin/java -enableassertions -Xmx1900m
-Djava.security.egd=file:/dev/./urandom -Djava.net.preferIPv4Stack=true -jar /x1/jenkins/jenkins-slave/workspace/hbase-0.95-on-hadoop2/0.95-on-hadoop2/hbase-server/target/surefire/surefirebooter3999637444137338913.jar
/x1/jenkins/jenkins-slave/workspace/hbase-0.95-on-hadoop2/0.95-on-hadoop2/hbase-server/target/surefire/surefire7086254247141178337tmp
/x1/jenkins/jenkins-slave/workspace/hbase-0.95-on-hadoop2/0.95-on-hadoop2/hbase-server/target/surefire/surefire_2446694093727561742559tmp
Running org.apache.hadoop.hbase.util.TestMiniClusterLoadParallel
Tests run: 4, Failures: 0, Errors: 0, Skipped: 0, Time elapsed: 98.307 sec
Forking command line: /bin/sh -c cd /x1/jenkins/jenkins-slave/workspace/hbase-0.95-on-hadoop2/0.95-on-hadoop2/hbase-server
&& /x1/jenkins/tools/java/jdk1.6.0_45-32/jre/bin/java -enableassertions -Xmx1900m
-Djava.security.egd=file:/dev/./urandom -Djava.net.preferIPv4Stack=true -jar /x1/jenkins/jenkins-slave/workspace/hbase-0.95-on-hadoop2/0.95-on-hadoop2/hbase-server/target/surefire/surefirebooter2075935065826952873.jar
/x1/jenkins/jenkins-slave/workspace/hbase-0.95-on-hadoop2/0.95-on-hadoop2/hbase-server/target/surefire/surefire3888069092639739160tmp
/x1/jenkins/jenkins-slave/workspace/hbase-0.95-on-hadoop2/0.95-on-hadoop2/hbase-server/target/surefire/surefire_2455935237728228404793tmp
Running org.apache.hadoop.hbase.util.hbck.TestOfflineMetaRebuildHole
Tests run: 1, Failures: 0, Errors: 0, Skipped: 0, Time elapsed: 17.35 sec
Running org.apache.hadoop.hbase.util.TestMiniClusterLoadSequential
Tests run: 4, Failures: 0, Errors: 0, Skipped: 0, Time elapsed: 106.616 sec
Running org.apache.hadoop.hbase.util.TestFSHDFSUtils
Tests run: 2, Failures: 0, Errors: 0, Skipped: 0, Time elapsed: 4.004 sec
Running org.apache.hadoop.hbase.TestInfoServers
Tests run: 3, Failures: 0, Errors: 0, Skipped: 0, Time elapsed: 8.916 sec
Running org.apache.hadoop.hbase.util.TestHBaseFsck
Tests run: 36, Failures: 0, Errors: 0, Skipped: 1, Time elapsed: 225.907 sec

Results :

Failed tests:   testRowCounterNoColumn(org.apache.hadoop.hbase.mapreduce.TestRowCounter)
  testWALPlayer(org.apache.hadoop.hbase.mapreduce.TestWALPlayer): expected:<0> but was:<1>

Tests in error: 
  testWorkerAbort(org.apache.hadoop.hbase.master.TestDistributedLogSplitting): test timed
out after 300000 milliseconds

Tests run: 1460, Failures: 2, Errors: 1, Skipped: 14

[INFO]                                                                         
[INFO] ------------------------------------------------------------------------
[INFO] Skipping HBase
[INFO] This project has been banned from the build due to previous failures.
[INFO] ------------------------------------------------------------------------
[INFO] ------------------------------------------------------------------------
[INFO] Reactor Summary:
[INFO] 
[INFO] HBase ............................................. SUCCESS [8.252s]
[INFO] HBase - Common .................................... SUCCESS [23.617s]
[INFO] HBase - Protocol .................................. SUCCESS [13.645s]
[INFO] HBase - Client .................................... SUCCESS [8.966s]
[INFO] HBase - Prefix Tree ............................... SUCCESS [3.477s]
[INFO] HBase - Hadoop Compatibility ...................... SUCCESS [5.617s]
[INFO] HBase - Hadoop Two Compatibility .................. SUCCESS [3.104s]
[INFO] HBase - Server .................................... FAILURE [34:55.736s]
[INFO] HBase - Integration Tests ......................... SKIPPED
[INFO] HBase - Examples .................................. SKIPPED
[INFO] HBase - Assembly .................................. SKIPPED
[INFO] ------------------------------------------------------------------------
[INFO] BUILD FAILURE
[INFO] ------------------------------------------------------------------------
[INFO] Total time: 36:06.835s
[INFO] Finished at: Fri May 31 09:59:35 UTC 2013
[INFO] Final Memory: 60M/576M
[INFO] ------------------------------------------------------------------------
[ERROR] Failed to execute goal org.apache.maven.plugins:maven-surefire-plugin:2.12-TRUNK-HBASE-2:test
(secondPartTestsExecution) on project hbase-server: There are test failures.
[ERROR] 
[ERROR] Please refer to /x1/jenkins/jenkins-slave/workspace/hbase-0.95-on-hadoop2/0.95-on-hadoop2/hbase-server/target/surefire-reports
for the individual test results.
[ERROR] -> [Help 1]
org.apache.maven.lifecycle.LifecycleExecutionException: Failed to execute goal org.apache.maven.plugins:maven-surefire-plugin:2.12-TRUNK-HBASE-2:test
(secondPartTestsExecution) on project hbase-server: There are test failures.

Please refer to /x1/jenkins/jenkins-slave/workspace/hbase-0.95-on-hadoop2/0.95-on-hadoop2/hbase-server/target/surefire-reports
for the individual test results.
	at org.apache.maven.lifecycle.internal.MojoExecutor.execute(MojoExecutor.java:213)
	at org.apache.maven.lifecycle.internal.MojoExecutor.execute(MojoExecutor.java:153)
	at org.apache.maven.lifecycle.internal.MojoExecutor.execute(MojoExecutor.java:145)
	at org.apache.maven.lifecycle.internal.LifecycleModuleBuilder.buildProject(LifecycleModuleBuilder.java:84)
	at org.apache.maven.lifecycle.internal.LifecycleModuleBuilder.buildProject(LifecycleModuleBuilder.java:59)
	at org.apache.maven.lifecycle.internal.LifecycleStarter.singleThreadedBuild(LifecycleStarter.java:183)
	at org.apache.maven.lifecycle.internal.LifecycleStarter.execute(LifecycleStarter.java:161)
	at org.apache.maven.DefaultMaven.doExecute(DefaultMaven.java:320)
	at org.apache.maven.DefaultMaven.execute(DefaultMaven.java:156)
	at org.apache.maven.cli.MavenCli.execute(MavenCli.java:537)
	at org.apache.maven.cli.MavenCli.doMain(MavenCli.java:196)
	at org.apache.maven.cli.MavenCli.main(MavenCli.java:141)
	at sun.reflect.NativeMethodAccessorImpl.invoke0(Native Method)
	at sun.reflect.NativeMethodAccessorImpl.invoke(NativeMethodAccessorImpl.java:39)
	at sun.reflect.DelegatingMethodAccessorImpl.invoke(DelegatingMethodAccessorImpl.java:25)
	at java.lang.reflect.Method.invoke(Method.java:597)
	at org.codehaus.plexus.classworlds.launcher.Launcher.launchEnhanced(Launcher.java:290)
	at org.codehaus.plexus.classworlds.launcher.Launcher.launch(Launcher.java:230)
	at org.codehaus.plexus.classworlds.launcher.Launcher.mainWithExitCode(Launcher.java:409)
	at org.codehaus.plexus.classworlds.launcher.Launcher.main(Launcher.java:352)
Caused by: org.apache.maven.plugin.MojoFailureException: There are test failures.

Please refer to /x1/jenkins/jenkins-slave/workspace/hbase-0.95-on-hadoop2/0.95-on-hadoop2/hbase-server/target/surefire-reports
for the individual test results.
	at org.apache.maven.plugin.surefire.SurefireHelper.reportExecution(SurefireHelper.java:87)
	at org.apache.maven.plugin.surefire.SurefirePlugin.writeSummary(SurefirePlugin.java:651)
	at org.apache.maven.plugin.surefire.SurefirePlugin.handleSummary(SurefirePlugin.java:625)
	at org.apache.maven.plugin.surefire.AbstractSurefireMojo.executeAfterPreconditionsChecked(AbstractSurefireMojo.java:137)
	at org.apache.maven.plugin.surefire.AbstractSurefireMojo.execute(AbstractSurefireMojo.java:98)
	at org.apache.maven.plugin.DefaultBuildPluginManager.executeMojo(DefaultBuildPluginManager.java:101)
	at org.apache.maven.lifecycle.internal.MojoExecutor.execute(MojoExecutor.java:209)
	... 19 more
[ERROR] 
[ERROR] 
[ERROR] For more information about the errors and possible solutions, please read the following
articles:
[ERROR] [Help 1] http://cwiki.apache.org/confluence/display/MAVEN/MojoFailureException
[ERROR] 
[ERROR] After correcting the problems, you can resume the build with the command
[ERROR]   mvn <goals> -rf :hbase-server
Build step 'Invoke top-level Maven targets' marked build as failure
Archiving artifacts
Recording test results
Updating HBASE-8653
Updating HBASE-8638
Updating HBASE-8658
Updating HBASE-8631
Updating HBASE-8657
Updating HBASE-7244
Updating HBASE-8659

Mime
View raw message