hbase-dev mailing list archives

Site index · List index
Message view « Date » · « Thread »
Top « Date » · « Thread »
From apurt...@apache.org
Subject Build failed in Jenkins: HBase-0.95-Hadoop-2 #247
Date Tue, 14 May 2013 01:08:17 GMT
See <http://54.241.6.143/job/HBase-0.95-Hadoop-2/247/>

------------------------------------------
[...truncated 7696 lines...]
Tests run: 2, Failures: 0, Errors: 0, Skipped: 0, Time elapsed: 18.486 sec
Running org.apache.hadoop.hbase.master.TestRollingRestart
Tests run: 1, Failures: 0, Errors: 0, Skipped: 0, Time elapsed: 43.564 sec
Running org.apache.hadoop.hbase.master.TestAssignmentManagerOnCluster
Tests run: 8, Failures: 0, Errors: 0, Skipped: 0, Time elapsed: 44.509 sec
Running org.apache.hadoop.hbase.master.handler.TestTableDeleteFamilyHandler
Tests run: 1, Failures: 0, Errors: 0, Skipped: 0, Time elapsed: 24.938 sec
Running org.apache.hadoop.hbase.master.handler.TestTableDescriptorModification
Tests run: 3, Failures: 0, Errors: 0, Skipped: 0, Time elapsed: 21.929 sec
Running org.apache.hadoop.hbase.client.TestScannersFromClientSide
Tests run: 4, Failures: 0, Errors: 0, Skipped: 0, Time elapsed: 18.369 sec
Running org.apache.hadoop.hbase.client.TestSnapshotMetadata
Tests run: 4, Failures: 0, Errors: 0, Skipped: 0, Time elapsed: 31.686 sec
Running org.apache.hadoop.hbase.client.TestMetaScanner
Tests run: 1, Failures: 0, Errors: 0, Skipped: 0, Time elapsed: 16.633 sec
Running org.apache.hadoop.hbase.client.TestHTableUtil
Tests run: 2, Failures: 0, Errors: 0, Skipped: 0, Time elapsed: 15.165 sec
Running org.apache.hadoop.hbase.client.TestFromClientSide3
Tests run: 5, Failures: 0, Errors: 0, Skipped: 0, Time elapsed: 70.235 sec
Running org.apache.hadoop.hbase.client.TestMultipleTimestamps
Tests run: 8, Failures: 0, Errors: 0, Skipped: 0, Time elapsed: 20.212 sec
Running org.apache.hadoop.hbase.client.TestClientScannerRPCTimeout
Tests run: 1, Failures: 0, Errors: 0, Skipped: 0, Time elapsed: 19.829 sec
Running org.apache.hadoop.hbase.client.TestCloneSnapshotFromClient
Tests run: 3, Failures: 0, Errors: 0, Skipped: 0, Time elapsed: 97.578 sec
Running org.apache.hadoop.hbase.client.TestFromClientSide
Running org.apache.hadoop.hbase.master.TestDistributedLogSplitting
Tests run: 4, Failures: 0, Errors: 0, Skipped: 0, Time elapsed: 244.712 sec
Tests run: 61, Failures: 0, Errors: 0, Skipped: 3, Time elapsed: 173.288 sec
Running org.apache.hadoop.hbase.client.TestRestoreSnapshotFromClient
Tests run: 3, Failures: 0, Errors: 0, Skipped: 0, Time elapsed: 113.962 sec
Running org.apache.hadoop.hbase.client.TestTimestampsFilter
Tests run: 3, Failures: 0, Errors: 0, Skipped: 0, Time elapsed: 15.225 sec
Running org.apache.hadoop.hbase.client.TestHCM
Tests run: 13, Failures: 0, Errors: 0, Skipped: 0, Time elapsed: 119.094 sec
Running org.apache.hadoop.hbase.client.TestScannerTimeout
Tests run: 4, Failures: 0, Errors: 0, Skipped: 0, Time elapsed: 50.938 sec
Running org.apache.hadoop.hbase.client.TestSnapshotCloneIndependence
Tests run: 6, Failures: 0, Errors: 0, Skipped: 0, Time elapsed: 37.512 sec
Running org.apache.hadoop.hbase.client.TestFromClientSideWithCoprocessor
Tests run: 61, Failures: 0, Errors: 0, Skipped: 3, Time elapsed: 161.896 sec
Running org.apache.hadoop.hbase.client.TestHTablePool$TestHTableReusablePool
Tests run: 8, Failures: 0, Errors: 0, Skipped: 0, Time elapsed: 4.61 sec
Running org.apache.hadoop.hbase.client.TestHTablePool$TestHTableThreadLocalPool
Tests run: 8, Failures: 0, Errors: 0, Skipped: 0, Time elapsed: 21.543 sec
Running org.apache.hadoop.hbase.client.replication.TestReplicationAdmin
Tests run: 1, Failures: 0, Errors: 0, Skipped: 0, Time elapsed: 1.601 sec
Running org.apache.hadoop.hbase.client.TestHTableMultiplexer
Tests run: 1, Failures: 0, Errors: 0, Skipped: 0, Time elapsed: 15.533 sec
Running org.apache.hadoop.hbase.client.TestSnapshotFromClient
Tests run: 3, Failures: 0, Errors: 0, Skipped: 0, Time elapsed: 25.892 sec
Running org.apache.hadoop.hbase.client.TestClientTimeouts
Tests run: 1, Failures: 0, Errors: 0, Skipped: 0, Time elapsed: 22.538 sec
Running org.apache.hadoop.hbase.fs.TestBlockReorder
Tests run: 3, Failures: 0, Errors: 0, Skipped: 0, Time elapsed: 20.174 sec
Running org.apache.hadoop.hbase.replication.regionserver.TestReplicationSourceManager
Tests run: 3, Failures: 0, Errors: 0, Skipped: 0, Time elapsed: 2.622 sec
Running org.apache.hadoop.hbase.replication.regionserver.TestReplicationSink
Tests run: 5, Failures: 0, Errors: 0, Skipped: 0, Time elapsed: 13.374 sec
Running org.apache.hadoop.hbase.client.TestMultiParallel
Tests run: 11, Failures: 0, Errors: 0, Skipped: 0, Time elapsed: 103.178 sec
Running org.apache.hadoop.hbase.client.TestShell
Tests run: 1, Failures: 0, Errors: 0, Skipped: 0, Time elapsed: 80.72 sec
Running org.apache.hadoop.hbase.replication.TestReplicationStateZKImpl
Tests run: 2, Failures: 0, Errors: 0, Skipped: 0, Time elapsed: 2.509 sec
Running org.apache.hadoop.hbase.replication.TestReplicationDisableInactivePeer
Tests run: 1, Failures: 0, Errors: 0, Skipped: 0, Time elapsed: 38.096 sec
Running org.apache.hadoop.hbase.replication.TestMasterReplication
Tests run: 2, Failures: 0, Errors: 0, Skipped: 0, Time elapsed: 38.085 sec
Running org.apache.hadoop.hbase.replication.TestReplicationSource
Tests run: 1, Failures: 0, Errors: 0, Skipped: 0, Time elapsed: 4.585 sec
Running org.apache.hadoop.hbase.replication.TestReplicationZookeeper
Tests run: 4, Failures: 0, Errors: 0, Skipped: 0, Time elapsed: 1.241 sec
Running org.apache.hadoop.hbase.replication.TestReplicationSmallTests
Tests run: 8, Failures: 0, Errors: 0, Skipped: 0, Time elapsed: 85.126 sec
Running org.apache.hadoop.hbase.replication.TestMultiSlaveReplication
Tests run: 1, Failures: 0, Errors: 0, Skipped: 0, Time elapsed: 25.501 sec
Running org.apache.hadoop.hbase.replication.TestReplicationQueueFailover
Tests run: 1, Failures: 0, Errors: 0, Skipped: 0, Time elapsed: 114.644 sec
Running org.apache.hadoop.hbase.filter.TestFilterWithScanLimits
Tests run: 1, Failures: 0, Errors: 0, Skipped: 0, Time elapsed: 15.215 sec
Running org.apache.hadoop.hbase.filter.TestFilterWrapper
Tests run: 1, Failures: 0, Errors: 0, Skipped: 0, Time elapsed: 14.714 sec
Running org.apache.hadoop.hbase.filter.TestColumnRangeFilter
Tests run: 1, Failures: 0, Errors: 0, Skipped: 0, Time elapsed: 19.875 sec
Running org.apache.hadoop.hbase.io.hfile.TestHFileBlockIndex
Tests run: 10, Failures: 0, Errors: 0, Skipped: 0, Time elapsed: 32.974 sec
Running org.apache.hadoop.hbase.io.hfile.TestHFilePerformance
Tests run: 1, Failures: 0, Errors: 0, Skipped: 0, Time elapsed: 21.95 sec
Running org.apache.hadoop.hbase.io.hfile.TestHFileBlock
Tests run: 14, Failures: 0, Errors: 0, Skipped: 0, Time elapsed: 61.556 sec
Running org.apache.hadoop.hbase.io.hfile.TestForceCacheImportantBlocks
Tests run: 2, Failures: 0, Errors: 0, Skipped: 0, Time elapsed: 72.344 sec
Running org.apache.hadoop.hbase.replication.TestReplicationQueueFailoverCompressed
Tests run: 1, Failures: 0, Errors: 0, Skipped: 0, Time elapsed: 113.224 sec
Running org.apache.hadoop.hbase.io.hfile.slab.TestSlabCache
Tests run: 7, Failures: 0, Errors: 0, Skipped: 0, Time elapsed: 36.93 sec
Running org.apache.hadoop.hbase.io.hfile.TestHFileSeek
Tests run: 1, Failures: 0, Errors: 0, Skipped: 0, Time elapsed: 7.696 sec
Running org.apache.hadoop.hbase.client.TestAdmin
Tests run: 43, Failures: 0, Errors: 0, Skipped: 0, Time elapsed: 347.277 sec
Running org.apache.hadoop.hbase.io.hfile.slab.TestSingleSizeCache
Tests run: 5, Failures: 0, Errors: 0, Skipped: 0, Time elapsed: 54.657 sec
Running org.apache.hadoop.hbase.io.encoding.TestBufferedDataBlockEncoder
Tests run: 1, Failures: 0, Errors: 0, Skipped: 0, Time elapsed: 22.025 sec
Running org.apache.hadoop.hbase.io.hfile.TestCacheOnWrite
Tests run: 36, Failures: 0, Errors: 0, Skipped: 0, Time elapsed: 49.324 sec
Running org.apache.hadoop.hbase.io.encoding.TestEncodedSeekers
Tests run: 10, Failures: 0, Errors: 0, Skipped: 0, Time elapsed: 58.631 sec
Running org.apache.hadoop.hbase.io.hfile.TestScannerSelectionUsingTTL
Tests run: 6, Failures: 0, Errors: 0, Skipped: 0, Time elapsed: 65.585 sec
Running org.apache.hadoop.hbase.security.token.TestZKSecretWatcher
Tests run: 1, Failures: 0, Errors: 0, Skipped: 0, Time elapsed: 17.463 sec
Running org.apache.hadoop.hbase.io.TestFileLink
Tests run: 3, Failures: 0, Errors: 0, Skipped: 0, Time elapsed: 21.681 sec
Running org.apache.hadoop.hbase.security.token.TestTokenAuthentication
Tests run: 2, Failures: 0, Errors: 0, Skipped: 0, Time elapsed: 6.823 sec
Running org.apache.hadoop.hbase.security.access.TestZKPermissionsWatcher
Tests run: 1, Failures: 0, Errors: 0, Skipped: 0, Time elapsed: 11.092 sec
Running org.apache.hadoop.hbase.security.access.TestAccessControlFilter
Tests run: 1, Failures: 0, Errors: 0, Skipped: 0, Time elapsed: 14.559 sec
Running org.apache.hadoop.hbase.io.encoding.TestLoadAndSwitchEncodeOnDisk
Tests run: 1, Failures: 0, Errors: 0, Skipped: 0, Time elapsed: 47.4 sec
Running org.apache.hadoop.hbase.security.access.TestTablePermissions
Tests run: 7, Failures: 0, Errors: 0, Skipped: 0, Time elapsed: 25.123 sec
Running org.apache.hadoop.hbase.io.encoding.TestDataBlockEncoders
Tests run: 12, Failures: 0, Errors: 0, Skipped: 0, Time elapsed: 140.882 sec
Running org.apache.hadoop.hbase.io.encoding.TestChangingEncoding
Tests run: 4, Failures: 0, Errors: 0, Skipped: 0, Time elapsed: 166.23 sec
Running org.apache.hadoop.hbase.security.access.TestAccessController
Tests run: 37, Failures: 0, Errors: 0, Skipped: 0, Time elapsed: 133.938 sec

Results :

Failed tests:   testRowCounterHiddenColumn(org.apache.hadoop.hbase.mapreduce.TestRowCounter)
  testMultithreadedTableMapper(org.apache.hadoop.hbase.mapreduce.TestMultithreadedTableMapper)
  testMROnTable(org.apache.hadoop.hbase.mapreduce.TestImportTsv): expected:<0> but was:<1>

Tests in error: 
  testCorrectnessWhenMasterFailOver(org.apache.hadoop.hbase.regionserver.TestRSKilledWhenMasterInitializing):
test timed out after 120000 milliseconds
  testRegionPlacement(org.apache.hadoop.hbase.master.TestRegionPlacement): test timed out
after 180000 milliseconds

Tests run: 1413, Failures: 3, Errors: 2, Skipped: 14

[JENKINS] Recording test results
[INFO]                                                                         
[INFO] ------------------------------------------------------------------------
[INFO] Skipping HBase
[INFO] This project has been banned from the build due to previous failures.
[INFO] ------------------------------------------------------------------------
[INFO]                                                                         
[INFO] ------------------------------------------------------------------------
[INFO] Skipping HBase
[INFO] This project has been banned from the build due to previous failures.
[INFO] ------------------------------------------------------------------------
[INFO] ------------------------------------------------------------------------
[INFO] Reactor Summary:
[INFO] 
[INFO] HBase ............................................. SUCCESS [40.355s]
[INFO] HBase - Common .................................... SUCCESS [2:45.591s]
[INFO] HBase - Protocol .................................. SUCCESS [17.392s]
[INFO] HBase - Client .................................... SUCCESS [11.827s]
[INFO] HBase - Prefix Tree ............................... SUCCESS [5.165s]
[INFO] HBase - Hadoop Compatibility ...................... SUCCESS [1.227s]
[INFO] HBase - Hadoop Two Compatibility .................. SUCCESS [1:19.596s]
[INFO] HBase - Server .................................... FAILURE [46:05.373s]
[INFO] HBase - Integration Tests ......................... SKIPPED
[INFO] HBase - Examples .................................. SKIPPED
[INFO] HBase - Assembly .................................. SKIPPED
[INFO] ------------------------------------------------------------------------
[INFO] BUILD FAILURE
[INFO] ------------------------------------------------------------------------
[INFO] Total time: 51:56.847s
[INFO] Finished at: Tue May 14 01:08:02 UTC 2013
[INFO] Final Memory: 153M/556M
[INFO] ------------------------------------------------------------------------
[JENKINS] Archiving <http://54.241.6.143/job/HBase-0.95-Hadoop-2/ws/hbase-hadoop2-compat/pom.xml>
to /var/lib/jenkins/jobs/HBase-0.95-Hadoop-2/modules/org.apache.hbase$hbase-hadoop2-compat/builds/2013-05-14_00-15-59/archive/org.apache.hbase/hbase-hadoop2-compat/0.97.0-SNAPSHOT/hbase-hadoop2-compat-0.97.0-SNAPSHOT.pom
[JENKINS] Archiving <http://54.241.6.143/job/HBase-0.95-Hadoop-2/ws/hbase-hadoop2-compat/target/hbase-hadoop2-compat-0.97.0-SNAPSHOT.jar>
to /var/lib/jenkins/jobs/HBase-0.95-Hadoop-2/modules/org.apache.hbase$hbase-hadoop2-compat/builds/2013-05-14_00-15-59/archive/org.apache.hbase/hbase-hadoop2-compat/0.97.0-SNAPSHOT/hbase-hadoop2-compat-0.97.0-SNAPSHOT.jar
[JENKINS] Archiving <http://54.241.6.143/job/HBase-0.95-Hadoop-2/ws/hbase-hadoop2-compat/target/hbase-hadoop2-compat-0.97.0-SNAPSHOT-sources.jar>
to /var/lib/jenkins/jobs/HBase-0.95-Hadoop-2/modules/org.apache.hbase$hbase-hadoop2-compat/builds/2013-05-14_00-15-59/archive/org.apache.hbase/hbase-hadoop2-compat/0.97.0-SNAPSHOT/hbase-hadoop2-compat-0.97.0-SNAPSHOT-sources.jar
[JENKINS] Archiving <http://54.241.6.143/job/HBase-0.95-Hadoop-2/ws/hbase-hadoop2-compat/target/hbase-hadoop2-compat-0.97.0-SNAPSHOT-tests.jar>
to /var/lib/jenkins/jobs/HBase-0.95-Hadoop-2/modules/org.apache.hbase$hbase-hadoop2-compat/builds/2013-05-14_00-15-59/archive/org.apache.hbase/hbase-hadoop2-compat/0.97.0-SNAPSHOT/hbase-hadoop2-compat-0.97.0-SNAPSHOT-tests.jar
[JENKINS] Archiving <http://54.241.6.143/job/HBase-0.95-Hadoop-2/ws/hbase-common/pom.xml>
to /var/lib/jenkins/jobs/HBase-0.95-Hadoop-2/modules/org.apache.hbase$hbase-common/builds/2013-05-14_00-15-59/archive/org.apache.hbase/hbase-common/0.97.0-SNAPSHOT/hbase-common-0.97.0-SNAPSHOT.pom
[JENKINS] Archiving <http://54.241.6.143/job/HBase-0.95-Hadoop-2/ws/hbase-common/target/hbase-common-0.97.0-SNAPSHOT.jar>
to /var/lib/jenkins/jobs/HBase-0.95-Hadoop-2/modules/org.apache.hbase$hbase-common/builds/2013-05-14_00-15-59/archive/org.apache.hbase/hbase-common/0.97.0-SNAPSHOT/hbase-common-0.97.0-SNAPSHOT.jar
[JENKINS] Archiving <http://54.241.6.143/job/HBase-0.95-Hadoop-2/ws/hbase-common/target/hbase-common-0.97.0-SNAPSHOT-sources.jar>
to /var/lib/jenkins/jobs/HBase-0.95-Hadoop-2/modules/org.apache.hbase$hbase-common/builds/2013-05-14_00-15-59/archive/org.apache.hbase/hbase-common/0.97.0-SNAPSHOT/hbase-common-0.97.0-SNAPSHOT-sources.jar
[JENKINS] Archiving <http://54.241.6.143/job/HBase-0.95-Hadoop-2/ws/hbase-common/target/hbase-common-0.97.0-SNAPSHOT-tests.jar>
to /var/lib/jenkins/jobs/HBase-0.95-Hadoop-2/modules/org.apache.hbase$hbase-common/builds/2013-05-14_00-15-59/archive/org.apache.hbase/hbase-common/0.97.0-SNAPSHOT/hbase-common-0.97.0-SNAPSHOT-tests.jar
[JENKINS] Archiving <http://54.241.6.143/job/HBase-0.95-Hadoop-2/ws/hbase-hadoop-compat/pom.xml>
to /var/lib/jenkins/jobs/HBase-0.95-Hadoop-2/modules/org.apache.hbase$hbase-hadoop-compat/builds/2013-05-14_00-15-59/archive/org.apache.hbase/hbase-hadoop-compat/0.97.0-SNAPSHOT/hbase-hadoop-compat-0.97.0-SNAPSHOT.pom
[JENKINS] Archiving <http://54.241.6.143/job/HBase-0.95-Hadoop-2/ws/hbase-hadoop-compat/target/hbase-hadoop-compat-0.97.0-SNAPSHOT.jar>
to /var/lib/jenkins/jobs/HBase-0.95-Hadoop-2/modules/org.apache.hbase$hbase-hadoop-compat/builds/2013-05-14_00-15-59/archive/org.apache.hbase/hbase-hadoop-compat/0.97.0-SNAPSHOT/hbase-hadoop-compat-0.97.0-SNAPSHOT.jar
[JENKINS] Archiving <http://54.241.6.143/job/HBase-0.95-Hadoop-2/ws/hbase-hadoop-compat/target/hbase-hadoop-compat-0.97.0-SNAPSHOT-sources.jar>
to /var/lib/jenkins/jobs/HBase-0.95-Hadoop-2/modules/org.apache.hbase$hbase-hadoop-compat/builds/2013-05-14_00-15-59/archive/org.apache.hbase/hbase-hadoop-compat/0.97.0-SNAPSHOT/hbase-hadoop-compat-0.97.0-SNAPSHOT-sources.jar
[JENKINS] Archiving <http://54.241.6.143/job/HBase-0.95-Hadoop-2/ws/hbase-hadoop-compat/target/hbase-hadoop-compat-0.97.0-SNAPSHOT-tests.jar>
to /var/lib/jenkins/jobs/HBase-0.95-Hadoop-2/modules/org.apache.hbase$hbase-hadoop-compat/builds/2013-05-14_00-15-59/archive/org.apache.hbase/hbase-hadoop-compat/0.97.0-SNAPSHOT/hbase-hadoop-compat-0.97.0-SNAPSHOT-tests.jar
[JENKINS] Archiving <http://54.241.6.143/job/HBase-0.95-Hadoop-2/ws/hbase-examples/pom.xml>
to /var/lib/jenkins/jobs/HBase-0.95-Hadoop-2/modules/org.apache.hbase$hbase-examples/builds/2013-05-14_00-15-59/archive/org.apache.hbase/hbase-examples/0.97.0-SNAPSHOT/hbase-examples-0.97.0-SNAPSHOT.pom
[JENKINS] Archiving <http://54.241.6.143/job/HBase-0.95-Hadoop-2/ws/hbase-it/pom.xml>
to /var/lib/jenkins/jobs/HBase-0.95-Hadoop-2/modules/org.apache.hbase$hbase-it/builds/2013-05-14_00-15-59/archive/org.apache.hbase/hbase-it/0.97.0-SNAPSHOT/hbase-it-0.97.0-SNAPSHOT.pom
[JENKINS] Archiving <http://54.241.6.143/job/HBase-0.95-Hadoop-2/ws/pom.xml> to /var/lib/jenkins/jobs/HBase-0.95-Hadoop-2/modules/org.apache.hbase$hbase/builds/2013-05-14_00-15-59/archive/org.apache.hbase/hbase/0.97.0-SNAPSHOT/hbase-0.97.0-SNAPSHOT.pom
[JENKINS] Archiving <http://54.241.6.143/job/HBase-0.95-Hadoop-2/ws/target/hbase-0.97.0-SNAPSHOT-site.xml>
to /var/lib/jenkins/jobs/HBase-0.95-Hadoop-2/modules/org.apache.hbase$hbase/builds/2013-05-14_00-15-59/archive/org.apache.hbase/hbase/0.97.0-SNAPSHOT/hbase-0.97.0-SNAPSHOT-site.xml
[JENKINS] Archiving <http://54.241.6.143/job/HBase-0.95-Hadoop-2/ws/hbase-assembly/pom.xml>
to /var/lib/jenkins/jobs/HBase-0.95-Hadoop-2/modules/org.apache.hbase$hbase-assembly/builds/2013-05-14_00-15-59/archive/org.apache.hbase/hbase-assembly/0.97.0-SNAPSHOT/hbase-assembly-0.97.0-SNAPSHOT.pom
[JENKINS] Archiving <http://54.241.6.143/job/HBase-0.95-Hadoop-2/ws/hbase-client/pom.xml>
to /var/lib/jenkins/jobs/HBase-0.95-Hadoop-2/modules/org.apache.hbase$hbase-client/builds/2013-05-14_00-15-59/archive/org.apache.hbase/hbase-client/0.97.0-SNAPSHOT/hbase-client-0.97.0-SNAPSHOT.pom
[JENKINS] Archiving <http://54.241.6.143/job/HBase-0.95-Hadoop-2/ws/hbase-client/target/hbase-client-0.97.0-SNAPSHOT.jar>
to /var/lib/jenkins/jobs/HBase-0.95-Hadoop-2/modules/org.apache.hbase$hbase-client/builds/2013-05-14_00-15-59/archive/org.apache.hbase/hbase-client/0.97.0-SNAPSHOT/hbase-client-0.97.0-SNAPSHOT.jar
[JENKINS] Archiving <http://54.241.6.143/job/HBase-0.95-Hadoop-2/ws/hbase-client/target/hbase-client-0.97.0-SNAPSHOT-sources.jar>
to /var/lib/jenkins/jobs/HBase-0.95-Hadoop-2/modules/org.apache.hbase$hbase-client/builds/2013-05-14_00-15-59/archive/org.apache.hbase/hbase-client/0.97.0-SNAPSHOT/hbase-client-0.97.0-SNAPSHOT-sources.jar
[JENKINS] Archiving <http://54.241.6.143/job/HBase-0.95-Hadoop-2/ws/hbase-client/target/hbase-client-0.97.0-SNAPSHOT-tests.jar>
to /var/lib/jenkins/jobs/HBase-0.95-Hadoop-2/modules/org.apache.hbase$hbase-client/builds/2013-05-14_00-15-59/archive/org.apache.hbase/hbase-client/0.97.0-SNAPSHOT/hbase-client-0.97.0-SNAPSHOT-tests.jar
[JENKINS] Archiving <http://54.241.6.143/job/HBase-0.95-Hadoop-2/ws/hbase-prefix-tree/pom.xml>
to /var/lib/jenkins/jobs/HBase-0.95-Hadoop-2/modules/org.apache.hbase$hbase-prefix-tree/builds/2013-05-14_00-15-59/archive/org.apache.hbase/hbase-prefix-tree/0.97.0-SNAPSHOT/hbase-prefix-tree-0.97.0-SNAPSHOT.pom
[JENKINS] Archiving <http://54.241.6.143/job/HBase-0.95-Hadoop-2/ws/hbase-prefix-tree/target/hbase-prefix-tree-0.97.0-SNAPSHOT.jar>
to /var/lib/jenkins/jobs/HBase-0.95-Hadoop-2/modules/org.apache.hbase$hbase-prefix-tree/builds/2013-05-14_00-15-59/archive/org.apache.hbase/hbase-prefix-tree/0.97.0-SNAPSHOT/hbase-prefix-tree-0.97.0-SNAPSHOT.jar
[JENKINS] Archiving <http://54.241.6.143/job/HBase-0.95-Hadoop-2/ws/hbase-prefix-tree/target/hbase-prefix-tree-0.97.0-SNAPSHOT-sources.jar>
to /var/lib/jenkins/jobs/HBase-0.95-Hadoop-2/modules/org.apache.hbase$hbase-prefix-tree/builds/2013-05-14_00-15-59/archive/org.apache.hbase/hbase-prefix-tree/0.97.0-SNAPSHOT/hbase-prefix-tree-0.97.0-SNAPSHOT-sources.jar
[JENKINS] Archiving <http://54.241.6.143/job/HBase-0.95-Hadoop-2/ws/hbase-prefix-tree/target/hbase-prefix-tree-0.97.0-SNAPSHOT-tests.jar>
to /var/lib/jenkins/jobs/HBase-0.95-Hadoop-2/modules/org.apache.hbase$hbase-prefix-tree/builds/2013-05-14_00-15-59/archive/org.apache.hbase/hbase-prefix-tree/0.97.0-SNAPSHOT/hbase-prefix-tree-0.97.0-SNAPSHOT-tests.jar
[JENKINS] Archiving <http://54.241.6.143/job/HBase-0.95-Hadoop-2/ws/hbase-protocol/pom.xml>
to /var/lib/jenkins/jobs/HBase-0.95-Hadoop-2/modules/org.apache.hbase$hbase-protocol/builds/2013-05-14_00-15-59/archive/org.apache.hbase/hbase-protocol/0.97.0-SNAPSHOT/hbase-protocol-0.97.0-SNAPSHOT.pom
[JENKINS] Archiving <http://54.241.6.143/job/HBase-0.95-Hadoop-2/ws/hbase-protocol/target/hbase-protocol-0.97.0-SNAPSHOT.jar>
to /var/lib/jenkins/jobs/HBase-0.95-Hadoop-2/modules/org.apache.hbase$hbase-protocol/builds/2013-05-14_00-15-59/archive/org.apache.hbase/hbase-protocol/0.97.0-SNAPSHOT/hbase-protocol-0.97.0-SNAPSHOT.jar
[JENKINS] Archiving <http://54.241.6.143/job/HBase-0.95-Hadoop-2/ws/hbase-protocol/target/hbase-protocol-0.97.0-SNAPSHOT-sources.jar>
to /var/lib/jenkins/jobs/HBase-0.95-Hadoop-2/modules/org.apache.hbase$hbase-protocol/builds/2013-05-14_00-15-59/archive/org.apache.hbase/hbase-protocol/0.97.0-SNAPSHOT/hbase-protocol-0.97.0-SNAPSHOT-sources.jar
[JENKINS] Archiving <http://54.241.6.143/job/HBase-0.95-Hadoop-2/ws/hbase-protocol/target/hbase-protocol-0.97.0-SNAPSHOT-tests.jar>
to /var/lib/jenkins/jobs/HBase-0.95-Hadoop-2/modules/org.apache.hbase$hbase-protocol/builds/2013-05-14_00-15-59/archive/org.apache.hbase/hbase-protocol/0.97.0-SNAPSHOT/hbase-protocol-0.97.0-SNAPSHOT-tests.jar
[JENKINS] Archiving <http://54.241.6.143/job/HBase-0.95-Hadoop-2/ws/hbase-server/pom.xml>
to /var/lib/jenkins/jobs/HBase-0.95-Hadoop-2/modules/org.apache.hbase$hbase-server/builds/2013-05-14_00-15-59/archive/org.apache.hbase/hbase-server/0.97.0-SNAPSHOT/hbase-server-0.97.0-SNAPSHOT.pom
Waiting for Jenkins to finish collecting data
mavenExecutionResult exceptions not empty
message : Failed to execute goal org.apache.maven.plugins:maven-surefire-plugin:2.12-TRUNK-HBASE-2:test
(secondPartTestsExecution) on project hbase-server: Failure or timeout
cause : Failure or timeout
Stack trace : 
org.apache.maven.lifecycle.LifecycleExecutionException: Failed to execute goal org.apache.maven.plugins:maven-surefire-plugin:2.12-TRUNK-HBASE-2:test
(secondPartTestsExecution) on project hbase-server: Failure or timeout
	at org.apache.maven.lifecycle.internal.MojoExecutor.execute(MojoExecutor.java:217)
	at org.apache.maven.lifecycle.internal.MojoExecutor.execute(MojoExecutor.java:153)
	at org.apache.maven.lifecycle.internal.MojoExecutor.execute(MojoExecutor.java:145)
	at org.apache.maven.lifecycle.internal.LifecycleModuleBuilder.buildProject(LifecycleModuleBuilder.java:84)
	at org.apache.maven.lifecycle.internal.LifecycleModuleBuilder.buildProject(LifecycleModuleBuilder.java:59)
	at org.apache.maven.lifecycle.internal.LifecycleStarter.singleThreadedBuild(LifecycleStarter.java:183)
	at org.apache.maven.lifecycle.internal.LifecycleStarter.execute(LifecycleStarter.java:161)
	at org.apache.maven.DefaultMaven.doExecute(DefaultMaven.java:320)
	at org.apache.maven.DefaultMaven.execute(DefaultMaven.java:156)
	at org.jvnet.hudson.maven3.launcher.Maven3Launcher.main(Maven3Launcher.java:79)
	at sun.reflect.NativeMethodAccessorImpl.invoke0(Native Method)
	at sun.reflect.NativeMethodAccessorImpl.invoke(NativeMethodAccessorImpl.java:39)
	at sun.reflect.DelegatingMethodAccessorImpl.invoke(DelegatingMethodAccessorImpl.java:25)
	at java.lang.reflect.Method.invoke(Method.java:597)
	at org.codehaus.plexus.classworlds.launcher.Launcher.launchStandard(Launcher.java:329)
	at org.codehaus.plexus.classworlds.launcher.Launcher.launch(Launcher.java:239)
	at org.jvnet.hudson.maven3.agent.Maven3Main.launch(Maven3Main.java:158)
	at hudson.maven.Maven3Builder.call(Maven3Builder.java:100)
	at hudson.maven.Maven3Builder.call(Maven3Builder.java:66)
	at hudson.remoting.UserRequest.perform(UserRequest.java:118)
	at hudson.remoting.UserRequest.perform(UserRequest.java:48)
	at hudson.remoting.Request$2.run(Request.java:326)
	at hudson.remoting.InterceptingExecutorService$1.call(InterceptingExecutorService.java:72)
	at java.util.concurrent.FutureTask$Sync.innerRun(FutureTask.java:303)
	at java.util.concurrent.FutureTask.run(FutureTask.java:138)
	at java.util.concurrent.ThreadPoolExecutor$Worker.runTask(ThreadPoolExecutor.java:895)
	at java.util.concurrent.ThreadPoolExecutor$Worker.run(ThreadPoolExecutor.java:918)
	at java.lang.Thread.run(Thread.java:662)
Caused by: org.apache.maven.plugin.MojoExecutionException: Failure or timeout
	at org.apache.maven.plugin.surefire.SurefirePlugin.assertNoFailureOrTimeout(SurefirePlugin.java:643)
	at org.apache.maven.plugin.surefire.SurefirePlugin.handleSummary(SurefirePlugin.java:624)
	at org.apache.maven.plugin.surefire.AbstractSurefireMojo.executeAfterPreconditionsChecked(AbstractSurefireMojo.java:137)
	at org.apache.maven.plugin.surefire.AbstractSurefireMojo.execute(AbstractSurefireMojo.java:98)
	at org.apache.maven.plugin.DefaultBuildPluginManager.executeMojo(DefaultBuildPluginManager.java:101)
	at org.apache.maven.lifecycle.internal.MojoExecutor.execute(MojoExecutor.java:209)
	... 27 more
channel stopped

Mime
View raw message