hbase-dev mailing list archives

Site index · List index
Message view « Date » · « Thread »
Top « Date » · « Thread »
From apurt...@apache.org
Subject Build failed in Jenkins: HBase-0.94 #201
Date Tue, 28 May 2013 07:23:18 GMT
See <http://54.241.6.143/job/HBase-0.94/201/>

------------------------------------------
[...truncated 29694 lines...]
Tests run: 4, Failures: 0, Errors: 0, Skipped: 0, Time elapsed: 145.994 sec
Running org.apache.hadoop.hbase.client.replication.TestReplicationAdmin
Tests run: 1, Failures: 0, Errors: 0, Skipped: 0, Time elapsed: 1.316 sec
Running org.apache.hadoop.hbase.client.TestFromClientSide3
Tests run: 1, Failures: 0, Errors: 0, Skipped: 0, Time elapsed: 28.895 sec
Running org.apache.hadoop.hbase.client.TestHConnection
Tests run: 2, Failures: 0, Errors: 0, Skipped: 0, Time elapsed: 40.283 sec
Running org.apache.hadoop.hbase.TestAcidGuarantees
Tests run: 3, Failures: 0, Errors: 0, Skipped: 0, Time elapsed: 96.424 sec
Running org.apache.hadoop.hbase.client.TestShell
Tests run: 1, Failures: 0, Errors: 0, Skipped: 0, Time elapsed: 88.826 sec
Running org.apache.hadoop.hbase.client.TestAdmin
Tests run: 42, Failures: 0, Errors: 0, Skipped: 0, Time elapsed: 132.64 sec
Running org.apache.hadoop.hbase.client.TestHCM
Tests run: 8, Failures: 0, Errors: 0, Skipped: 0, Time elapsed: 35.321 sec
Running org.apache.hadoop.hbase.client.TestTimestampsFilter
Tests run: 3, Failures: 0, Errors: 0, Skipped: 0, Time elapsed: 20.166 sec
Running org.apache.hadoop.hbase.client.TestMetaMigrationRemovingHTD
Tests run: 3, Failures: 0, Errors: 0, Skipped: 0, Time elapsed: 29.129 sec
Running org.apache.hadoop.hbase.client.TestCloneSnapshotFromClient
Tests run: 3, Failures: 0, Errors: 0, Skipped: 0, Time elapsed: 118.372 sec
Running org.apache.hadoop.hbase.client.TestMetaScanner
Tests run: 2, Failures: 0, Errors: 1, Skipped: 0, Time elapsed: 53.514 sec <<< FAILURE!
Running org.apache.hadoop.hbase.client.TestHTablePool$TestHTableReusablePool
Tests run: 8, Failures: 0, Errors: 0, Skipped: 0, Time elapsed: 4.276 sec
Running org.apache.hadoop.hbase.client.TestSnapshotFromClient
Tests run: 3, Failures: 0, Errors: 0, Skipped: 0, Time elapsed: 25.457 sec
Running org.apache.hadoop.hbase.client.TestHTablePool$TestHTableThreadLocalPool
Tests run: 8, Failures: 0, Errors: 0, Skipped: 0, Time elapsed: 20.28 sec
Running org.apache.hadoop.hbase.client.TestHTableUtil
Tests run: 2, Failures: 0, Errors: 0, Skipped: 0, Time elapsed: 15.378 sec
Running org.apache.hadoop.hbase.client.TestFromClientSideWithCoprocessor
Tests run: 59, Failures: 0, Errors: 0, Skipped: 3, Time elapsed: 183.369 sec
Running org.apache.hadoop.hbase.client.TestScannerTimeout
Tests run: 4, Failures: 0, Errors: 0, Skipped: 0, Time elapsed: 51.163 sec
Running org.apache.hadoop.hbase.client.TestMultiParallel
Tests run: 11, Failures: 0, Errors: 0, Skipped: 0, Time elapsed: 58.222 sec
Running org.apache.hadoop.hbase.client.TestMultipleTimestamps
Tests run: 8, Failures: 0, Errors: 0, Skipped: 0, Time elapsed: 25.815 sec
Running org.apache.hadoop.hbase.master.TestDeadServer
Tests run: 1, Failures: 0, Errors: 0, Skipped: 0, Time elapsed: 0.339 sec
Running org.apache.hadoop.hbase.master.TestMasterStatusServlet
Tests run: 5, Failures: 0, Errors: 0, Skipped: 0, Time elapsed: 2.141 sec
Running org.apache.hadoop.hbase.master.TestSplitLogManager
Tests run: 13, Failures: 0, Errors: 0, Skipped: 0, Time elapsed: 83.812 sec
Running org.apache.hadoop.hbase.master.TestMasterFailover
Tests run: 5, Failures: 0, Errors: 0, Skipped: 0, Time elapsed: 89.029 sec
Running org.apache.hadoop.hbase.master.TestAssignmentManager
Tests run: 14, Failures: 0, Errors: 0, Skipped: 0, Time elapsed: 4.234 sec
Running org.apache.hadoop.hbase.client.TestRestoreSnapshotFromClient
Tests run: 3, Failures: 0, Errors: 0, Skipped: 0, Time elapsed: 153.505 sec
Running org.apache.hadoop.hbase.client.TestFromClientSide
Tests run: 59, Failures: 0, Errors: 0, Skipped: 3, Time elapsed: 185.965 sec
Running org.apache.hadoop.hbase.master.TestMXBean
Tests run: 1, Failures: 0, Errors: 0, Skipped: 0, Time elapsed: 14.356 sec
Running org.apache.hadoop.hbase.master.TestMasterFileSystem
Tests run: 1, Failures: 0, Errors: 0, Skipped: 0, Time elapsed: 11.576 sec
Running org.apache.hadoop.hbase.master.TestMasterRestartAfterDisablingTable
Tests run: 1, Failures: 0, Errors: 0, Skipped: 0, Time elapsed: 19.204 sec
Running org.apache.hadoop.hbase.master.TestActiveMasterManager
Tests run: 2, Failures: 0, Errors: 0, Skipped: 0, Time elapsed: 1.551 sec
Running org.apache.hadoop.hbase.master.TestRestartCluster
Tests run: 2, Failures: 0, Errors: 0, Skipped: 0, Time elapsed: 45.356 sec
Running org.apache.hadoop.hbase.master.TestMasterShutdown
Tests run: 2, Failures: 0, Errors: 0, Skipped: 0, Time elapsed: 20.575 sec
Running org.apache.hadoop.hbase.master.handler.TestTableDescriptorModification
Running org.apache.hadoop.hbase.master.handler.TestCreateTableHandler
Tests run: 3, Failures: 0, Errors: 0, Skipped: 0, Time elapsed: 22.658 sec
Tests run: 2, Failures: 0, Errors: 0, Skipped: 0, Time elapsed: 23.768 sec
Running org.apache.hadoop.hbase.master.TestDefaultLoadBalancer
Tests run: 4, Failures: 0, Errors: 0, Skipped: 0, Time elapsed: 2.262 sec
Running org.apache.hadoop.hbase.master.TestRollingRestart
Tests run: 1, Failures: 0, Errors: 0, Skipped: 0, Time elapsed: 52.941 sec
Running org.apache.hadoop.hbase.master.TestClockSkewDetection
Tests run: 1, Failures: 0, Errors: 0, Skipped: 0, Time elapsed: 0.521 sec
Running org.apache.hadoop.hbase.master.TestOpenedRegionHandler
Tests run: 2, Failures: 0, Errors: 0, Skipped: 0, Time elapsed: 16.21 sec
Running org.apache.hadoop.hbase.master.TestHMasterRPCException
Tests run: 1, Failures: 0, Errors: 0, Skipped: 0, Time elapsed: 1.805 sec
Running org.apache.hadoop.hbase.master.snapshot.TestSnapshotFileCache
Tests run: 4, Failures: 0, Errors: 0, Skipped: 0, Time elapsed: 4.683 sec
Running org.apache.hadoop.hbase.master.TestMasterZKSessionRecovery
Tests run: 2, Failures: 0, Errors: 0, Skipped: 0, Time elapsed: 34.289 sec
Running org.apache.hadoop.hbase.master.handler.TestTableDeleteFamilyHandler
Tests run: 1, Failures: 0, Errors: 0, Skipped: 0, Time elapsed: 44.072 sec
Running org.apache.hadoop.hbase.master.TestDistributedLogSplitting
Tests run: 5, Failures: 0, Errors: 0, Skipped: 0, Time elapsed: 133.992 sec
Running org.apache.hadoop.hbase.master.TestMasterTransitions
Tests run: 3, Failures: 0, Errors: 0, Skipped: 3, Time elapsed: 20.457 sec
Running org.apache.hadoop.hbase.master.cleaner.TestLogsCleaner
Tests run: 1, Failures: 0, Errors: 0, Skipped: 0, Time elapsed: 3.438 sec
Running org.apache.hadoop.hbase.master.cleaner.TestHFileCleaner
Tests run: 3, Failures: 0, Errors: 0, Skipped: 0, Time elapsed: 4.794 sec
Running org.apache.hadoop.hbase.master.cleaner.TestSnapshotFromMaster
Tests run: 4, Failures: 0, Errors: 0, Skipped: 0, Time elapsed: 31.91 sec
Running org.apache.hadoop.hbase.master.TestMaster
Tests run: 2, Failures: 0, Errors: 0, Skipped: 0, Time elapsed: 16.495 sec
Running org.apache.hadoop.hbase.master.TestZKBasedOpenCloseRegion
Tests run: 4, Failures: 0, Errors: 0, Skipped: 0, Time elapsed: 20.673 sec
Running org.apache.hadoop.hbase.snapshot.TestExportSnapshot
Tests run: 4, Failures: 0, Errors: 0, Skipped: 0, Time elapsed: 39.113 sec
Running org.apache.hadoop.hbase.snapshot.TestSnapshotDescriptionUtils
Tests run: 2, Failures: 0, Errors: 0, Skipped: 0, Time elapsed: 0.739 sec
Running org.apache.hadoop.hbase.snapshot.TestFlushSnapshotFromClient
Tests run: 5, Failures: 0, Errors: 0, Skipped: 0, Time elapsed: 43.811 sec
Running org.apache.hadoop.hbase.catalog.TestCatalogTracker
Tests run: 10, Failures: 0, Errors: 0, Skipped: 1, Time elapsed: 8.997 sec
Running org.apache.hadoop.hbase.catalog.TestMetaReaderEditorNoCluster
Tests run: 1, Failures: 0, Errors: 0, Skipped: 0, Time elapsed: 4.687 sec
Running org.apache.hadoop.hbase.io.hfile.TestFixedFileTrailer
Tests run: 2, Failures: 0, Errors: 0, Skipped: 0, Time elapsed: 0.895 sec
Running org.apache.hadoop.hbase.TestHBaseTestingUtility
Tests run: 7, Failures: 0, Errors: 0, Skipped: 0, Time elapsed: 64.711 sec
Running org.apache.hadoop.hbase.io.hfile.TestHFileBlockIndex
Tests run: 10, Failures: 0, Errors: 0, Skipped: 0, Time elapsed: 12.203 sec
Running org.apache.hadoop.hbase.io.hfile.TestChecksum
Tests run: 3, Failures: 0, Errors: 0, Skipped: 0, Time elapsed: 1.21 sec
Running org.apache.hadoop.hbase.catalog.TestMetaReaderEditor
Tests run: 5, Failures: 0, Errors: 0, Skipped: 0, Time elapsed: 24.747 sec
Running org.apache.hadoop.hbase.io.hfile.TestHFileBlockCompatibility
Tests run: 10, Failures: 0, Errors: 0, Skipped: 0, Time elapsed: 1.73 sec
Running org.apache.hadoop.hbase.io.hfile.TestHFileSeek
Tests run: 1, Failures: 0, Errors: 0, Skipped: 0, Time elapsed: 7.555 sec
Running org.apache.hadoop.hbase.io.hfile.TestLruBlockCache
Tests run: 16, Failures: 0, Errors: 0, Skipped: 0, Time elapsed: 1.601 sec
Running org.apache.hadoop.hbase.snapshot.TestRestoreFlushSnapshotFromClient
Tests run: 5, Failures: 0, Errors: 0, Skipped: 0, Time elapsed: 110.809 sec
Running org.apache.hadoop.hbase.io.hfile.TestHFilePerformance
Tests run: 1, Failures: 0, Errors: 0, Skipped: 0, Time elapsed: 14.85 sec
Running org.apache.hadoop.hbase.io.hfile.TestHFileBlock
Tests run: 16, Failures: 0, Errors: 0, Skipped: 0, Time elapsed: 57.58 sec
Running org.apache.hadoop.hbase.io.hfile.TestCacheOnWrite
Tests run: 36, Failures: 0, Errors: 0, Skipped: 0, Time elapsed: 84.934 sec
Running org.apache.hadoop.hbase.io.hfile.TestForceCacheImportantBlocks
Tests run: 4, Failures: 0, Errors: 0, Skipped: 0, Time elapsed: 103.513 sec
Running org.apache.hadoop.hbase.io.hfile.slab.TestSlabCache
Tests run: 7, Failures: 0, Errors: 0, Skipped: 0, Time elapsed: 40.81 sec
Running org.apache.hadoop.hbase.io.hfile.slab.TestSingleSizeCache
Tests run: 5, Failures: 0, Errors: 0, Skipped: 0, Time elapsed: 59.028 sec
Running org.apache.hadoop.hbase.io.encoding.TestLoadAndSwitchEncodeOnDisk
Tests run: 1, Failures: 0, Errors: 0, Skipped: 0, Time elapsed: 35.382 sec
Running org.apache.hadoop.hbase.io.TestFileLink
Tests run: 3, Failures: 0, Errors: 0, Skipped: 0, Time elapsed: 19.527 sec
Running org.apache.hadoop.hbase.TestInfoServers
Tests run: 3, Failures: 0, Errors: 0, Skipped: 0, Time elapsed: 14.249 sec
Running org.apache.hadoop.hbase.io.encoding.TestUpgradeFromHFileV1ToEncoding
Tests run: 1, Failures: 0, Errors: 0, Skipped: 0, Time elapsed: 113.265 sec
Running org.apache.hadoop.hbase.mapreduce.TestWALPlayer
Tests run: 1, Failures: 0, Errors: 0, Skipped: 0, Time elapsed: 55.627 sec
Running org.apache.hadoop.hbase.io.encoding.TestDataBlockEncoders
Tests run: 12, Failures: 0, Errors: 0, Skipped: 0, Time elapsed: 188.608 sec
Running org.apache.hadoop.hbase.io.encoding.TestChangingEncoding
Tests run: 4, Failures: 0, Errors: 0, Skipped: 0, Time elapsed: 312.991 sec
Running org.apache.hadoop.hbase.mapreduce.TestImportExport
Tests run: 4, Failures: 0, Errors: 0, Skipped: 0, Time elapsed: 123.041 sec
Running org.apache.hadoop.hbase.mapreduce.TestTableInputFormatScan1
Tests run: 5, Failures: 0, Errors: 0, Skipped: 0, Time elapsed: 443.687 sec
Running org.apache.hadoop.hbase.mapreduce.TestHFileOutputFormat
Tests run: 10, Failures: 0, Errors: 0, Skipped: 0, Time elapsed: 521.25 sec
Running org.apache.hadoop.hbase.mapreduce.TestLoadIncrementalHFiles
Tests run: 7, Failures: 0, Errors: 0, Skipped: 0, Time elapsed: 33.763 sec
Running org.apache.hadoop.hbase.mapreduce.TestImportTsv
Tests run: 13, Failures: 0, Errors: 0, Skipped: 0, Time elapsed: 319.055 sec
Running org.apache.hadoop.hbase.mapreduce.TestMultiTableInputFormat
Tests run: 5, Failures: 0, Errors: 0, Skipped: 0, Time elapsed: 562.955 sec
Running org.apache.hadoop.hbase.mapreduce.TestTimeRangeMapRed
Tests run: 1, Failures: 0, Errors: 0, Skipped: 0, Time elapsed: 67.001 sec
Running org.apache.hadoop.hbase.mapreduce.TestHLogRecordReader
Tests run: 2, Failures: 0, Errors: 0, Skipped: 0, Time elapsed: 9.013 sec
Running org.apache.hadoop.hbase.mapreduce.TestMultithreadedTableMapper
Tests run: 1, Failures: 0, Errors: 0, Skipped: 0, Time elapsed: 177.581 sec
Running org.apache.hadoop.hbase.constraint.TestConstraint
Tests run: 5, Failures: 0, Errors: 0, Skipped: 0, Time elapsed: 30.282 sec
Running org.apache.hadoop.hbase.mapreduce.TestLoadIncrementalHFilesSplitRecovery
Tests run: 4, Failures: 0, Errors: 0, Skipped: 0, Time elapsed: 92.682 sec
Running org.apache.hadoop.hbase.mapreduce.TestTableMapReduce
Tests run: 1, Failures: 0, Errors: 0, Skipped: 0, Time elapsed: 172.056 sec
Running org.apache.hadoop.hbase.mapreduce.TestTableInputFormatScan2
Tests run: 7, Failures: 0, Errors: 0, Skipped: 0, Time elapsed: 465.262 sec

Results :

Tests in error: 
  testConcurrentMetaScannerAndCatalogJanitor(org.apache.hadoop.hbase.client.TestMetaScanner):
Split daughter region testConcurrentMetaScannerAndCatalogJanitor,_\xFF\xFF\xFF\xFF\xFF\xFF\xFF,1369724187874.de47c1282a5dcd1020f75fd6efa549af.
cannot be found in META.

Tests run: 1356, Failures: 0, Errors: 1, Skipped: 13

[JENKINS] Recording test results
[INFO] ------------------------------------------------------------------------
[INFO] BUILD FAILURE
[INFO] ------------------------------------------------------------------------
[INFO] Total time: 1:02:31.060s
[INFO] Finished at: Tue May 28 07:23:00 UTC 2013
[INFO] Final Memory: 41M/144M
[INFO] ------------------------------------------------------------------------
[JENKINS] Archiving <http://54.241.6.143/job/HBase-0.94/ws/pom.xml> to /var/lib/jenkins/jobs/HBase-0.94/modules/org.apache.hbase$hbase/builds/2013-05-28_06-20-22/archive/org.apache.hbase/hbase/0.94.8/hbase-0.94.8.pom
Waiting for Jenkins to finish collecting data
mavenExecutionResult exceptions not empty
message : Failed to execute goal org.apache.maven.plugins:maven-surefire-plugin:2.12-TRUNK-HBASE-2:test
(secondPartTestsExecution) on project hbase: There are test failures.

Please refer to <http://54.241.6.143/job/HBase-0.94/ws/target/surefire-reports> for
the individual test results.
cause : There are test failures.

Please refer to <http://54.241.6.143/job/HBase-0.94/ws/target/surefire-reports> for
the individual test results.
Stack trace : 
org.apache.maven.lifecycle.LifecycleExecutionException: Failed to execute goal org.apache.maven.plugins:maven-surefire-plugin:2.12-TRUNK-HBASE-2:test
(secondPartTestsExecution) on project hbase: There are test failures.

Please refer to <http://54.241.6.143/job/HBase-0.94/ws/target/surefire-reports> for
the individual test results.
	at org.apache.maven.lifecycle.internal.MojoExecutor.execute(MojoExecutor.java:213)
	at org.apache.maven.lifecycle.internal.MojoExecutor.execute(MojoExecutor.java:153)
	at org.apache.maven.lifecycle.internal.MojoExecutor.execute(MojoExecutor.java:145)
	at org.apache.maven.lifecycle.internal.LifecycleModuleBuilder.buildProject(LifecycleModuleBuilder.java:84)
	at org.apache.maven.lifecycle.internal.LifecycleModuleBuilder.buildProject(LifecycleModuleBuilder.java:59)
	at org.apache.maven.lifecycle.internal.LifecycleStarter.singleThreadedBuild(LifecycleStarter.java:183)
	at org.apache.maven.lifecycle.internal.LifecycleStarter.execute(LifecycleStarter.java:161)
	at org.apache.maven.DefaultMaven.doExecute(DefaultMaven.java:320)
	at org.apache.maven.DefaultMaven.execute(DefaultMaven.java:156)
	at org.jvnet.hudson.maven3.launcher.Maven3Launcher.main(Maven3Launcher.java:79)
	at sun.reflect.NativeMethodAccessorImpl.invoke0(Native Method)
	at sun.reflect.NativeMethodAccessorImpl.invoke(NativeMethodAccessorImpl.java:39)
	at sun.reflect.DelegatingMethodAccessorImpl.invoke(DelegatingMethodAccessorImpl.java:25)
	at java.lang.reflect.Method.invoke(Method.java:597)
	at org.codehaus.plexus.classworlds.launcher.Launcher.launchStandard(Launcher.java:329)
	at org.codehaus.plexus.classworlds.launcher.Launcher.launch(Launcher.java:239)
	at org.jvnet.hudson.maven3.agent.Maven3Main.launch(Maven3Main.java:158)
	at hudson.maven.Maven3Builder.call(Maven3Builder.java:100)
	at hudson.maven.Maven3Builder.call(Maven3Builder.java:66)
	at hudson.remoting.UserRequest.perform(UserRequest.java:118)
	at hudson.remoting.UserRequest.perform(UserRequest.java:48)
	at hudson.remoting.Request$2.run(Request.java:326)
	at hudson.remoting.InterceptingExecutorService$1.call(InterceptingExecutorService.java:72)
	at java.util.concurrent.FutureTask$Sync.innerRun(FutureTask.java:303)
	at java.util.concurrent.FutureTask.run(FutureTask.java:138)
	at java.util.concurrent.ThreadPoolExecutor$Worker.runTask(ThreadPoolExecutor.java:895)
	at java.util.concurrent.ThreadPoolExecutor$Worker.run(ThreadPoolExecutor.java:918)
	at java.lang.Thread.run(Thread.java:662)
Caused by: org.apache.maven.plugin.MojoFailureException: There are test failures.

Please refer to <http://54.241.6.143/job/HBase-0.94/ws/target/surefire-reports> for
the individual test results.
	at org.apache.maven.plugin.surefire.SurefireHelper.reportExecution(SurefireHelper.java:87)
	at org.apache.maven.plugin.surefire.SurefirePlugin.writeSummary(SurefirePlugin.java:651)
	at org.apache.maven.plugin.surefire.SurefirePlugin.handleSummary(SurefirePlugin.java:625)
	at org.apache.maven.plugin.surefire.AbstractSurefireMojo.executeAfterPreconditionsChecked(AbstractSurefireMojo.java:137)
	at org.apache.maven.plugin.surefire.AbstractSurefireMojo.execute(AbstractSurefireMojo.java:98)
	at org.apache.maven.plugin.DefaultBuildPluginManager.executeMojo(DefaultBuildPluginManager.java:101)
	at org.apache.maven.lifecycle.internal.MojoExecutor.execute(MojoExecutor.java:209)
	... 27 more
channel stopped
Archiving artifacts

Mime
View raw message