hbase-dev mailing list archives

Site index · List index
Message view « Date » · « Thread »
Top « Date » · « Thread »
From apurt...@apache.org
Subject Build failed in Jenkins: HBase-0.95 #309
Date Thu, 23 May 2013 00:58:10 GMT
See <http://54.241.6.143/job/HBase-0.95/309/changes>

Changes:

[Michael Stack] DOC: Suggestion from our Alejandro

------------------------------------------
[...truncated 4064 lines...]
 T E S T S
-------------------------------------------------------

Results :

Tests run: 0, Failures: 0, Errors: 0, Skipped: 0

[JENKINS] Recording test results
[INFO] 
[INFO] --- maven-dependency-plugin:2.1:build-classpath (create-hbase-generated-classpath)
@ hbase-it ---
Downloading: http://people.apache.org/~garyh/mvn/org/apache/maven/shared/maven-dependency-analyzer/1.1/maven-dependency-analyzer-1.1.pom
Downloading: http://repo.maven.apache.org/maven2/org/apache/maven/shared/maven-dependency-analyzer/1.1/maven-dependency-analyzer-1.1.pom
Downloaded: http://repo.maven.apache.org/maven2/org/apache/maven/shared/maven-dependency-analyzer/1.1/maven-dependency-analyzer-1.1.pom
(5 KB at 76.4 KB/sec)
Downloading: http://people.apache.org/~garyh/mvn/asm/asm/3.0/asm-3.0.pom
Downloading: http://repo.maven.apache.org/maven2/asm/asm/3.0/asm-3.0.pom
Downloaded: http://repo.maven.apache.org/maven2/asm/asm/3.0/asm-3.0.pom (360 B at 27.0 KB/sec)
Downloading: http://people.apache.org/~garyh/mvn/asm/asm-parent/3.0/asm-parent-3.0.pom
Downloading: http://repo.maven.apache.org/maven2/asm/asm-parent/3.0/asm-parent-3.0.pom
Downloaded: http://repo.maven.apache.org/maven2/asm/asm-parent/3.0/asm-parent-3.0.pom (3 KB
at 179.2 KB/sec)
Downloading: http://people.apache.org/~garyh/mvn/org/apache/maven/shared/maven-dependency-tree/1.2/maven-dependency-tree-1.2.pom
Downloading: http://repo.maven.apache.org/maven2/org/apache/maven/shared/maven-dependency-tree/1.2/maven-dependency-tree-1.2.pom
Downloaded: http://repo.maven.apache.org/maven2/org/apache/maven/shared/maven-dependency-tree/1.2/maven-dependency-tree-1.2.pom
(4 KB at 271.3 KB/sec)
Downloading: http://people.apache.org/~garyh/mvn/org/codehaus/plexus/plexus-utils/1.4.6/plexus-utils-1.4.6.jar
Downloading: http://people.apache.org/~garyh/mvn/org/apache/maven/shared/maven-shared-io/1.0/maven-shared-io-1.0.jar
Downloading: http://people.apache.org/~garyh/mvn/org/apache/maven/shared/maven-dependency-tree/1.2/maven-dependency-tree-1.2.jar
Downloading: http://people.apache.org/~garyh/mvn/asm/asm/3.0/asm-3.0.jar
Downloading: http://people.apache.org/~garyh/mvn/org/apache/maven/shared/maven-dependency-analyzer/1.1/maven-dependency-analyzer-1.1.jar
Downloading: http://people.apache.org/~garyh/mvn/commons-collections/commons-collections/2.1/commons-collections-2.1.jar
Downloading: http://people.apache.org/~garyh/mvn/org/apache/maven/doxia/doxia-site-renderer/1.0-alpha-7/doxia-site-renderer-1.0-alpha-7.jar
Downloading: http://people.apache.org/~garyh/mvn/plexus/plexus-utils/1.0.2/plexus-utils-1.0.2.jar
Downloading: http://repo.maven.apache.org/maven2/org/codehaus/plexus/plexus-utils/1.4.6/plexus-utils-1.4.6.jar
Downloading: http://repo.maven.apache.org/maven2/org/apache/maven/shared/maven-shared-io/1.0/maven-shared-io-1.0.jar
Downloading: http://repo.maven.apache.org/maven2/org/apache/maven/shared/maven-dependency-analyzer/1.1/maven-dependency-analyzer-1.1.jar
Downloading: http://repo.maven.apache.org/maven2/org/apache/maven/shared/maven-dependency-tree/1.2/maven-dependency-tree-1.2.jar
Downloading: http://repo.maven.apache.org/maven2/asm/asm/3.0/asm-3.0.jar
Downloaded: http://repo.maven.apache.org/maven2/asm/asm/3.0/asm-3.0.jar (42 KB at 1489.6 KB/sec)
Downloading: http://repo.maven.apache.org/maven2/commons-collections/commons-collections/2.1/commons-collections-2.1.jar
Downloaded: http://repo.maven.apache.org/maven2/org/apache/maven/shared/maven-dependency-analyzer/1.1/maven-dependency-analyzer-1.1.jar
(27 KB at 943.4 KB/sec)
Downloading: http://repo.maven.apache.org/maven2/org/apache/maven/doxia/doxia-site-renderer/1.0-alpha-7/doxia-site-renderer-1.0-alpha-7.jar
Downloaded: http://repo.maven.apache.org/maven2/org/apache/maven/shared/maven-dependency-tree/1.2/maven-dependency-tree-1.2.jar
(34 KB at 1125.0 KB/sec)
Downloaded: http://repo.maven.apache.org/maven2/org/codehaus/plexus/plexus-utils/1.4.6/plexus-utils-1.4.6.jar
(200 KB at 6431.1 KB/sec)
Downloading: http://repo.maven.apache.org/maven2/plexus/plexus-utils/1.0.2/plexus-utils-1.0.2.jar
Downloaded: http://repo.maven.apache.org/maven2/org/apache/maven/shared/maven-shared-io/1.0/maven-shared-io-1.0.jar
(33 KB at 906.5 KB/sec)
Downloaded: http://repo.maven.apache.org/maven2/org/apache/maven/doxia/doxia-site-renderer/1.0-alpha-7/doxia-site-renderer-1.0-alpha-7.jar
(13 KB at 884.3 KB/sec)
Downloaded: http://repo.maven.apache.org/maven2/commons-collections/commons-collections/2.1/commons-collections-2.1.jar
(162 KB at 5972.2 KB/sec)
Downloaded: http://repo.maven.apache.org/maven2/plexus/plexus-utils/1.0.2/plexus-utils-1.0.2.jar
(157 KB at 5800.9 KB/sec)
[INFO] Wrote classpath file '<http://54.241.6.143/job/HBase-0.95/ws/hbase-it/target/../../target/cached_classpath.txt'.>
[INFO] 
[INFO] --- maven-surefire-plugin:2.12-TRUNK-HBASE-2:test (secondPartTestsExecution) @ hbase-it
---
[INFO] Surefire report directory: <http://54.241.6.143/job/HBase-0.95/ws/hbase-it/target/surefire-reports>
[INFO] Using configured provider org.apache.maven.surefire.junitcore.JUnitCoreProvider

-------------------------------------------------------
 T E S T S
-------------------------------------------------------

-------------------------------------------------------
 T E S T S
-------------------------------------------------------

Results :

Tests run: 0, Failures: 0, Errors: 0, Skipped: 0

[JENKINS] Recording test results
[INFO] 
[INFO] --- maven-jar-plugin:2.4:test-jar (default) @ hbase-it ---
[INFO] Building jar: <http://54.241.6.143/job/HBase-0.95/ws/hbase-it/target/hbase-it-0.97.0-SNAPSHOT-tests.jar>
[INFO] 
[INFO] --- maven-jar-plugin:2.4:jar (default-jar) @ hbase-it ---
[INFO] Building jar: <http://54.241.6.143/job/HBase-0.95/ws/hbase-it/target/hbase-it-0.97.0-SNAPSHOT.jar>
[INFO] 
[INFO] --- maven-failsafe-plugin:2.12-TRUNK-HBASE-2:integration-test (integration-test) @
hbase-it ---
Downloading: http://people.apache.org/~garyh/mvn/org/apache/maven/surefire/surefire-junit4/2.12-TRUNK-HBASE-2/surefire-junit4-2.12-TRUNK-HBASE-2.pom
Downloaded: http://people.apache.org/~garyh/mvn/org/apache/maven/surefire/surefire-junit4/2.12-TRUNK-HBASE-2/surefire-junit4-2.12-TRUNK-HBASE-2.pom
(3 KB at 23.9 KB/sec)
Downloading: http://people.apache.org/~garyh/mvn/org/apache/maven/surefire/surefire-junit4/2.12-TRUNK-HBASE-2/surefire-junit4-2.12-TRUNK-HBASE-2.jar
Downloaded: http://people.apache.org/~garyh/mvn/org/apache/maven/surefire/surefire-junit4/2.12-TRUNK-HBASE-2/surefire-junit4-2.12-TRUNK-HBASE-2.jar
(33 KB at 233.5 KB/sec)
[INFO] Failsafe report directory: <http://54.241.6.143/job/HBase-0.95/ws/hbase-it/target/failsafe-reports>
[INFO] Using configured provider org.apache.maven.surefire.junit4.JUnit4Provider

-------------------------------------------------------
 T E S T S
-------------------------------------------------------

-------------------------------------------------------
 T E S T S
-------------------------------------------------------
Running org.apache.hadoop.hbase.mapreduce.IntegrationTestImportTsv
Tests run: 2, Failures: 0, Errors: 2, Skipped: 0, Time elapsed: 2.938 sec <<< FAILURE!
Running org.apache.hadoop.hbase.test.IntegrationTestBigLinkedList
Tests run: 2, Failures: 0, Errors: 2, Skipped: 0, Time elapsed: 3.507 sec <<< FAILURE!
Running org.apache.hadoop.hbase.test.IntegrationTestLoadAndVerify
Tests run: 2, Failures: 0, Errors: 2, Skipped: 0, Time elapsed: 3.495 sec <<< FAILURE!
Running org.apache.hadoop.hbase.IntegrationTestDataIngestSlowDeterministic
Tests run: 2, Failures: 0, Errors: 2, Skipped: 0, Time elapsed: 4.137 sec <<< FAILURE!
Running org.apache.hadoop.hbase.IntegrationTestRebalanceAndKillServersTargeted
Tests run: 2, Failures: 0, Errors: 2, Skipped: 0, Time elapsed: 3.841 sec <<< FAILURE!
Running org.apache.hadoop.hbase.IntegrationTestLazyCfLoading
Tests run: 2, Failures: 0, Errors: 2, Skipped: 0, Time elapsed: 1,452.676 sec <<<
FAILURE!
Running org.apache.hadoop.hbase.IntegrationTestDataIngestWithChaosMonkey
Tests run: 2, Failures: 0, Errors: 2, Skipped: 0, Time elapsed: 3.742 sec <<< FAILURE!
Running org.apache.hadoop.hbase.IntegrationTestManyRegions
Tests run: 2, Failures: 0, Errors: 2, Skipped: 0, Time elapsed: 1,454.257 sec <<<
FAILURE!

Results :

Tests in error: 
  org.apache.hadoop.hbase.mapreduce.IntegrationTestImportTsv: org/apache/hadoop/hbase/test/MetricsAssertHelper
  org.apache.hadoop.hbase.mapreduce.IntegrationTestImportTsv: null not an instance of org.apache.hadoop.hbase.MiniHBaseCluster
  testContinuousIngest(org.apache.hadoop.hbase.test.IntegrationTestBigLinkedList): org/apache/hadoop/hbase/test/MetricsAssertHelper
  testContinuousIngest(org.apache.hadoop.hbase.test.IntegrationTestBigLinkedList): null not
an instance of org.apache.hadoop.hbase.MiniHBaseCluster
  testLoadAndVerify(org.apache.hadoop.hbase.test.IntegrationTestLoadAndVerify): org/apache/hadoop/hbase/test/MetricsAssertHelper
  testLoadAndVerify(org.apache.hadoop.hbase.test.IntegrationTestLoadAndVerify): null not an
instance of org.apache.hadoop.hbase.MiniHBaseCluster
  testDataIngest(org.apache.hadoop.hbase.IntegrationTestDataIngestSlowDeterministic): org/apache/hadoop/hbase/test/MetricsAssertHelper
  testDataIngest(org.apache.hadoop.hbase.IntegrationTestDataIngestSlowDeterministic): null
not an instance of org.apache.hadoop.hbase.MiniHBaseCluster
  testDataIngest(org.apache.hadoop.hbase.IntegrationTestRebalanceAndKillServersTargeted):
org/apache/hadoop/hbase/test/MetricsAssertHelper
  testDataIngest(org.apache.hadoop.hbase.IntegrationTestRebalanceAndKillServersTargeted):
null not an instance of org.apache.hadoop.hbase.MiniHBaseCluster
  testReadersAndWriters(org.apache.hadoop.hbase.IntegrationTestLazyCfLoading): org/apache/hadoop/hbase/test/MetricsAssertHelper
  testReadersAndWriters(org.apache.hadoop.hbase.IntegrationTestLazyCfLoading): Failed after
attempts=10, exceptions:(..)
  testDataIngest(org.apache.hadoop.hbase.IntegrationTestDataIngestWithChaosMonkey): org/apache/hadoop/hbase/test/MetricsAssertHelper
  testDataIngest(org.apache.hadoop.hbase.IntegrationTestDataIngestWithChaosMonkey): null not
an instance of org.apache.hadoop.hbase.MiniHBaseCluster
  testCreateTableWithRegions(org.apache.hadoop.hbase.IntegrationTestManyRegions): org/apache/hadoop/hbase/test/MetricsAssertHelper
  testCreateTableWithRegions(org.apache.hadoop.hbase.IntegrationTestManyRegions): Failed after
attempts=10, exceptions:(..)

Tests run: 16, Failures: 0, Errors: 16, Skipped: 0

[WARNING] File encoding has not been set, using platform encoding UTF-8, i.e. build is platform
dependent!
[JENKINS] Recording test results
[INFO] [INFO] Failsafe report directory: <http://54.241.6.143/job/HBase-0.95/ws/hbase-it/target/failsafe-reports>
[WARNING] File encoding has not been set, using platform encoding UTF-8, i.e. build is platform
dependent!

[INFO] --- maven-failsafe-plugin:2.12-TRUNK-HBASE-2:verify (verify) @ hbase-it ---
[JENKINS] Recording test results
[INFO]                                                                         
[INFO] ------------------------------------------------------------------------
[INFO] Skipping HBase
[INFO] This project has been banned from the build due to previous failures.
[INFO] ------------------------------------------------------------------------
[INFO]                                                                         
[INFO] ------------------------------------------------------------------------
[INFO] Skipping HBase
[INFO] This project has been banned from the build due to previous failures.
[INFO] ------------------------------------------------------------------------
[INFO] ------------------------------------------------------------------------
[INFO] Reactor Summary:
[INFO] 
[INFO] HBase ............................................. SUCCESS [5.171s]
[INFO] HBase - Common .................................... SUCCESS [22.099s]
[INFO] HBase - Protocol .................................. SUCCESS [18.073s]
[INFO] HBase - Client .................................... SUCCESS [9.848s]
[INFO] HBase - Prefix Tree ............................... SUCCESS [4.792s]
[INFO] HBase - Hadoop Compatibility ...................... SUCCESS [6.174s]
[INFO] HBase - Hadoop One Compatibility .................. SUCCESS [2.059s]
[INFO] HBase - Server .................................... SUCCESS [51:58.233s]
[INFO] HBase - Integration Tests ......................... FAILURE [49:00.103s]
[INFO] HBase - Examples .................................. SKIPPED
[INFO] HBase - Assembly .................................. SKIPPED
[INFO] ------------------------------------------------------------------------
[INFO] BUILD FAILURE
[INFO] ------------------------------------------------------------------------
[INFO] Total time: 1:42:15.448s
[INFO] Finished at: Thu May 23 00:57:29 UTC 2013
[INFO] Final Memory: 79M/801M
[INFO] ------------------------------------------------------------------------
[JENKINS] Archiving <http://54.241.6.143/job/HBase-0.95/ws/hbase-common/pom.xml> to
/var/lib/jenkins/jobs/HBase-0.95/modules/org.apache.hbase$hbase-common/builds/2013-05-22_23-15-07/archive/org.apache.hbase/hbase-common/0.97.0-SNAPSHOT/hbase-common-0.97.0-SNAPSHOT.pom
[JENKINS] Archiving <http://54.241.6.143/job/HBase-0.95/ws/hbase-common/target/hbase-common-0.97.0-SNAPSHOT.jar>
to /var/lib/jenkins/jobs/HBase-0.95/modules/org.apache.hbase$hbase-common/builds/2013-05-22_23-15-07/archive/org.apache.hbase/hbase-common/0.97.0-SNAPSHOT/hbase-common-0.97.0-SNAPSHOT.jar
[JENKINS] Archiving <http://54.241.6.143/job/HBase-0.95/ws/hbase-common/target/hbase-common-0.97.0-SNAPSHOT-sources.jar>
to /var/lib/jenkins/jobs/HBase-0.95/modules/org.apache.hbase$hbase-common/builds/2013-05-22_23-15-07/archive/org.apache.hbase/hbase-common/0.97.0-SNAPSHOT/hbase-common-0.97.0-SNAPSHOT-sources.jar
[JENKINS] Archiving <http://54.241.6.143/job/HBase-0.95/ws/hbase-common/target/hbase-common-0.97.0-SNAPSHOT-tests.jar>
to /var/lib/jenkins/jobs/HBase-0.95/modules/org.apache.hbase$hbase-common/builds/2013-05-22_23-15-07/archive/org.apache.hbase/hbase-common/0.97.0-SNAPSHOT/hbase-common-0.97.0-SNAPSHOT-tests.jar
[JENKINS] Archiving <http://54.241.6.143/job/HBase-0.95/ws/hbase-hadoop-compat/pom.xml>
to /var/lib/jenkins/jobs/HBase-0.95/modules/org.apache.hbase$hbase-hadoop-compat/builds/2013-05-22_23-15-07/archive/org.apache.hbase/hbase-hadoop-compat/0.97.0-SNAPSHOT/hbase-hadoop-compat-0.97.0-SNAPSHOT.pom
[JENKINS] Archiving <http://54.241.6.143/job/HBase-0.95/ws/hbase-hadoop-compat/target/hbase-hadoop-compat-0.97.0-SNAPSHOT.jar>
to /var/lib/jenkins/jobs/HBase-0.95/modules/org.apache.hbase$hbase-hadoop-compat/builds/2013-05-22_23-15-07/archive/org.apache.hbase/hbase-hadoop-compat/0.97.0-SNAPSHOT/hbase-hadoop-compat-0.97.0-SNAPSHOT.jar
[JENKINS] Archiving <http://54.241.6.143/job/HBase-0.95/ws/hbase-hadoop-compat/target/hbase-hadoop-compat-0.97.0-SNAPSHOT-sources.jar>
to /var/lib/jenkins/jobs/HBase-0.95/modules/org.apache.hbase$hbase-hadoop-compat/builds/2013-05-22_23-15-07/archive/org.apache.hbase/hbase-hadoop-compat/0.97.0-SNAPSHOT/hbase-hadoop-compat-0.97.0-SNAPSHOT-sources.jar
[JENKINS] Archiving <http://54.241.6.143/job/HBase-0.95/ws/hbase-hadoop-compat/target/hbase-hadoop-compat-0.97.0-SNAPSHOT-tests.jar>
to /var/lib/jenkins/jobs/HBase-0.95/modules/org.apache.hbase$hbase-hadoop-compat/builds/2013-05-22_23-15-07/archive/org.apache.hbase/hbase-hadoop-compat/0.97.0-SNAPSHOT/hbase-hadoop-compat-0.97.0-SNAPSHOT-tests.jar
[JENKINS] Archiving <http://54.241.6.143/job/HBase-0.95/ws/hbase-examples/pom.xml> to
/var/lib/jenkins/jobs/HBase-0.95/modules/org.apache.hbase$hbase-examples/builds/2013-05-22_23-15-07/archive/org.apache.hbase/hbase-examples/0.97.0-SNAPSHOT/hbase-examples-0.97.0-SNAPSHOT.pom
[JENKINS] Archiving <http://54.241.6.143/job/HBase-0.95/ws/hbase-it/pom.xml> to /var/lib/jenkins/jobs/HBase-0.95/modules/org.apache.hbase$hbase-it/builds/2013-05-22_23-15-07/archive/org.apache.hbase/hbase-it/0.97.0-SNAPSHOT/hbase-it-0.97.0-SNAPSHOT.pom
[JENKINS] Archiving <http://54.241.6.143/job/HBase-0.95/ws/hbase-it/target/hbase-it-0.97.0-SNAPSHOT.jar>
to /var/lib/jenkins/jobs/HBase-0.95/modules/org.apache.hbase$hbase-it/builds/2013-05-22_23-15-07/archive/org.apache.hbase/hbase-it/0.97.0-SNAPSHOT/hbase-it-0.97.0-SNAPSHOT.jar
[JENKINS] Archiving <http://54.241.6.143/job/HBase-0.95/ws/hbase-it/target/hbase-it-0.97.0-SNAPSHOT-tests.jar>
to /var/lib/jenkins/jobs/HBase-0.95/modules/org.apache.hbase$hbase-it/builds/2013-05-22_23-15-07/archive/org.apache.hbase/hbase-it/0.97.0-SNAPSHOT/hbase-it-0.97.0-SNAPSHOT-tests.jar
[JENKINS] Archiving <http://54.241.6.143/job/HBase-0.95/ws/pom.xml> to /var/lib/jenkins/jobs/HBase-0.95/modules/org.apache.hbase$hbase/builds/2013-05-22_23-15-07/archive/org.apache.hbase/hbase/0.97.0-SNAPSHOT/hbase-0.97.0-SNAPSHOT.pom
[JENKINS] Archiving <http://54.241.6.143/job/HBase-0.95/ws/target/hbase-0.97.0-SNAPSHOT-site.xml>
to /var/lib/jenkins/jobs/HBase-0.95/modules/org.apache.hbase$hbase/builds/2013-05-22_23-15-07/archive/org.apache.hbase/hbase/0.97.0-SNAPSHOT/hbase-0.97.0-SNAPSHOT-site.xml
[JENKINS] Archiving <http://54.241.6.143/job/HBase-0.95/ws/hbase-assembly/pom.xml> to
/var/lib/jenkins/jobs/HBase-0.95/modules/org.apache.hbase$hbase-assembly/builds/2013-05-22_23-15-07/archive/org.apache.hbase/hbase-assembly/0.97.0-SNAPSHOT/hbase-assembly-0.97.0-SNAPSHOT.pom
[JENKINS] Archiving <http://54.241.6.143/job/HBase-0.95/ws/hbase-client/pom.xml> to
/var/lib/jenkins/jobs/HBase-0.95/modules/org.apache.hbase$hbase-client/builds/2013-05-22_23-15-07/archive/org.apache.hbase/hbase-client/0.97.0-SNAPSHOT/hbase-client-0.97.0-SNAPSHOT.pom
[JENKINS] Archiving <http://54.241.6.143/job/HBase-0.95/ws/hbase-client/target/hbase-client-0.97.0-SNAPSHOT.jar>
to /var/lib/jenkins/jobs/HBase-0.95/modules/org.apache.hbase$hbase-client/builds/2013-05-22_23-15-07/archive/org.apache.hbase/hbase-client/0.97.0-SNAPSHOT/hbase-client-0.97.0-SNAPSHOT.jar
[JENKINS] Archiving <http://54.241.6.143/job/HBase-0.95/ws/hbase-client/target/hbase-client-0.97.0-SNAPSHOT-sources.jar>
to /var/lib/jenkins/jobs/HBase-0.95/modules/org.apache.hbase$hbase-client/builds/2013-05-22_23-15-07/archive/org.apache.hbase/hbase-client/0.97.0-SNAPSHOT/hbase-client-0.97.0-SNAPSHOT-sources.jar
[JENKINS] Archiving <http://54.241.6.143/job/HBase-0.95/ws/hbase-client/target/hbase-client-0.97.0-SNAPSHOT-tests.jar>
to /var/lib/jenkins/jobs/HBase-0.95/modules/org.apache.hbase$hbase-client/builds/2013-05-22_23-15-07/archive/org.apache.hbase/hbase-client/0.97.0-SNAPSHOT/hbase-client-0.97.0-SNAPSHOT-tests.jar
[JENKINS] Archiving <http://54.241.6.143/job/HBase-0.95/ws/hbase-prefix-tree/pom.xml>
to /var/lib/jenkins/jobs/HBase-0.95/modules/org.apache.hbase$hbase-prefix-tree/builds/2013-05-22_23-15-07/archive/org.apache.hbase/hbase-prefix-tree/0.97.0-SNAPSHOT/hbase-prefix-tree-0.97.0-SNAPSHOT.pom
[JENKINS] Archiving <http://54.241.6.143/job/HBase-0.95/ws/hbase-prefix-tree/target/hbase-prefix-tree-0.97.0-SNAPSHOT.jar>
to /var/lib/jenkins/jobs/HBase-0.95/modules/org.apache.hbase$hbase-prefix-tree/builds/2013-05-22_23-15-07/archive/org.apache.hbase/hbase-prefix-tree/0.97.0-SNAPSHOT/hbase-prefix-tree-0.97.0-SNAPSHOT.jar
[JENKINS] Archiving <http://54.241.6.143/job/HBase-0.95/ws/hbase-prefix-tree/target/hbase-prefix-tree-0.97.0-SNAPSHOT-sources.jar>
to /var/lib/jenkins/jobs/HBase-0.95/modules/org.apache.hbase$hbase-prefix-tree/builds/2013-05-22_23-15-07/archive/org.apache.hbase/hbase-prefix-tree/0.97.0-SNAPSHOT/hbase-prefix-tree-0.97.0-SNAPSHOT-sources.jar
[JENKINS] Archiving <http://54.241.6.143/job/HBase-0.95/ws/hbase-prefix-tree/target/hbase-prefix-tree-0.97.0-SNAPSHOT-tests.jar>
to /var/lib/jenkins/jobs/HBase-0.95/modules/org.apache.hbase$hbase-prefix-tree/builds/2013-05-22_23-15-07/archive/org.apache.hbase/hbase-prefix-tree/0.97.0-SNAPSHOT/hbase-prefix-tree-0.97.0-SNAPSHOT-tests.jar
[JENKINS] Archiving <http://54.241.6.143/job/HBase-0.95/ws/hbase-protocol/pom.xml> to
/var/lib/jenkins/jobs/HBase-0.95/modules/org.apache.hbase$hbase-protocol/builds/2013-05-22_23-15-07/archive/org.apache.hbase/hbase-protocol/0.97.0-SNAPSHOT/hbase-protocol-0.97.0-SNAPSHOT.pom
[JENKINS] Archiving <http://54.241.6.143/job/HBase-0.95/ws/hbase-protocol/target/hbase-protocol-0.97.0-SNAPSHOT.jar>
to /var/lib/jenkins/jobs/HBase-0.95/modules/org.apache.hbase$hbase-protocol/builds/2013-05-22_23-15-07/archive/org.apache.hbase/hbase-protocol/0.97.0-SNAPSHOT/hbase-protocol-0.97.0-SNAPSHOT.jar
[JENKINS] Archiving <http://54.241.6.143/job/HBase-0.95/ws/hbase-protocol/target/hbase-protocol-0.97.0-SNAPSHOT-sources.jar>
to /var/lib/jenkins/jobs/HBase-0.95/modules/org.apache.hbase$hbase-protocol/builds/2013-05-22_23-15-07/archive/org.apache.hbase/hbase-protocol/0.97.0-SNAPSHOT/hbase-protocol-0.97.0-SNAPSHOT-sources.jar
[JENKINS] Archiving <http://54.241.6.143/job/HBase-0.95/ws/hbase-protocol/target/hbase-protocol-0.97.0-SNAPSHOT-tests.jar>
to /var/lib/jenkins/jobs/HBase-0.95/modules/org.apache.hbase$hbase-protocol/builds/2013-05-22_23-15-07/archive/org.apache.hbase/hbase-protocol/0.97.0-SNAPSHOT/hbase-protocol-0.97.0-SNAPSHOT-tests.jar
[JENKINS] Archiving <http://54.241.6.143/job/HBase-0.95/ws/hbase-hadoop1-compat/pom.xml>
to /var/lib/jenkins/jobs/HBase-0.95/modules/org.apache.hbase$hbase-hadoop1-compat/builds/2013-05-22_23-15-07/archive/org.apache.hbase/hbase-hadoop1-compat/0.97.0-SNAPSHOT/hbase-hadoop1-compat-0.97.0-SNAPSHOT.pom
[JENKINS] Archiving <http://54.241.6.143/job/HBase-0.95/ws/hbase-hadoop1-compat/target/hbase-hadoop1-compat-0.97.0-SNAPSHOT.jar>
to /var/lib/jenkins/jobs/HBase-0.95/modules/org.apache.hbase$hbase-hadoop1-compat/builds/2013-05-22_23-15-07/archive/org.apache.hbase/hbase-hadoop1-compat/0.97.0-SNAPSHOT/hbase-hadoop1-compat-0.97.0-SNAPSHOT.jar
[JENKINS] Archiving <http://54.241.6.143/job/HBase-0.95/ws/hbase-hadoop1-compat/target/hbase-hadoop1-compat-0.97.0-SNAPSHOT-sources.jar>
to /var/lib/jenkins/jobs/HBase-0.95/modules/org.apache.hbase$hbase-hadoop1-compat/builds/2013-05-22_23-15-07/archive/org.apache.hbase/hbase-hadoop1-compat/0.97.0-SNAPSHOT/hbase-hadoop1-compat-0.97.0-SNAPSHOT-sources.jar
[JENKINS] Archiving <http://54.241.6.143/job/HBase-0.95/ws/hbase-hadoop1-compat/target/hbase-hadoop1-compat-0.97.0-SNAPSHOT-tests.jar>
to /var/lib/jenkins/jobs/HBase-0.95/modules/org.apache.hbase$hbase-hadoop1-compat/builds/2013-05-22_23-15-07/archive/org.apache.hbase/hbase-hadoop1-compat/0.97.0-SNAPSHOT/hbase-hadoop1-compat-0.97.0-SNAPSHOT-tests.jar
[JENKINS] Archiving <http://54.241.6.143/job/HBase-0.95/ws/hbase-server/pom.xml> to
/var/lib/jenkins/jobs/HBase-0.95/modules/org.apache.hbase$hbase-server/builds/2013-05-22_23-15-07/archive/org.apache.hbase/hbase-server/0.97.0-SNAPSHOT/hbase-server-0.97.0-SNAPSHOT.pom
[JENKINS] Archiving <http://54.241.6.143/job/HBase-0.95/ws/hbase-server/target/hbase-server-0.97.0-SNAPSHOT.jar>
to /var/lib/jenkins/jobs/HBase-0.95/modules/org.apache.hbase$hbase-server/builds/2013-05-22_23-15-07/archive/org.apache.hbase/hbase-server/0.97.0-SNAPSHOT/hbase-server-0.97.0-SNAPSHOT.jar
[JENKINS] Archiving <http://54.241.6.143/job/HBase-0.95/ws/hbase-server/target/hbase-server-0.97.0-SNAPSHOT-tests.jar>
to /var/lib/jenkins/jobs/HBase-0.95/modules/org.apache.hbase$hbase-server/builds/2013-05-22_23-15-07/archive/org.apache.hbase/hbase-server/0.97.0-SNAPSHOT/hbase-server-0.97.0-SNAPSHOT-tests.jar
[JENKINS] Archiving <http://54.241.6.143/job/HBase-0.95/ws/hbase-server/target/hbase-server-0.97.0-SNAPSHOT-sources.jar>
to /var/lib/jenkins/jobs/HBase-0.95/modules/org.apache.hbase$hbase-server/builds/2013-05-22_23-15-07/archive/org.apache.hbase/hbase-server/0.97.0-SNAPSHOT/hbase-server-0.97.0-SNAPSHOT-sources.jar
Waiting for Jenkins to finish collecting data
mavenExecutionResult exceptions not empty
message : Failed to execute goal org.apache.maven.plugins:maven-failsafe-plugin:2.12-TRUNK-HBASE-2:verify
(verify) on project hbase-it: There are test failures.

Please refer to <http://54.241.6.143/job/HBase-0.95/ws/hbase-it/target/failsafe-reports>
for the individual test results.
cause : There are test failures.

Please refer to <http://54.241.6.143/job/HBase-0.95/ws/hbase-it/target/failsafe-reports>
for the individual test results.
Stack trace : 
org.apache.maven.lifecycle.LifecycleExecutionException: Failed to execute goal org.apache.maven.plugins:maven-failsafe-plugin:2.12-TRUNK-HBASE-2:verify
(verify) on project hbase-it: There are test failures.

Please refer to <http://54.241.6.143/job/HBase-0.95/ws/hbase-it/target/failsafe-reports>
for the individual test results.
	at org.apache.maven.lifecycle.internal.MojoExecutor.execute(MojoExecutor.java:213)
	at org.apache.maven.lifecycle.internal.MojoExecutor.execute(MojoExecutor.java:153)
	at org.apache.maven.lifecycle.internal.MojoExecutor.execute(MojoExecutor.java:145)
	at org.apache.maven.lifecycle.internal.LifecycleModuleBuilder.buildProject(LifecycleModuleBuilder.java:84)
	at org.apache.maven.lifecycle.internal.LifecycleModuleBuilder.buildProject(LifecycleModuleBuilder.java:59)
	at org.apache.maven.lifecycle.internal.LifecycleStarter.singleThreadedBuild(LifecycleStarter.java:183)
	at org.apache.maven.lifecycle.internal.LifecycleStarter.execute(LifecycleStarter.java:161)
	at org.apache.maven.DefaultMaven.doExecute(DefaultMaven.java:320)
	at org.apache.maven.DefaultMaven.execute(DefaultMaven.java:156)
	at org.jvnet.hudson.maven3.launcher.Maven3Launcher.main(Maven3Launcher.java:79)
	at sun.reflect.NativeMethodAccessorImpl.invoke0(Native Method)
	at sun.reflect.NativeMethodAccessorImpl.invoke(NativeMethodAccessorImpl.java:39)
	at sun.reflect.DelegatingMethodAccessorImpl.invoke(DelegatingMethodAccessorImpl.java:25)
	at java.lang.reflect.Method.invoke(Method.java:597)
	at org.codehaus.plexus.classworlds.launcher.Launcher.launchStandard(Launcher.java:329)
	at org.codehaus.plexus.classworlds.launcher.Launcher.launch(Launcher.java:239)
	at org.jvnet.hudson.maven3.agent.Maven3Main.launch(Maven3Main.java:158)
	at hudson.maven.Maven3Builder.call(Maven3Builder.java:100)
	at hudson.maven.Maven3Builder.call(Maven3Builder.java:66)
	at hudson.remoting.UserRequest.perform(UserRequest.java:118)
	at hudson.remoting.UserRequest.perform(UserRequest.java:48)
	at hudson.remoting.Request$2.run(Request.java:326)
	at hudson.remoting.InterceptingExecutorService$1.call(InterceptingExecutorService.java:72)
	at java.util.concurrent.FutureTask$Sync.innerRun(FutureTask.java:303)
	at java.util.concurrent.FutureTask.run(FutureTask.java:138)
	at java.util.concurrent.ThreadPoolExecutor$Worker.runTask(ThreadPoolExecutor.java:895)
	at java.util.concurrent.ThreadPoolExecutor$Worker.run(ThreadPoolExecutor.java:918)
	at java.lang.Thread.run(Thread.java:662)
Caused by: org.apache.maven.plugin.MojoFailureException: There are test failures.

Please refer to <http://54.241.6.143/job/HBase-0.95/ws/hbase-it/target/failsafe-reports>
for the individual test results.
	at org.apache.maven.plugin.surefire.SurefireHelper.reportExecution(SurefireHelper.java:126)
	at org.apache.maven.plugin.failsafe.VerifyMojo.execute(VerifyMojo.java:208)
	at org.apache.maven.plugin.DefaultBuildPluginManager.executeMojo(DefaultBuildPluginManager.java:101)
	at org.apache.maven.lifecycle.internal.MojoExecutor.execute(MojoExecutor.java:209)
	... 27 more
Maven failed with error.
channel stopped

Mime
View raw message