hbase-dev mailing list archives

Site index · List index
Message view « Date » · « Thread »
Top « Date » · « Thread »
From Apache Jenkins Server <jenk...@builds.apache.org>
Subject Build failed in Jenkins: hbase-0.95 #217
Date Mon, 27 May 2013 21:40:51 GMT
See <https://builds.apache.org/job/hbase-0.95/217/changes>

Changes:

[stack] Update doc in 0.95

[stack] Prep for releases

------------------------------------------
[...truncated 3738 lines...]
Running org.apache.hadoop.hbase.regionserver.TestRSKilledWhenMasterInitializing
Tests run: 1, Failures: 0, Errors: 0, Skipped: 0, Time elapsed: 35.43 sec
Running org.apache.hadoop.hbase.regionserver.TestJoinedScanners
Tests run: 1, Failures: 0, Errors: 0, Skipped: 0, Time elapsed: 31.726 sec
Running org.apache.hadoop.hbase.regionserver.TestAtomicOperation
Tests run: 6, Failures: 0, Errors: 0, Skipped: 0, Time elapsed: 20.804 sec
Running org.apache.hadoop.hbase.regionserver.TestHRegionBusyWait
Tests run: 64, Failures: 0, Errors: 0, Skipped: 0, Time elapsed: 42.047 sec
Running org.apache.hadoop.hbase.regionserver.TestRegionFavoredNodes
Tests run: 1, Failures: 0, Errors: 0, Skipped: 1, Time elapsed: 0.48 sec
Running org.apache.hadoop.hbase.regionserver.TestRegionServerNoMaster
Tests run: 7, Failures: 0, Errors: 0, Skipped: 0, Time elapsed: 24.754 sec
Running org.apache.hadoop.hbase.regionserver.TestFSErrorsExposed
Tests run: 3, Failures: 0, Errors: 0, Skipped: 1, Time elapsed: 1.141 sec
Running org.apache.hadoop.hbase.regionserver.TestHRegionOnCluster
Tests run: 1, Failures: 0, Errors: 0, Skipped: 0, Time elapsed: 15.693 sec
Running org.apache.hadoop.hbase.regionserver.TestParallelPut
Tests run: 2, Failures: 0, Errors: 0, Skipped: 0, Time elapsed: 3.642 sec
Running org.apache.hadoop.hbase.regionserver.TestCompoundBloomFilter
Tests run: 3, Failures: 0, Errors: 0, Skipped: 0, Time elapsed: 14.289 sec
Running org.apache.hadoop.hbase.regionserver.TestPriorityRpc
Tests run: 3, Failures: 0, Errors: 0, Skipped: 0, Time elapsed: 1.226 sec
Running org.apache.hadoop.hbase.regionserver.TestServerCustomProtocol
Tests run: 7, Failures: 0, Errors: 0, Skipped: 0, Time elapsed: 39.44 sec
Running org.apache.hadoop.hbase.regionserver.TestSeekOptimizations
Tests run: 6, Failures: 0, Errors: 0, Skipped: 0, Time elapsed: 2.794 sec
Running org.apache.hadoop.hbase.regionserver.handler.TestCloseRegionHandler
Tests run: 3, Failures: 0, Errors: 0, Skipped: 0, Time elapsed: 1.688 sec
Running org.apache.hadoop.hbase.regionserver.handler.TestOpenRegionHandler
Tests run: 5, Failures: 0, Errors: 0, Skipped: 0, Time elapsed: 1.469 sec
Running org.apache.hadoop.hbase.regionserver.TestBlocksRead
Tests run: 4, Failures: 0, Errors: 0, Skipped: 0, Time elapsed: 1.635 sec
Running org.apache.hadoop.hbase.regionserver.TestStoreScanner
Tests run: 16, Failures: 0, Errors: 0, Skipped: 0, Time elapsed: 0.661 sec
Running org.apache.hadoop.hbase.regionserver.TestSplitLogWorker
Tests run: 5, Failures: 0, Errors: 0, Skipped: 0, Time elapsed: 3.011 sec
Running org.apache.hadoop.hbase.regionserver.TestStoreFileBlockCacheSummary
Tests run: 1, Failures: 0, Errors: 0, Skipped: 0, Time elapsed: 10.958 sec
Running org.apache.hadoop.hbase.regionserver.TestCompaction
Tests run: 17, Failures: 0, Errors: 0, Skipped: 0, Time elapsed: 34.167 sec
Running org.apache.hadoop.hbase.regionserver.TestHRegionServerBulkLoad
Tests run: 1, Failures: 0, Errors: 0, Skipped: 0, Time elapsed: 43.831 sec
Running org.apache.hadoop.hbase.regionserver.TestClusterId
Tests run: 1, Failures: 0, Errors: 0, Skipped: 0, Time elapsed: 26.786 sec
Running org.apache.hadoop.hbase.regionserver.TestRegionMergeTransactionOnCluster
Tests run: 2, Failures: 0, Errors: 0, Skipped: 0, Time elapsed: 21.022 sec
Running org.apache.hadoop.hbase.regionserver.TestEndToEndSplitTransaction
Tests run: 2, Failures: 0, Errors: 0, Skipped: 0, Time elapsed: 34.365 sec
Running org.apache.hadoop.hbase.regionserver.TestMasterAddressManager
Tests run: 1, Failures: 0, Errors: 0, Skipped: 0, Time elapsed: 0.762 sec
Running org.apache.hadoop.hbase.regionserver.TestMultiColumnScanner
Tests run: 12, Failures: 0, Errors: 0, Skipped: 0, Time elapsed: 23.102 sec
Running org.apache.hadoop.hbase.regionserver.TestHRegion
Tests run: 63, Failures: 0, Errors: 0, Skipped: 0, Time elapsed: 38.217 sec
Running org.apache.hadoop.hbase.backup.example.TestZooKeeperTableArchiveClient
Tests run: 3, Failures: 0, Errors: 0, Skipped: 0, Time elapsed: 6.252 sec
Running org.apache.hadoop.hbase.TestLocalHBaseCluster
Tests run: 1, Failures: 0, Errors: 0, Skipped: 0, Time elapsed: 8.251 sec
Running org.apache.hadoop.hbase.security.token.TestTokenAuthentication
Tests run: 2, Failures: 0, Errors: 0, Skipped: 0, Time elapsed: 2.097 sec
Running org.apache.hadoop.hbase.security.token.TestZKSecretWatcher
Tests run: 1, Failures: 0, Errors: 0, Skipped: 0, Time elapsed: 15.564 sec
Running org.apache.hadoop.hbase.security.access.TestAccessControlFilter
Tests run: 1, Failures: 0, Errors: 0, Skipped: 0, Time elapsed: 11.671 sec
Running org.apache.hadoop.hbase.security.access.TestZKPermissionsWatcher
Tests run: 1, Failures: 0, Errors: 0, Skipped: 0, Time elapsed: 7.895 sec
Running org.apache.hadoop.hbase.security.access.TestTablePermissions
Tests run: 7, Failures: 0, Errors: 0, Skipped: 0, Time elapsed: 23.633 sec
Running org.apache.hadoop.hbase.backup.TestHFileArchiving
Tests run: 5, Failures: 0, Errors: 0, Skipped: 0, Time elapsed: 170.44 sec
Running org.apache.hadoop.hbase.TestFullLogReconstruction
Tests run: 1, Failures: 0, Errors: 0, Skipped: 0, Time elapsed: 28.315 sec
Running org.apache.hadoop.hbase.ipc.TestDelayedRpc
Tests run: 4, Failures: 0, Errors: 0, Skipped: 0, Time elapsed: 3.55 sec
Running org.apache.hadoop.hbase.ipc.TestHBaseClient
Tests run: 1, Failures: 0, Errors: 0, Skipped: 0, Time elapsed: 0.373 sec
Running org.apache.hadoop.hbase.ipc.TestProtoBufRpc
Tests run: 1, Failures: 0, Errors: 0, Skipped: 0, Time elapsed: 6.492 sec
Running org.apache.hadoop.hbase.TestGlobalMemStoreSize
Tests run: 1, Failures: 0, Errors: 0, Skipped: 0, Time elapsed: 14.136 sec
Running org.apache.hadoop.hbase.security.access.TestAccessController
Tests run: 37, Failures: 0, Errors: 0, Skipped: 0, Time elapsed: 131.29 sec
Running org.apache.hadoop.hbase.constraint.TestConstraint
Tests run: 5, Failures: 0, Errors: 0, Skipped: 0, Time elapsed: 25.38 sec
Running org.apache.hadoop.hbase.rest.TestSchemaResource
Tests run: 2, Failures: 0, Errors: 0, Skipped: 0, Time elapsed: 17.418 sec
Running org.apache.hadoop.hbase.rest.client.TestRemoteAdmin
Tests run: 5, Failures: 1, Errors: 0, Skipped: 0, Time elapsed: 14.36 sec <<< FAILURE!
Running org.apache.hadoop.hbase.rest.client.TestRemoteTable
Tests run: 4, Failures: 0, Errors: 0, Skipped: 0, Time elapsed: 11.451 sec
Running org.apache.hadoop.hbase.rest.TestMultiRowResource
Tests run: 3, Failures: 0, Errors: 0, Skipped: 0, Time elapsed: 11.578 sec
Running org.apache.hadoop.hbase.rest.TestTableResource
Tests run: 8, Failures: 0, Errors: 0, Skipped: 0, Time elapsed: 23.424 sec
Running org.apache.hadoop.hbase.rest.TestGzipFilter
Tests run: 2, Failures: 0, Errors: 0, Skipped: 0, Time elapsed: 11.881 sec
Running org.apache.hadoop.hbase.rest.TestRowResource
Tests run: 12, Failures: 0, Errors: 0, Skipped: 0, Time elapsed: 13.778 sec
Running org.apache.hadoop.hbase.rest.TestVersionResource
Tests run: 7, Failures: 0, Errors: 0, Skipped: 0, Time elapsed: 10.807 sec
Running org.apache.hadoop.hbase.rest.TestStatusResource
Tests run: 2, Failures: 0, Errors: 0, Skipped: 0, Time elapsed: 9.623 sec
Running org.apache.hadoop.hbase.rest.TestScannerResource
Tests run: 5, Failures: 0, Errors: 0, Skipped: 0, Time elapsed: 26.893 sec
Running org.apache.hadoop.hbase.trace.TestHTraceHooks
Tests run: 1, Failures: 0, Errors: 0, Skipped: 0, Time elapsed: 11.292 sec
Running org.apache.hadoop.hbase.rest.TestScannersWithFilters
Tests run: 10, Failures: 0, Errors: 0, Skipped: 0, Time elapsed: 16.001 sec
Running org.apache.hadoop.hbase.io.hfile.TestHFileSeek
Tests run: 1, Failures: 0, Errors: 0, Skipped: 0, Time elapsed: 2.999 sec
Running org.apache.hadoop.hbase.io.hfile.TestHFileBlockIndex
Tests run: 10, Failures: 0, Errors: 0, Skipped: 0, Time elapsed: 7.383 sec
Running org.apache.hadoop.hbase.io.hfile.TestHFilePerformance
Tests run: 1, Failures: 0, Errors: 0, Skipped: 0, Time elapsed: 3.701 sec
Running org.apache.hadoop.hbase.io.hfile.TestForceCacheImportantBlocks
Tests run: 2, Failures: 0, Errors: 0, Skipped: 0, Time elapsed: 17.216 sec
Running org.apache.hadoop.hbase.io.hfile.TestCacheOnWrite
Tests run: 36, Failures: 0, Errors: 0, Skipped: 0, Time elapsed: 22.973 sec
Running org.apache.hadoop.hbase.io.hfile.TestHFileBlock
Tests run: 14, Failures: 0, Errors: 0, Skipped: 0, Time elapsed: 48.15 sec
Running org.apache.hadoop.hbase.io.hfile.TestScannerSelectionUsingTTL
Tests run: 6, Failures: 0, Errors: 0, Skipped: 0, Time elapsed: 61.936 sec
Running org.apache.hadoop.hbase.io.hfile.slab.TestSlabCache
Tests run: 7, Failures: 0, Errors: 0, Skipped: 0, Time elapsed: 14.704 sec
Running org.apache.hadoop.hbase.io.TestFileLink
Tests run: 3, Failures: 0, Errors: 0, Skipped: 0, Time elapsed: 11.364 sec
Running org.apache.hadoop.hbase.io.hfile.slab.TestSingleSizeCache
Tests run: 5, Failures: 0, Errors: 0, Skipped: 0, Time elapsed: 30.196 sec
Running org.apache.hadoop.hbase.io.encoding.TestEncodedSeekers
Tests run: 10, Failures: 0, Errors: 0, Skipped: 0, Time elapsed: 27.826 sec
Running org.apache.hadoop.hbase.io.encoding.TestDataBlockEncoders
Tests run: 12, Failures: 0, Errors: 0, Skipped: 0, Time elapsed: 79.684 sec
Running org.apache.hadoop.hbase.io.encoding.TestBufferedDataBlockEncoder
Tests run: 1, Failures: 0, Errors: 0, Skipped: 0, Time elapsed: 12.963 sec
Running org.apache.hadoop.hbase.io.encoding.TestLoadAndSwitchEncodeOnDisk
Tests run: 1, Failures: 0, Errors: 0, Skipped: 0, Time elapsed: 24.976 sec
Running org.apache.hadoop.hbase.io.encoding.TestChangingEncoding
Tests run: 4, Failures: 0, Errors: 0, Skipped: 0, Time elapsed: 172.735 sec
Running org.apache.hadoop.hbase.TestRegionRebalancing
Tests run: 2, Failures: 0, Errors: 0, Skipped: 0, Time elapsed: 29.05 sec
Running org.apache.hadoop.hbase.mapred.TestTableInputFormat
Tests run: 10, Failures: 0, Errors: 0, Skipped: 0, Time elapsed: 20.96 sec
Running org.apache.hadoop.hbase.replication.TestReplicationDisableInactivePeer
Tests run: 1, Failures: 0, Errors: 0, Skipped: 0, Time elapsed: 40.196 sec
Running org.apache.hadoop.hbase.replication.TestReplicationQueueFailoverCompressed
Tests run: 1, Failures: 0, Errors: 0, Skipped: 0, Time elapsed: 61.705 sec
Running org.apache.hadoop.hbase.mapred.TestTableMapReduce
Tests run: 1, Failures: 0, Errors: 0, Skipped: 0, Time elapsed: 126.189 sec
Running org.apache.hadoop.hbase.replication.TestReplicationZookeeper
Tests run: 4, Failures: 0, Errors: 0, Skipped: 0, Time elapsed: 1.039 sec
Running org.apache.hadoop.hbase.replication.regionserver.TestReplicationSink
Tests run: 5, Failures: 0, Errors: 0, Skipped: 0, Time elapsed: 14.295 sec
Running org.apache.hadoop.hbase.replication.regionserver.TestReplicationSourceManager
Tests run: 3, Failures: 0, Errors: 0, Skipped: 0, Time elapsed: 2.151 sec
Running org.apache.hadoop.hbase.replication.TestReplicationSource
Tests run: 1, Failures: 0, Errors: 0, Skipped: 0, Time elapsed: 3.043 sec
Running org.apache.hadoop.hbase.replication.TestMultiSlaveReplication
Tests run: 1, Failures: 0, Errors: 0, Skipped: 0, Time elapsed: 34.492 sec
Running org.apache.hadoop.hbase.replication.TestReplicationStateZKImpl
Tests run: 3, Failures: 0, Errors: 0, Skipped: 0, Time elapsed: 1.506 sec
Running org.apache.hadoop.hbase.replication.TestReplicationQueueFailover
Tests run: 1, Failures: 0, Errors: 0, Skipped: 0, Time elapsed: 67.233 sec
Running org.apache.hadoop.hbase.replication.TestMasterReplication
Tests run: 2, Failures: 0, Errors: 0, Skipped: 0, Time elapsed: 57.434 sec
Running org.apache.hadoop.hbase.replication.TestReplicationSmallTests
Tests run: 8, Failures: 0, Errors: 0, Skipped: 0, Time elapsed: 67.119 sec
Running org.apache.hadoop.hbase.util.TestFSTableDescriptors
Tests run: 12, Failures: 0, Errors: 0, Skipped: 0, Time elapsed: 1.446 sec
Running org.apache.hadoop.hbase.util.TestIdLock
Tests run: 1, Failures: 0, Errors: 0, Skipped: 0, Time elapsed: 15.408 sec
Running org.apache.hadoop.hbase.util.TestMergeTool
Tests run: 1, Failures: 0, Errors: 0, Skipped: 0, Time elapsed: 27.487 sec
Running org.apache.hadoop.hbase.util.TestMergeTable
Tests run: 1, Failures: 0, Errors: 0, Skipped: 0, Time elapsed: 25.568 sec
Running org.apache.hadoop.hbase.util.TestMiniClusterLoadSequential
Tests run: 4, Failures: 0, Errors: 0, Skipped: 0, Time elapsed: 48.933 sec
Running org.apache.hadoop.hbase.util.TestMiniClusterLoadParallel
Tests run: 4, Failures: 0, Errors: 0, Skipped: 0, Time elapsed: 45.582 sec
Running org.apache.hadoop.hbase.util.TestFSUtils
Tests run: 7, Failures: 0, Errors: 0, Skipped: 0, Time elapsed: 24.88 sec
Running org.apache.hadoop.hbase.util.TestRegionSplitter
Tests run: 5, Failures: 0, Errors: 0, Skipped: 0, Time elapsed: 16.142 sec
Running org.apache.hadoop.hbase.util.TestProcessBasedCluster
Tests run: 1, Failures: 0, Errors: 0, Skipped: 0, Time elapsed: 0.435 sec
Running org.apache.hadoop.hbase.util.TestMiniClusterLoadEncoded
Tests run: 5, Failures: 0, Errors: 0, Skipped: 0, Time elapsed: 48.58 sec
Running org.apache.hadoop.hbase.util.TestCoprocessorScanPolicy
Tests run: 4, Failures: 0, Errors: 0, Skipped: 0, Time elapsed: 20.744 sec
Running org.apache.hadoop.hbase.util.TestFSVisitor
Tests run: 3, Failures: 0, Errors: 0, Skipped: 0, Time elapsed: 1.62 sec
Running org.apache.hadoop.hbase.util.hbck.TestOfflineMetaRebuildBase
Tests run: 1, Failures: 0, Errors: 0, Skipped: 0, Time elapsed: 21.343 sec
Running org.apache.hadoop.hbase.util.hbck.TestOfflineMetaRebuildOverlap
Tests run: 1, Failures: 0, Errors: 0, Skipped: 0, Time elapsed: 22.159 sec
Running org.apache.hadoop.hbase.util.hbck.TestOfflineMetaRebuildHole
Tests run: 1, Failures: 0, Errors: 0, Skipped: 0, Time elapsed: 19.791 sec
Running org.apache.hadoop.hbase.util.TestDefaultEnvironmentEdge
Tests run: 1, Failures: 0, Errors: 0, Skipped: 0, Time elapsed: 0.353 sec
Running org.apache.hadoop.hbase.util.TestFSHDFSUtils
Tests run: 2, Failures: 0, Errors: 0, Skipped: 0, Time elapsed: 3.932 sec
Running org.apache.hadoop.hbase.TestInfoServers
Tests run: 3, Failures: 0, Errors: 0, Skipped: 0, Time elapsed: 12.028 sec
Running org.apache.hadoop.hbase.util.TestHBaseFsck
Tests run: 36, Failures: 0, Errors: 0, Skipped: 1, Time elapsed: 243.586 sec

Results :

Failed tests:   testForceSplitMultiFamily(org.apache.hadoop.hbase.client.TestAdmin)
  testClusterStatus(org.apache.hadoop.hbase.rest.client.TestRemoteAdmin): Region count from
cluster status and returned status did not match up.  expected:<2> but was:<1>

Tests run: 1482, Failures: 2, Errors: 0, Skipped: 14

[INFO] ------------------------------------------------------------------------
[INFO] Reactor Summary:
[INFO] 
[INFO] HBase ............................................. SUCCESS [5.381s]
[INFO] HBase - Common .................................... SUCCESS [20.804s]
[INFO] HBase - Protocol .................................. SUCCESS [6.338s]
[INFO] HBase - Client .................................... SUCCESS [8.231s]
[INFO] HBase - Prefix Tree ............................... SUCCESS [2.918s]
[INFO] HBase - Hadoop Compatibility ...................... SUCCESS [5.478s]
[INFO] HBase - Hadoop One Compatibility .................. SUCCESS [1.632s]
[INFO] HBase - Server .................................... FAILURE [1:27:46.994s]
[INFO] HBase - Integration Tests ......................... SKIPPED
[INFO] HBase - Examples .................................. SKIPPED
[INFO] HBase - Assembly .................................. SKIPPED
[INFO] ------------------------------------------------------------------------
[INFO] BUILD FAILURE
[INFO] ------------------------------------------------------------------------
[INFO] Total time: 1:28:38.271s
[INFO] Finished at: Mon May 27 21:40:31 UTC 2013
[INFO] Final Memory: 34M/990M
[INFO] ------------------------------------------------------------------------
[ERROR] Failed to execute goal org.apache.maven.plugins:maven-surefire-plugin:2.12-TRUNK-HBASE-2:test
(secondPartTestsExecution) on project hbase-server: There are test failures.
[ERROR] 
[ERROR] Please refer to /x1/jenkins/jenkins-slave/workspace/hbase-0.95/0.95/hbase-server/target/surefire-reports
for the individual test results.
[ERROR] -> [Help 1]
[ERROR] 
[ERROR] To see the full stack trace of the errors, re-run Maven with the -e switch.
[ERROR] Re-run Maven using the -X switch to enable full debug logging.
[ERROR] 
[ERROR] For more information about the errors and possible solutions, please read the following
articles:
[ERROR] [Help 1] http://cwiki.apache.org/confluence/display/MAVEN/MojoFailureException
[ERROR] 
[ERROR] After correcting the problems, you can resume the build with the command
[ERROR]   mvn <goals> -rf :hbase-server
Build step 'Invoke top-level Maven targets' marked build as failure
Archiving artifacts
Recording test results

Mime
View raw message