hbase-dev mailing list archives

Site index · List index
Message view « Date » · « Thread »
Top « Date » · « Thread »
From apurt...@apache.org
Subject Build failed in Jenkins: HBase-0.94-Security-Hadoop-2 #138
Date Thu, 16 May 2013 19:28:20 GMT
See <http://54.241.6.143/job/HBase-0.94-Security-Hadoop-2/138/changes>

Changes:

[enis] HBASE-8505 References to split daughters should not be deleted separately from parent
META entry

------------------------------------------
[...truncated 3133 lines...]
Running org.apache.hadoop.hbase.client.TestHCM
Tests run: 8, Failures: 0, Errors: 0, Skipped: 0, Time elapsed: 17.38 sec
Running org.apache.hadoop.hbase.client.TestHConnection
Tests run: 2, Failures: 0, Errors: 0, Skipped: 0, Time elapsed: 37.543 sec
Running org.apache.hadoop.hbase.client.TestFromClientSideWithCoprocessor
Tests run: 59, Failures: 0, Errors: 0, Skipped: 3, Time elapsed: 185.09 sec
Running org.apache.hadoop.hbase.client.TestCloneSnapshotFromClient
Tests run: 3, Failures: 0, Errors: 0, Skipped: 0, Time elapsed: 88.1 sec
Running org.apache.hadoop.hbase.client.TestAdmin
Tests run: 41, Failures: 0, Errors: 0, Skipped: 0, Time elapsed: 127.713 sec
Running org.apache.hadoop.hbase.client.TestMetaMigrationRemovingHTD
Tests run: 3, Failures: 0, Errors: 0, Skipped: 0, Time elapsed: 24.894 sec
Running org.apache.hadoop.hbase.client.TestSnapshotFromClient
Tests run: 3, Failures: 0, Errors: 0, Skipped: 0, Time elapsed: 27.142 sec
Running org.apache.hadoop.hbase.client.TestScannerTimeout
Tests run: 4, Failures: 0, Errors: 0, Skipped: 0, Time elapsed: 53.907 sec
Running org.apache.hadoop.hbase.client.TestMultiParallel
Tests run: 11, Failures: 0, Errors: 0, Skipped: 0, Time elapsed: 39.7 sec
Running org.apache.hadoop.hbase.TestFullLogReconstruction
Tests run: 1, Failures: 0, Errors: 0, Skipped: 0, Time elapsed: 42.184 sec
Running org.apache.hadoop.hbase.procedure.TestZKProcedureControllers
Tests run: 4, Failures: 0, Errors: 0, Skipped: 0, Time elapsed: 2.739 sec
Running org.apache.hadoop.hbase.procedure.TestZKProcedure
Tests run: 4, Failures: 0, Errors: 0, Skipped: 0, Time elapsed: 2.407 sec
Running org.apache.hadoop.hbase.security.access.TestZKPermissionsWatcher
Tests run: 1, Failures: 0, Errors: 0, Skipped: 0, Time elapsed: 12.378 sec
Running org.apache.hadoop.hbase.client.TestFromClientSide
Tests run: 59, Failures: 0, Errors: 0, Skipped: 3, Time elapsed: 180.687 sec
Running org.apache.hadoop.hbase.security.access.TestTablePermissions
Tests run: 6, Failures: 0, Errors: 0, Skipped: 0, Time elapsed: 26.117 sec
Running org.apache.hadoop.hbase.security.access.TestAccessControlFilter
Tests run: 1, Failures: 0, Errors: 0, Skipped: 0, Time elapsed: 14.941 sec
Running org.apache.hadoop.hbase.security.token.TestZKSecretWatcher
Tests run: 1, Failures: 0, Errors: 0, Skipped: 0, Time elapsed: 16.428 sec
Running org.apache.hadoop.hbase.security.token.TestTokenAuthentication
Tests run: 1, Failures: 0, Errors: 0, Skipped: 0, Time elapsed: 12.432 sec
Running org.apache.hadoop.hbase.regionserver.TestParallelPut
Tests run: 2, Failures: 0, Errors: 0, Skipped: 0, Time elapsed: 12.573 sec
Running org.apache.hadoop.hbase.regionserver.TestMasterAddressManager
Tests run: 1, Failures: 0, Errors: 0, Skipped: 0, Time elapsed: 1.801 sec
Running org.apache.hadoop.hbase.security.access.TestAccessController
Tests run: 36, Failures: 0, Errors: 0, Skipped: 0, Time elapsed: 65.642 sec
Running org.apache.hadoop.hbase.regionserver.wal.TestHLog
Tests run: 10, Failures: 0, Errors: 0, Skipped: 0, Time elapsed: 35.385 sec
Running org.apache.hadoop.hbase.regionserver.TestCompactionState
Tests run: 5, Failures: 0, Errors: 0, Skipped: 0, Time elapsed: 69.171 sec
Running org.apache.hadoop.hbase.regionserver.TestHRegionBusyWait
Tests run: 74, Failures: 0, Errors: 0, Skipped: 0, Time elapsed: 70.989 sec
Running org.apache.hadoop.hbase.regionserver.wal.TestHLogSplit
Tests run: 30, Failures: 0, Errors: 0, Skipped: 1, Time elapsed: 78.374 sec
Running org.apache.hadoop.hbase.regionserver.wal.TestLogRollingNoCluster
Tests run: 1, Failures: 0, Errors: 0, Skipped: 0, Time elapsed: 18.157 sec
Running org.apache.hadoop.hbase.regionserver.wal.TestWALReplayCompressed
Tests run: 7, Failures: 0, Errors: 0, Skipped: 0, Time elapsed: 51.013 sec
Running org.apache.hadoop.hbase.regionserver.wal.TestHLogSplitCompressed
Tests run: 30, Failures: 0, Errors: 0, Skipped: 1, Time elapsed: 70.97 sec
Running org.apache.hadoop.hbase.regionserver.wal.TestHLogBench
Tests run: 1, Failures: 0, Errors: 0, Skipped: 0, Time elapsed: 2.836 sec
Running org.apache.hadoop.hbase.regionserver.wal.TestDurability
Tests run: 1, Failures: 0, Errors: 0, Skipped: 0, Time elapsed: 6.148 sec
Running org.apache.hadoop.hbase.regionserver.wal.TestLogRollAbort
Tests run: 1, Failures: 0, Errors: 0, Skipped: 0, Time elapsed: 21.8 sec
Running org.apache.hadoop.hbase.regionserver.TestCacheOnWriteInSchema
Tests run: 3, Failures: 0, Errors: 0, Skipped: 0, Time elapsed: 3.778 sec
Running org.apache.hadoop.hbase.regionserver.wal.TestWALReplay
Tests run: 7, Failures: 0, Errors: 0, Skipped: 0, Time elapsed: 45.305 sec
Running org.apache.hadoop.hbase.regionserver.TestStore
Tests run: 12, Failures: 0, Errors: 0, Skipped: 0, Time elapsed: 22.358 sec
Running org.apache.hadoop.hbase.regionserver.TestHRegionOnCluster
Tests run: 1, Failures: 0, Errors: 0, Skipped: 0, Time elapsed: 30.022 sec
Running org.apache.hadoop.hbase.regionserver.TestFSErrorsExposed
Tests run: 3, Failures: 0, Errors: 0, Skipped: 0, Time elapsed: 43.94 sec
Running org.apache.hadoop.hbase.regionserver.metrics.TestSchemaMetrics
Running org.apache.hadoop.hbase.regionserver.TestStoreFileBlockCacheSummary
Tests run: 1, Failures: 0, Errors: 0, Skipped: 0, Time elapsed: 17.595 sec
Tests run: 6, Failures: 0, Errors: 0, Skipped: 0, Time elapsed: 23.217 sec
Running org.apache.hadoop.hbase.regionserver.wal.TestLogRolling
Tests run: 2, Failures: 0, Errors: 0, Skipped: 0, Time elapsed: 136.795 sec
Running org.apache.hadoop.hbase.regionserver.TestMultiColumnScanner
Tests run: 12, Failures: 0, Errors: 0, Skipped: 0, Time elapsed: 54.226 sec
Running org.apache.hadoop.hbase.regionserver.TestServerCustomProtocol
Tests run: 7, Failures: 0, Errors: 0, Skipped: 0, Time elapsed: 20.167 sec
Running org.apache.hadoop.hbase.regionserver.TestBlocksRead
Tests run: 4, Failures: 0, Errors: 0, Skipped: 0, Time elapsed: 3.892 sec
Running org.apache.hadoop.hbase.regionserver.TestHRegionServerBulkLoad
Tests run: 1, Failures: 0, Errors: 0, Skipped: 0, Time elapsed: 56.653 sec
Running org.apache.hadoop.hbase.regionserver.TestEndToEndSplitTransaction
Tests run: 2, Failures: 0, Errors: 0, Skipped: 0, Time elapsed: 70.916 sec
Running org.apache.hadoop.hbase.regionserver.TestSplitTransactionOnCluster
Tests run: 10, Failures: 0, Errors: 0, Skipped: 0, Time elapsed: 81.545 sec
Running org.apache.hadoop.hbase.regionserver.TestRegionServerMetrics
Tests run: 4, Failures: 0, Errors: 0, Skipped: 0, Time elapsed: 74.407 sec
Running org.apache.hadoop.hbase.regionserver.TestStoreScanner
Tests run: 16, Failures: 0, Errors: 0, Skipped: 0, Time elapsed: 0.159 sec
Running org.apache.hadoop.hbase.regionserver.TestCompactionWithCoprocessor
Tests run: 17, Failures: 0, Errors: 0, Skipped: 0, Time elapsed: 130.12 sec
Running org.apache.hadoop.hbase.regionserver.TestAtomicOperation
Tests run: 5, Failures: 0, Errors: 0, Skipped: 0, Time elapsed: 66.066 sec
Running org.apache.hadoop.hbase.regionserver.TestSeekOptimizations
Tests run: 6, Failures: 0, Errors: 0, Skipped: 0, Time elapsed: 8.857 sec
Running org.apache.hadoop.hbase.regionserver.TestHRegion
Tests run: 73, Failures: 0, Errors: 0, Skipped: 0, Time elapsed: 88.754 sec
Running org.apache.hadoop.hbase.regionserver.handler.TestCloseRegionHandler
Tests run: 3, Failures: 0, Errors: 0, Skipped: 0, Time elapsed: 6.761 sec
Running org.apache.hadoop.hbase.regionserver.TestSplitLogWorker
Tests run: 5, Failures: 0, Errors: 0, Skipped: 0, Time elapsed: 3.952 sec
Running org.apache.hadoop.hbase.regionserver.TestRpcMetrics
Tests run: 1, Failures: 0, Errors: 0, Skipped: 0, Time elapsed: 5.162 sec
Running org.apache.hadoop.hbase.regionserver.handler.TestOpenRegionHandler
Tests run: 4, Failures: 0, Errors: 0, Skipped: 0, Time elapsed: 21.754 sec
Running org.apache.hadoop.hbase.regionserver.TestMXBean
Tests run: 1, Failures: 0, Errors: 0, Skipped: 0, Time elapsed: 17.201 sec
Running org.apache.hadoop.hbase.catalog.TestMetaReaderEditorNoCluster
Tests run: 1, Failures: 0, Errors: 0, Skipped: 0, Time elapsed: 6.591 sec
Running org.apache.hadoop.hbase.TestDrainingServer
Tests run: 2, Failures: 0, Errors: 0, Skipped: 0, Time elapsed: 23.905 sec
Running org.apache.hadoop.hbase.catalog.TestCatalogTracker
Tests run: 10, Failures: 0, Errors: 0, Skipped: 1, Time elapsed: 10.801 sec
Running org.apache.hadoop.hbase.catalog.TestMetaReaderEditor
Tests run: 5, Failures: 0, Errors: 0, Skipped: 0, Time elapsed: 28.201 sec
Running org.apache.hadoop.hbase.ipc.TestPBOnWritableRpc
Tests run: 1, Failures: 0, Errors: 0, Skipped: 0, Time elapsed: 2.03 sec
Running org.apache.hadoop.hbase.ipc.TestDelayedRpc
Tests run: 4, Failures: 0, Errors: 0, Skipped: 0, Time elapsed: 4.237 sec
Running org.apache.hadoop.hbase.TestZooKeeper
Tests run: 9, Failures: 0, Errors: 0, Skipped: 0, Time elapsed: 29.8 sec
Running org.apache.hadoop.hbase.rest.TestMultiRowResource
Tests run: 3, Failures: 0, Errors: 0, Skipped: 0, Time elapsed: 16.255 sec
Running org.apache.hadoop.hbase.TestHBaseTestingUtility
Tests run: 7, Failures: 0, Errors: 0, Skipped: 0, Time elapsed: 50.993 sec
Running org.apache.hadoop.hbase.rest.TestRowResource
Tests run: 11, Failures: 0, Errors: 0, Skipped: 0, Time elapsed: 20.032 sec
Running org.apache.hadoop.hbase.regionserver.TestRSKilledWhenMasterInitializing
Tests run: 2, Failures: 0, Errors: 0, Skipped: 0, Time elapsed: 93.052 sec
Running org.apache.hadoop.hbase.rest.TestGzipFilter
Tests run: 3, Failures: 0, Errors: 0, Skipped: 0, Time elapsed: 26.36 sec
Running org.apache.hadoop.hbase.rest.TestSchemaResource
Tests run: 2, Failures: 0, Errors: 0, Skipped: 0, Time elapsed: 30.344 sec
Running org.apache.hadoop.hbase.rest.TestScannersWithFilters
Tests run: 10, Failures: 0, Errors: 0, Skipped: 0, Time elapsed: 31.624 sec
Running org.apache.hadoop.hbase.rest.TestScannerResource
Tests run: 5, Failures: 0, Errors: 0, Skipped: 0, Time elapsed: 54.756 sec
Running org.apache.hadoop.hbase.rest.TestVersionResource
Tests run: 7, Failures: 0, Errors: 0, Skipped: 0, Time elapsed: 22.694 sec
Running org.apache.hadoop.hbase.rest.client.TestRemoteTable
Tests run: 4, Failures: 0, Errors: 0, Skipped: 0, Time elapsed: 24.53 sec
Running org.apache.hadoop.hbase.rest.client.TestRemoteAdmin
Tests run: 5, Failures: 0, Errors: 0, Skipped: 0, Time elapsed: 25.756 sec
Running org.apache.hadoop.hbase.rest.TestStatusResource
Tests run: 2, Failures: 0, Errors: 0, Skipped: 0, Time elapsed: 22.51 sec
Running org.apache.hadoop.hbase.rest.TestTableResource
Tests run: 8, Failures: 0, Errors: 0, Skipped: 0, Time elapsed: 40.976 sec
Running org.apache.hadoop.hbase.constraint.TestConstraint
Tests run: 5, Failures: 0, Errors: 0, Skipped: 0, Time elapsed: 32.769 sec
Running org.apache.hadoop.hbase.TestMultiVersions
Tests run: 3, Failures: 0, Errors: 0, Skipped: 0, Time elapsed: 26.846 sec

Results :

Failed tests:   testScanOBBToOPP(org.apache.hadoop.hbase.mapreduce.TestTableInputFormatScan2)
  testScanOBBToQPP(org.apache.hadoop.hbase.mapreduce.TestTableInputFormatScan2)
  testScanOPPToEmpty(org.apache.hadoop.hbase.mapreduce.TestTableInputFormatScan2)
  testScanYYXToEmpty(org.apache.hadoop.hbase.mapreduce.TestTableInputFormatScan2)
  testScanYYYToEmpty(org.apache.hadoop.hbase.mapreduce.TestTableInputFormatScan2)
  testScanYZYToEmpty(org.apache.hadoop.hbase.mapreduce.TestTableInputFormatScan2)
  testScanFromConfiguration(org.apache.hadoop.hbase.mapreduce.TestTableInputFormatScan2)
  testScanEmptyToEmpty(org.apache.hadoop.hbase.mapreduce.TestMultiTableInputFormat)
  testScanEmptyToAPP(org.apache.hadoop.hbase.mapreduce.TestMultiTableInputFormat)
  testScanOBBToOPP(org.apache.hadoop.hbase.mapreduce.TestMultiTableInputFormat)
  testScanOPPToEmpty(org.apache.hadoop.hbase.mapreduce.TestMultiTableInputFormat)
  testScanYZYToEmpty(org.apache.hadoop.hbase.mapreduce.TestMultiTableInputFormat)
  testScanEmptyToEmpty(org.apache.hadoop.hbase.mapreduce.TestTableInputFormatScan1)
  testScanEmptyToBBA(org.apache.hadoop.hbase.mapreduce.TestTableInputFormatScan1)
  testScanEmptyToBBB(org.apache.hadoop.hbase.mapreduce.TestTableInputFormatScan1)
  testScanEmptyToOPP(org.apache.hadoop.hbase.mapreduce.TestTableInputFormatScan1)
  testMRIncrementalLoad(org.apache.hadoop.hbase.mapreduce.TestHFileOutputFormat)
  testMRIncrementalLoadWithSplit(org.apache.hadoop.hbase.mapreduce.TestHFileOutputFormat)
  testExcludeAllFromMinorCompaction(org.apache.hadoop.hbase.mapreduce.TestHFileOutputFormat)
  testExcludeMinorCompaction(org.apache.hadoop.hbase.mapreduce.TestHFileOutputFormat)
  testMROnTable(org.apache.hadoop.hbase.mapreduce.TestImportTsv)
  testMROnTableWithTimestamp(org.apache.hadoop.hbase.mapreduce.TestImportTsv)
  testMROnTableWithCustomMapper(org.apache.hadoop.hbase.mapreduce.TestImportTsv)
  testMultithreadedTableMapper(org.apache.hadoop.hbase.mapreduce.TestMultithreadedTableMapper)

Tests in error: 
  testMultiRegionTable(org.apache.hadoop.hbase.mapred.TestTableMapReduce): Job failed!
  org.apache.hadoop.hbase.mapreduce.TestWALPlayer: Failed to Start org.apache.hadoop.mapred.MiniMRCluster
  testSimpleCase(org.apache.hadoop.hbase.mapreduce.TestImportExport)
  testMetaExport(org.apache.hadoop.hbase.mapreduce.TestImportExport)
  testWithDeletes(org.apache.hadoop.hbase.mapreduce.TestImportExport)
  testWithFilter(org.apache.hadoop.hbase.mapreduce.TestImportExport)
  testMultiRegionTable(org.apache.hadoop.hbase.mapreduce.TestTableMapReduce)
  testScanEmptyToAPP(org.apache.hadoop.hbase.mapreduce.TestTableInputFormatScan1)
  testBulkOutputWithoutAnExistingTable(org.apache.hadoop.hbase.mapreduce.TestImportTsv)

Tests run: 1398, Failures: 24, Errors: 9, Skipped: 13

[JENKINS] Recording test results
[INFO] ------------------------------------------------------------------------
[INFO] BUILD FAILURE
[INFO] ------------------------------------------------------------------------
[INFO] Total time: 52:12.647s
[INFO] Finished at: Thu May 16 19:28:17 UTC 2013
[INFO] Final Memory: 133M/461M
[INFO] ------------------------------------------------------------------------
[JENKINS] Archiving <http://54.241.6.143/job/HBase-0.94-Security-Hadoop-2/ws/pom.xml>
to /var/lib/jenkins/jobs/HBase-0.94-Security-Hadoop-2/modules/org.apache.hbase$hbase/builds/2013-05-16_18-35-58/archive/org.apache.hbase/hbase/0.94.8-SNAPSHOT/hbase-0.94.8-SNAPSHOT.pom
Waiting for Jenkins to finish collecting data
mavenExecutionResult exceptions not empty
message : Failed to execute goal org.apache.maven.plugins:maven-surefire-plugin:2.12-TRUNK-HBASE-2:test
(secondPartTestsExecution) on project hbase: Failure or timeout
cause : Failure or timeout
Stack trace : 
org.apache.maven.lifecycle.LifecycleExecutionException: Failed to execute goal org.apache.maven.plugins:maven-surefire-plugin:2.12-TRUNK-HBASE-2:test
(secondPartTestsExecution) on project hbase: Failure or timeout
	at org.apache.maven.lifecycle.internal.MojoExecutor.execute(MojoExecutor.java:217)
	at org.apache.maven.lifecycle.internal.MojoExecutor.execute(MojoExecutor.java:153)
	at org.apache.maven.lifecycle.internal.MojoExecutor.execute(MojoExecutor.java:145)
	at org.apache.maven.lifecycle.internal.LifecycleModuleBuilder.buildProject(LifecycleModuleBuilder.java:84)
	at org.apache.maven.lifecycle.internal.LifecycleModuleBuilder.buildProject(LifecycleModuleBuilder.java:59)
	at org.apache.maven.lifecycle.internal.LifecycleStarter.singleThreadedBuild(LifecycleStarter.java:183)
	at org.apache.maven.lifecycle.internal.LifecycleStarter.execute(LifecycleStarter.java:161)
	at org.apache.maven.DefaultMaven.doExecute(DefaultMaven.java:320)
	at org.apache.maven.DefaultMaven.execute(DefaultMaven.java:156)
	at org.jvnet.hudson.maven3.launcher.Maven3Launcher.main(Maven3Launcher.java:79)
	at sun.reflect.NativeMethodAccessorImpl.invoke0(Native Method)
	at sun.reflect.NativeMethodAccessorImpl.invoke(NativeMethodAccessorImpl.java:39)
	at sun.reflect.DelegatingMethodAccessorImpl.invoke(DelegatingMethodAccessorImpl.java:25)
	at java.lang.reflect.Method.invoke(Method.java:597)
	at org.codehaus.plexus.classworlds.launcher.Launcher.launchStandard(Launcher.java:329)
	at org.codehaus.plexus.classworlds.launcher.Launcher.launch(Launcher.java:239)
	at org.jvnet.hudson.maven3.agent.Maven3Main.launch(Maven3Main.java:158)
	at hudson.maven.Maven3Builder.call(Maven3Builder.java:100)
	at hudson.maven.Maven3Builder.call(Maven3Builder.java:66)
	at hudson.remoting.UserRequest.perform(UserRequest.java:118)
	at hudson.remoting.UserRequest.perform(UserRequest.java:48)
	at hudson.remoting.Request$2.run(Request.java:326)
	at hudson.remoting.InterceptingExecutorService$1.call(InterceptingExecutorService.java:72)
	at java.util.concurrent.FutureTask$Sync.innerRun(FutureTask.java:303)
	at java.util.concurrent.FutureTask.run(FutureTask.java:138)
	at java.util.concurrent.ThreadPoolExecutor$Worker.runTask(ThreadPoolExecutor.java:895)
	at java.util.concurrent.ThreadPoolExecutor$Worker.run(ThreadPoolExecutor.java:918)
	at java.lang.Thread.run(Thread.java:662)
Caused by: org.apache.maven.plugin.MojoExecutionException: Failure or timeout
	at org.apache.maven.plugin.surefire.SurefirePlugin.assertNoFailureOrTimeout(SurefirePlugin.java:643)
	at org.apache.maven.plugin.surefire.SurefirePlugin.handleSummary(SurefirePlugin.java:624)
	at org.apache.maven.plugin.surefire.AbstractSurefireMojo.executeAfterPreconditionsChecked(AbstractSurefireMojo.java:137)
	at org.apache.maven.plugin.surefire.AbstractSurefireMojo.execute(AbstractSurefireMojo.java:98)
	at org.apache.maven.plugin.DefaultBuildPluginManager.executeMojo(DefaultBuildPluginManager.java:101)
	at org.apache.maven.lifecycle.internal.MojoExecutor.execute(MojoExecutor.java:209)
	... 27 more
channel stopped

Mime
View raw message