hbase-dev mailing list archives

Site index · List index
Message view « Date » · « Thread »
Top « Date » · « Thread »
From apurt...@apache.org
Subject Build failed in Jenkins: HBase-0.95 #234
Date Wed, 08 May 2013 01:26:17 GMT
See <http://54.241.6.143/job/HBase-0.95/234/>

------------------------------------------
[...truncated 6897 lines...]
Tests run: 10, Failures: 0, Errors: 0, Skipped: 0, Time elapsed: 571.186 sec
Running org.apache.hadoop.hbase.mapreduce.TestTableInputFormatScan1
Tests run: 5, Failures: 0, Errors: 0, Skipped: 0, Time elapsed: 588.872 sec
Running org.apache.hadoop.hbase.mapreduce.TestTimeRangeMapRed
Tests run: 1, Failures: 0, Errors: 0, Skipped: 0, Time elapsed: 183.785 sec
Running org.apache.hadoop.hbase.mapreduce.TestMultithreadedTableMapper
Tests run: 1, Failures: 0, Errors: 0, Skipped: 0, Time elapsed: 327.944 sec
Running org.apache.hadoop.hbase.mapreduce.TestLoadIncrementalHFilesSplitRecovery
Tests run: 4, Failures: 0, Errors: 0, Skipped: 0, Time elapsed: 120.139 sec
Running org.apache.hadoop.hbase.mapreduce.TestLoadIncrementalHFiles
Tests run: 7, Failures: 0, Errors: 0, Skipped: 0, Time elapsed: 30.73 sec
Running org.apache.hadoop.hbase.mapreduce.TestTableInputFormatScan2
Tests run: 7, Failures: 0, Errors: 0, Skipped: 0, Time elapsed: 806.292 sec
Running org.apache.hadoop.hbase.filter.TestFilterWithScanLimits
Tests run: 1, Failures: 0, Errors: 0, Skipped: 0, Time elapsed: 21.543 sec
Running org.apache.hadoop.hbase.filter.TestFilterWrapper
Tests run: 1, Failures: 0, Errors: 0, Skipped: 0, Time elapsed: 19.183 sec
Running org.apache.hadoop.hbase.mapreduce.TestImportTsv
Tests run: 5, Failures: 0, Errors: 0, Skipped: 0, Time elapsed: 535.513 sec
Running org.apache.hadoop.hbase.filter.TestColumnRangeFilter
Tests run: 1, Failures: 0, Errors: 0, Skipped: 0, Time elapsed: 23.473 sec
Running org.apache.hadoop.hbase.constraint.TestConstraint
Tests run: 5, Failures: 0, Errors: 0, Skipped: 0, Time elapsed: 29.531 sec
Running org.apache.hadoop.hbase.mapred.TestTableInputFormat
Tests run: 10, Failures: 0, Errors: 0, Skipped: 0, Time elapsed: 29.089 sec
Running org.apache.hadoop.hbase.TestHBaseTestingUtility
Tests run: 7, Failures: 0, Errors: 0, Skipped: 0, Time elapsed: 66.805 sec
Running org.apache.hadoop.hbase.coprocessor.TestBigDecimalColumnInterpreter
Tests run: 38, Failures: 0, Errors: 0, Skipped: 0, Time elapsed: 39.214 sec
Running org.apache.hadoop.hbase.coprocessor.TestMasterObserver
Tests run: 4, Failures: 0, Errors: 0, Skipped: 0, Time elapsed: 63.779 sec
Running org.apache.hadoop.hbase.coprocessor.TestRegionServerCoprocessorExceptionWithAbort
Tests run: 1, Failures: 0, Errors: 0, Skipped: 0, Time elapsed: 38.293 sec
Running org.apache.hadoop.hbase.coprocessor.TestCoprocessorEndpoint
Tests run: 6, Failures: 0, Errors: 0, Skipped: 0, Time elapsed: 34.44 sec
Running org.apache.hadoop.hbase.coprocessor.TestAggregateProtocol
Tests run: 45, Failures: 0, Errors: 0, Skipped: 0, Time elapsed: 41.645 sec
Running org.apache.hadoop.hbase.coprocessor.TestMasterCoprocessorExceptionWithRemove
Tests run: 1, Failures: 0, Errors: 0, Skipped: 0, Time elapsed: 26.194 sec
Running org.apache.hadoop.hbase.coprocessor.TestRegionObserverBypass
Tests run: 2, Failures: 0, Errors: 0, Skipped: 0, Time elapsed: 23.795 sec
Running org.apache.hadoop.hbase.coprocessor.TestRegionObserverInterface
Tests run: 7, Failures: 0, Errors: 0, Skipped: 0, Time elapsed: 38.352 sec
Running org.apache.hadoop.hbase.coprocessor.TestRowProcessorEndpoint
Tests run: 4, Failures: 0, Errors: 0, Skipped: 0, Time elapsed: 37.287 sec
Running org.apache.hadoop.hbase.coprocessor.TestClassLoading
Tests run: 8, Failures: 0, Errors: 0, Skipped: 0, Time elapsed: 40.884 sec
Running org.apache.hadoop.hbase.mapred.TestTableMapReduce
Running org.apache.hadoop.hbase.coprocessor.TestWALObserver
Tests run: 3, Failures: 0, Errors: 0, Skipped: 0, Time elapsed: 37.734 sec
Tests run: 1, Failures: 0, Errors: 0, Skipped: 0, Time elapsed: 205.137 sec
Running org.apache.hadoop.hbase.coprocessor.TestRegionServerCoprocessorExceptionWithRemove
Tests run: 1, Failures: 0, Errors: 0, Skipped: 0, Time elapsed: 35.979 sec
Running org.apache.hadoop.hbase.replication.regionserver.TestReplicationSourceManager
Tests run: 3, Failures: 0, Errors: 0, Skipped: 0, Time elapsed: 5.798 sec
Running org.apache.hadoop.hbase.replication.TestReplicationZookeeper
Tests run: 4, Failures: 0, Errors: 0, Skipped: 0, Time elapsed: 4.475 sec
Running org.apache.hadoop.hbase.coprocessor.TestMasterCoprocessorExceptionWithAbort
Tests run: 1, Failures: 0, Errors: 0, Skipped: 0, Time elapsed: 40.035 sec
Running org.apache.hadoop.hbase.replication.regionserver.TestReplicationSink
Tests run: 5, Failures: 0, Errors: 0, Skipped: 0, Time elapsed: 32.568 sec
Running org.apache.hadoop.hbase.replication.TestMultiSlaveReplication
Tests run: 1, Failures: 0, Errors: 0, Skipped: 0, Time elapsed: 57.422 sec
Running org.apache.hadoop.hbase.replication.TestReplicationStateZKImpl
Tests run: 2, Failures: 0, Errors: 0, Skipped: 0, Time elapsed: 4.348 sec
Running org.apache.hadoop.hbase.mapreduce.TestTableMapReduce
Tests run: 2, Failures: 0, Errors: 0, Skipped: 0, Time elapsed: 335.699 sec
Running org.apache.hadoop.hbase.replication.TestReplicationSource
Tests run: 1, Failures: 0, Errors: 0, Skipped: 0, Time elapsed: 4.614 sec
Running org.apache.hadoop.hbase.replication.TestReplicationQueueFailover
Tests run: 1, Failures: 0, Errors: 0, Skipped: 0, Time elapsed: 85.646 sec
Running org.apache.hadoop.hbase.replication.TestMasterReplication
Tests run: 2, Failures: 0, Errors: 0, Skipped: 0, Time elapsed: 75.043 sec
Running org.apache.hadoop.hbase.TestMultiVersions
Tests run: 3, Failures: 0, Errors: 0, Skipped: 0, Time elapsed: 27.178 sec
Running org.apache.hadoop.hbase.replication.TestReplicationDisableInactivePeer
Tests run: 1, Failures: 0, Errors: 0, Skipped: 0, Time elapsed: 45.455 sec
Running org.apache.hadoop.hbase.replication.TestReplicationSmallTests
Tests run: 8, Failures: 0, Errors: 0, Skipped: 0, Time elapsed: 104.655 sec
Running org.apache.hadoop.hbase.snapshot.TestSnapshotDescriptionUtils
Tests run: 2, Failures: 0, Errors: 0, Skipped: 0, Time elapsed: 1.475 sec
Running org.apache.hadoop.hbase.snapshot.TestFlushSnapshotFromClient
Tests run: 5, Failures: 0, Errors: 0, Skipped: 0, Time elapsed: 47.997 sec
Running org.apache.hadoop.hbase.replication.TestReplicationQueueFailoverCompressed
Tests run: 1, Failures: 0, Errors: 0, Skipped: 0, Time elapsed: 61.248 sec
Running org.apache.hadoop.hbase.snapshot.TestExportSnapshot
Tests run: 4, Failures: 0, Errors: 0, Skipped: 0, Time elapsed: 34.582 sec
Running org.apache.hadoop.hbase.client.TestSnapshotFromClient
Tests run: 3, Failures: 0, Errors: 0, Skipped: 0, Time elapsed: 30.37 sec
Running org.apache.hadoop.hbase.client.TestHCM
Tests run: 13, Failures: 0, Errors: 0, Skipped: 0, Time elapsed: 42.559 sec
Running org.apache.hadoop.hbase.client.TestSnapshotMetadata
Tests run: 4, Failures: 0, Errors: 0, Skipped: 0, Time elapsed: 35.833 sec
Running org.apache.hadoop.hbase.client.TestTimestampsFilter
Tests run: 3, Failures: 0, Errors: 0, Skipped: 0, Time elapsed: 22.685 sec
Running org.apache.hadoop.hbase.client.TestHTableMultiplexer
Tests run: 1, Failures: 0, Errors: 0, Skipped: 0, Time elapsed: 20.816 sec
Running org.apache.hadoop.hbase.client.TestClientTimeouts
Tests run: 1, Failures: 0, Errors: 0, Skipped: 0, Time elapsed: 17.97 sec
Running org.apache.hadoop.hbase.snapshot.TestRestoreFlushSnapshotFromClient
Tests run: 5, Failures: 0, Errors: 0, Skipped: 0, Time elapsed: 110.568 sec
Running org.apache.hadoop.hbase.client.TestHTableUtil
Tests run: 2, Failures: 0, Errors: 0, Skipped: 0, Time elapsed: 16.579 sec
Running org.apache.hadoop.hbase.client.TestScannerTimeout
Tests run: 4, Failures: 0, Errors: 0, Skipped: 0, Time elapsed: 53.1 sec
Running org.apache.hadoop.hbase.client.TestFromClientSide3
Running org.apache.hadoop.hbase.client.TestMetaScanner
Tests run: 1, Failures: 0, Errors: 0, Skipped: 0, Time elapsed: 12.888 sec
Tests run: 5, Failures: 0, Errors: 0, Skipped: 0, Time elapsed: 56.247 sec
Running org.apache.hadoop.hbase.client.TestMultipleTimestamps
Tests run: 8, Failures: 0, Errors: 0, Skipped: 0, Time elapsed: 25.839 sec
Running org.apache.hadoop.hbase.client.TestClientScannerRPCTimeout
Tests run: 1, Failures: 0, Errors: 0, Skipped: 0, Time elapsed: 21.511 sec
Running org.apache.hadoop.hbase.client.TestRestoreSnapshotFromClient
Tests run: 3, Failures: 0, Errors: 0, Skipped: 0, Time elapsed: 153.079 sec
Running org.apache.hadoop.hbase.client.TestFromClientSide
Tests run: 61, Failures: 0, Errors: 0, Skipped: 3, Time elapsed: 166.811 sec
Running org.apache.hadoop.hbase.client.TestMultiParallel
Tests run: 11, Failures: 0, Errors: 0, Skipped: 0, Time elapsed: 96.572 sec
Running org.apache.hadoop.hbase.client.replication.TestReplicationAdmin
Tests run: 1, Failures: 0, Errors: 0, Skipped: 0, Time elapsed: 1.876 sec
Running org.apache.hadoop.hbase.client.TestHTablePool$TestHTableReusablePool
Tests run: 8, Failures: 0, Errors: 0, Skipped: 0, Time elapsed: 4.545 sec
Running org.apache.hadoop.hbase.client.TestHTablePool$TestHTableThreadLocalPool
Tests run: 8, Failures: 0, Errors: 0, Skipped: 0, Time elapsed: 23.401 sec
Running org.apache.hadoop.hbase.client.TestShell
Tests run: 1, Failures: 0, Errors: 0, Skipped: 0, Time elapsed: 105.747 sec
Running org.apache.hadoop.hbase.client.TestCloneSnapshotFromClient
Tests run: 3, Failures: 0, Errors: 0, Skipped: 0, Time elapsed: 117.564 sec
Running org.apache.hadoop.hbase.client.TestScannersFromClientSide
Tests run: 4, Failures: 0, Errors: 0, Skipped: 0, Time elapsed: 20.624 sec
Running org.apache.hadoop.hbase.client.TestSnapshotCloneIndependence
Tests run: 6, Failures: 0, Errors: 0, Skipped: 0, Time elapsed: 63.591 sec
Running org.apache.hadoop.hbase.client.TestFromClientSideWithCoprocessor
Tests run: 61, Failures: 0, Errors: 0, Skipped: 3, Time elapsed: 157.466 sec
Running org.apache.hadoop.hbase.TestAcidGuarantees
Tests run: 3, Failures: 0, Errors: 0, Skipped: 0, Time elapsed: 92.57 sec
Running org.apache.hadoop.hbase.client.TestAdmin
Tests run: 43, Failures: 0, Errors: 0, Skipped: 0, Time elapsed: 324.26 sec

Results :

Tests run: 1495, Failures: 0, Errors: 0, Skipped: 14

[JENKINS] Recording test results
[INFO]                                                                         
[INFO] ------------------------------------------------------------------------
[INFO] Skipping HBase
[INFO] This project has been banned from the build due to previous failures.
[INFO] ------------------------------------------------------------------------
[INFO]                                                                         
[INFO] ------------------------------------------------------------------------
[INFO] Skipping HBase
[INFO] This project has been banned from the build due to previous failures.
[INFO] ------------------------------------------------------------------------
[INFO] ------------------------------------------------------------------------
[INFO] Reactor Summary:
[INFO] 
[INFO] HBase ............................................. SUCCESS [43.794s]
[INFO] HBase - Common .................................... SUCCESS [1:01.939s]
[INFO] HBase - Protocol .................................. SUCCESS [19.636s]
[INFO] HBase - Client .................................... SUCCESS [12.653s]
[INFO] HBase - Prefix Tree ............................... SUCCESS [5.523s]
[INFO] HBase - Hadoop Compatibility ...................... SUCCESS [1.415s]
[INFO] HBase - Hadoop One Compatibility .................. SUCCESS [13.858s]
[INFO] HBase - Server .................................... FAILURE [58:39.695s]
[INFO] HBase - Integration Tests ......................... SKIPPED
[INFO] HBase - Examples .................................. SKIPPED
[INFO] HBase - Assembly .................................. SKIPPED
[INFO] ------------------------------------------------------------------------
[INFO] BUILD FAILURE
[INFO] ------------------------------------------------------------------------
[INFO] Total time: 1:01:50.394s
[INFO] Finished at: Wed May 08 01:25:58 UTC 2013
[INFO] Final Memory: 94M/647M
[INFO] ------------------------------------------------------------------------
[JENKINS] Archiving <http://54.241.6.143/job/HBase-0.95/ws/hbase-common/pom.xml> to
/var/lib/jenkins/jobs/HBase-0.95/modules/org.apache.hbase$hbase-common/builds/2013-05-08_00-23-59/archive/org.apache.hbase/hbase-common/0.97.0-SNAPSHOT/hbase-common-0.97.0-SNAPSHOT.pom
[JENKINS] Archiving <http://54.241.6.143/job/HBase-0.95/ws/hbase-common/target/hbase-common-0.97.0-SNAPSHOT.jar>
to /var/lib/jenkins/jobs/HBase-0.95/modules/org.apache.hbase$hbase-common/builds/2013-05-08_00-23-59/archive/org.apache.hbase/hbase-common/0.97.0-SNAPSHOT/hbase-common-0.97.0-SNAPSHOT.jar
[JENKINS] Archiving <http://54.241.6.143/job/HBase-0.95/ws/hbase-common/target/hbase-common-0.97.0-SNAPSHOT-sources.jar>
to /var/lib/jenkins/jobs/HBase-0.95/modules/org.apache.hbase$hbase-common/builds/2013-05-08_00-23-59/archive/org.apache.hbase/hbase-common/0.97.0-SNAPSHOT/hbase-common-0.97.0-SNAPSHOT-sources.jar
[JENKINS] Archiving <http://54.241.6.143/job/HBase-0.95/ws/hbase-common/target/hbase-common-0.97.0-SNAPSHOT-tests.jar>
to /var/lib/jenkins/jobs/HBase-0.95/modules/org.apache.hbase$hbase-common/builds/2013-05-08_00-23-59/archive/org.apache.hbase/hbase-common/0.97.0-SNAPSHOT/hbase-common-0.97.0-SNAPSHOT-tests.jar
[JENKINS] Archiving <http://54.241.6.143/job/HBase-0.95/ws/hbase-hadoop-compat/pom.xml>
to /var/lib/jenkins/jobs/HBase-0.95/modules/org.apache.hbase$hbase-hadoop-compat/builds/2013-05-08_00-23-59/archive/org.apache.hbase/hbase-hadoop-compat/0.97.0-SNAPSHOT/hbase-hadoop-compat-0.97.0-SNAPSHOT.pom
[JENKINS] Archiving <http://54.241.6.143/job/HBase-0.95/ws/hbase-hadoop-compat/target/hbase-hadoop-compat-0.97.0-SNAPSHOT.jar>
to /var/lib/jenkins/jobs/HBase-0.95/modules/org.apache.hbase$hbase-hadoop-compat/builds/2013-05-08_00-23-59/archive/org.apache.hbase/hbase-hadoop-compat/0.97.0-SNAPSHOT/hbase-hadoop-compat-0.97.0-SNAPSHOT.jar
[JENKINS] Archiving <http://54.241.6.143/job/HBase-0.95/ws/hbase-hadoop-compat/target/hbase-hadoop-compat-0.97.0-SNAPSHOT-sources.jar>
to /var/lib/jenkins/jobs/HBase-0.95/modules/org.apache.hbase$hbase-hadoop-compat/builds/2013-05-08_00-23-59/archive/org.apache.hbase/hbase-hadoop-compat/0.97.0-SNAPSHOT/hbase-hadoop-compat-0.97.0-SNAPSHOT-sources.jar
[JENKINS] Archiving <http://54.241.6.143/job/HBase-0.95/ws/hbase-hadoop-compat/target/hbase-hadoop-compat-0.97.0-SNAPSHOT-tests.jar>
to /var/lib/jenkins/jobs/HBase-0.95/modules/org.apache.hbase$hbase-hadoop-compat/builds/2013-05-08_00-23-59/archive/org.apache.hbase/hbase-hadoop-compat/0.97.0-SNAPSHOT/hbase-hadoop-compat-0.97.0-SNAPSHOT-tests.jar
[JENKINS] Archiving <http://54.241.6.143/job/HBase-0.95/ws/hbase-examples/pom.xml> to
/var/lib/jenkins/jobs/HBase-0.95/modules/org.apache.hbase$hbase-examples/builds/2013-05-08_00-23-59/archive/org.apache.hbase/hbase-examples/0.97.0-SNAPSHOT/hbase-examples-0.97.0-SNAPSHOT.pom
[JENKINS] Archiving <http://54.241.6.143/job/HBase-0.95/ws/hbase-it/pom.xml> to /var/lib/jenkins/jobs/HBase-0.95/modules/org.apache.hbase$hbase-it/builds/2013-05-08_00-23-59/archive/org.apache.hbase/hbase-it/0.97.0-SNAPSHOT/hbase-it-0.97.0-SNAPSHOT.pom
[JENKINS] Archiving <http://54.241.6.143/job/HBase-0.95/ws/pom.xml> to /var/lib/jenkins/jobs/HBase-0.95/modules/org.apache.hbase$hbase/builds/2013-05-08_00-23-59/archive/org.apache.hbase/hbase/0.97.0-SNAPSHOT/hbase-0.97.0-SNAPSHOT.pom
[JENKINS] Archiving <http://54.241.6.143/job/HBase-0.95/ws/target/hbase-0.97.0-SNAPSHOT-site.xml>
to /var/lib/jenkins/jobs/HBase-0.95/modules/org.apache.hbase$hbase/builds/2013-05-08_00-23-59/archive/org.apache.hbase/hbase/0.97.0-SNAPSHOT/hbase-0.97.0-SNAPSHOT-site.xml
[JENKINS] Archiving <http://54.241.6.143/job/HBase-0.95/ws/hbase-assembly/pom.xml> to
/var/lib/jenkins/jobs/HBase-0.95/modules/org.apache.hbase$hbase-assembly/builds/2013-05-08_00-24-00/archive/org.apache.hbase/hbase-assembly/0.97.0-SNAPSHOT/hbase-assembly-0.97.0-SNAPSHOT.pom
[JENKINS] Archiving <http://54.241.6.143/job/HBase-0.95/ws/hbase-client/pom.xml> to
/var/lib/jenkins/jobs/HBase-0.95/modules/org.apache.hbase$hbase-client/builds/2013-05-08_00-23-59/archive/org.apache.hbase/hbase-client/0.97.0-SNAPSHOT/hbase-client-0.97.0-SNAPSHOT.pom
[JENKINS] Archiving <http://54.241.6.143/job/HBase-0.95/ws/hbase-client/target/hbase-client-0.97.0-SNAPSHOT.jar>
to /var/lib/jenkins/jobs/HBase-0.95/modules/org.apache.hbase$hbase-client/builds/2013-05-08_00-23-59/archive/org.apache.hbase/hbase-client/0.97.0-SNAPSHOT/hbase-client-0.97.0-SNAPSHOT.jar
[JENKINS] Archiving <http://54.241.6.143/job/HBase-0.95/ws/hbase-client/target/hbase-client-0.97.0-SNAPSHOT-sources.jar>
to /var/lib/jenkins/jobs/HBase-0.95/modules/org.apache.hbase$hbase-client/builds/2013-05-08_00-23-59/archive/org.apache.hbase/hbase-client/0.97.0-SNAPSHOT/hbase-client-0.97.0-SNAPSHOT-sources.jar
[JENKINS] Archiving <http://54.241.6.143/job/HBase-0.95/ws/hbase-client/target/hbase-client-0.97.0-SNAPSHOT-tests.jar>
to /var/lib/jenkins/jobs/HBase-0.95/modules/org.apache.hbase$hbase-client/builds/2013-05-08_00-23-59/archive/org.apache.hbase/hbase-client/0.97.0-SNAPSHOT/hbase-client-0.97.0-SNAPSHOT-tests.jar
[JENKINS] Archiving <http://54.241.6.143/job/HBase-0.95/ws/hbase-prefix-tree/pom.xml>
to /var/lib/jenkins/jobs/HBase-0.95/modules/org.apache.hbase$hbase-prefix-tree/builds/2013-05-08_00-23-59/archive/org.apache.hbase/hbase-prefix-tree/0.97.0-SNAPSHOT/hbase-prefix-tree-0.97.0-SNAPSHOT.pom
[JENKINS] Archiving <http://54.241.6.143/job/HBase-0.95/ws/hbase-prefix-tree/target/hbase-prefix-tree-0.97.0-SNAPSHOT.jar>
to /var/lib/jenkins/jobs/HBase-0.95/modules/org.apache.hbase$hbase-prefix-tree/builds/2013-05-08_00-23-59/archive/org.apache.hbase/hbase-prefix-tree/0.97.0-SNAPSHOT/hbase-prefix-tree-0.97.0-SNAPSHOT.jar
[JENKINS] Archiving <http://54.241.6.143/job/HBase-0.95/ws/hbase-prefix-tree/target/hbase-prefix-tree-0.97.0-SNAPSHOT-sources.jar>
to /var/lib/jenkins/jobs/HBase-0.95/modules/org.apache.hbase$hbase-prefix-tree/builds/2013-05-08_00-23-59/archive/org.apache.hbase/hbase-prefix-tree/0.97.0-SNAPSHOT/hbase-prefix-tree-0.97.0-SNAPSHOT-sources.jar
[JENKINS] Archiving <http://54.241.6.143/job/HBase-0.95/ws/hbase-prefix-tree/target/hbase-prefix-tree-0.97.0-SNAPSHOT-tests.jar>
to /var/lib/jenkins/jobs/HBase-0.95/modules/org.apache.hbase$hbase-prefix-tree/builds/2013-05-08_00-23-59/archive/org.apache.hbase/hbase-prefix-tree/0.97.0-SNAPSHOT/hbase-prefix-tree-0.97.0-SNAPSHOT-tests.jar
[JENKINS] Archiving <http://54.241.6.143/job/HBase-0.95/ws/hbase-protocol/pom.xml> to
/var/lib/jenkins/jobs/HBase-0.95/modules/org.apache.hbase$hbase-protocol/builds/2013-05-08_00-23-59/archive/org.apache.hbase/hbase-protocol/0.97.0-SNAPSHOT/hbase-protocol-0.97.0-SNAPSHOT.pom
[JENKINS] Archiving <http://54.241.6.143/job/HBase-0.95/ws/hbase-protocol/target/hbase-protocol-0.97.0-SNAPSHOT.jar>
to /var/lib/jenkins/jobs/HBase-0.95/modules/org.apache.hbase$hbase-protocol/builds/2013-05-08_00-23-59/archive/org.apache.hbase/hbase-protocol/0.97.0-SNAPSHOT/hbase-protocol-0.97.0-SNAPSHOT.jar
[JENKINS] Archiving <http://54.241.6.143/job/HBase-0.95/ws/hbase-protocol/target/hbase-protocol-0.97.0-SNAPSHOT-sources.jar>
to /var/lib/jenkins/jobs/HBase-0.95/modules/org.apache.hbase$hbase-protocol/builds/2013-05-08_00-23-59/archive/org.apache.hbase/hbase-protocol/0.97.0-SNAPSHOT/hbase-protocol-0.97.0-SNAPSHOT-sources.jar
[JENKINS] Archiving <http://54.241.6.143/job/HBase-0.95/ws/hbase-protocol/target/hbase-protocol-0.97.0-SNAPSHOT-tests.jar>
to /var/lib/jenkins/jobs/HBase-0.95/modules/org.apache.hbase$hbase-protocol/builds/2013-05-08_00-23-59/archive/org.apache.hbase/hbase-protocol/0.97.0-SNAPSHOT/hbase-protocol-0.97.0-SNAPSHOT-tests.jar
[JENKINS] Archiving <http://54.241.6.143/job/HBase-0.95/ws/hbase-hadoop1-compat/pom.xml>
to /var/lib/jenkins/jobs/HBase-0.95/modules/org.apache.hbase$hbase-hadoop1-compat/builds/2013-05-08_00-24-00/archive/org.apache.hbase/hbase-hadoop1-compat/0.97.0-SNAPSHOT/hbase-hadoop1-compat-0.97.0-SNAPSHOT.pom
[JENKINS] Archiving <http://54.241.6.143/job/HBase-0.95/ws/hbase-hadoop1-compat/target/hbase-hadoop1-compat-0.97.0-SNAPSHOT.jar>
to /var/lib/jenkins/jobs/HBase-0.95/modules/org.apache.hbase$hbase-hadoop1-compat/builds/2013-05-08_00-24-00/archive/org.apache.hbase/hbase-hadoop1-compat/0.97.0-SNAPSHOT/hbase-hadoop1-compat-0.97.0-SNAPSHOT.jar
[JENKINS] Archiving <http://54.241.6.143/job/HBase-0.95/ws/hbase-hadoop1-compat/target/hbase-hadoop1-compat-0.97.0-SNAPSHOT-sources.jar>
to /var/lib/jenkins/jobs/HBase-0.95/modules/org.apache.hbase$hbase-hadoop1-compat/builds/2013-05-08_00-24-00/archive/org.apache.hbase/hbase-hadoop1-compat/0.97.0-SNAPSHOT/hbase-hadoop1-compat-0.97.0-SNAPSHOT-sources.jar
[JENKINS] Archiving <http://54.241.6.143/job/HBase-0.95/ws/hbase-hadoop1-compat/target/hbase-hadoop1-compat-0.97.0-SNAPSHOT-tests.jar>
to /var/lib/jenkins/jobs/HBase-0.95/modules/org.apache.hbase$hbase-hadoop1-compat/builds/2013-05-08_00-24-00/archive/org.apache.hbase/hbase-hadoop1-compat/0.97.0-SNAPSHOT/hbase-hadoop1-compat-0.97.0-SNAPSHOT-tests.jar
[JENKINS] Archiving <http://54.241.6.143/job/HBase-0.95/ws/hbase-server/pom.xml> to
/var/lib/jenkins/jobs/HBase-0.95/modules/org.apache.hbase$hbase-server/builds/2013-05-08_00-23-59/archive/org.apache.hbase/hbase-server/0.97.0-SNAPSHOT/hbase-server-0.97.0-SNAPSHOT.pom
Waiting for Jenkins to finish collecting data
mavenExecutionResult exceptions not empty
message : Failed to execute goal org.apache.maven.plugins:maven-surefire-plugin:2.12-TRUNK-HBASE-2:test
(secondPartTestsExecution) on project hbase-server: Failure or timeout
cause : Failure or timeout
Stack trace : 
org.apache.maven.lifecycle.LifecycleExecutionException: Failed to execute goal org.apache.maven.plugins:maven-surefire-plugin:2.12-TRUNK-HBASE-2:test
(secondPartTestsExecution) on project hbase-server: Failure or timeout
	at org.apache.maven.lifecycle.internal.MojoExecutor.execute(MojoExecutor.java:217)
	at org.apache.maven.lifecycle.internal.MojoExecutor.execute(MojoExecutor.java:153)
	at org.apache.maven.lifecycle.internal.MojoExecutor.execute(MojoExecutor.java:145)
	at org.apache.maven.lifecycle.internal.LifecycleModuleBuilder.buildProject(LifecycleModuleBuilder.java:84)
	at org.apache.maven.lifecycle.internal.LifecycleModuleBuilder.buildProject(LifecycleModuleBuilder.java:59)
	at org.apache.maven.lifecycle.internal.LifecycleStarter.singleThreadedBuild(LifecycleStarter.java:183)
	at org.apache.maven.lifecycle.internal.LifecycleStarter.execute(LifecycleStarter.java:161)
	at org.apache.maven.DefaultMaven.doExecute(DefaultMaven.java:320)
	at org.apache.maven.DefaultMaven.execute(DefaultMaven.java:156)
	at org.jvnet.hudson.maven3.launcher.Maven3Launcher.main(Maven3Launcher.java:79)
	at sun.reflect.NativeMethodAccessorImpl.invoke0(Native Method)
	at sun.reflect.NativeMethodAccessorImpl.invoke(NativeMethodAccessorImpl.java:39)
	at sun.reflect.DelegatingMethodAccessorImpl.invoke(DelegatingMethodAccessorImpl.java:25)
	at java.lang.reflect.Method.invoke(Method.java:597)
	at org.codehaus.plexus.classworlds.launcher.Launcher.launchStandard(Launcher.java:329)
	at org.codehaus.plexus.classworlds.launcher.Launcher.launch(Launcher.java:239)
	at org.jvnet.hudson.maven3.agent.Maven3Main.launch(Maven3Main.java:158)
	at hudson.maven.Maven3Builder.call(Maven3Builder.java:100)
	at hudson.maven.Maven3Builder.call(Maven3Builder.java:66)
	at hudson.remoting.UserRequest.perform(UserRequest.java:118)
	at hudson.remoting.UserRequest.perform(UserRequest.java:48)
	at hudson.remoting.Request$2.run(Request.java:326)
	at hudson.remoting.InterceptingExecutorService$1.call(InterceptingExecutorService.java:72)
	at java.util.concurrent.FutureTask$Sync.innerRun(FutureTask.java:303)
	at java.util.concurrent.FutureTask.run(FutureTask.java:138)
	at java.util.concurrent.ThreadPoolExecutor$Worker.runTask(ThreadPoolExecutor.java:895)
	at java.util.concurrent.ThreadPoolExecutor$Worker.run(ThreadPoolExecutor.java:918)
	at java.lang.Thread.run(Thread.java:662)
Caused by: org.apache.maven.plugin.MojoExecutionException: Failure or timeout
	at org.apache.maven.plugin.surefire.SurefirePlugin.assertNoFailureOrTimeout(SurefirePlugin.java:643)
	at org.apache.maven.plugin.surefire.SurefirePlugin.handleSummary(SurefirePlugin.java:624)
	at org.apache.maven.plugin.surefire.AbstractSurefireMojo.executeAfterPreconditionsChecked(AbstractSurefireMojo.java:137)
	at org.apache.maven.plugin.surefire.AbstractSurefireMojo.execute(AbstractSurefireMojo.java:98)
	at org.apache.maven.plugin.DefaultBuildPluginManager.executeMojo(DefaultBuildPluginManager.java:101)
	at org.apache.maven.lifecycle.internal.MojoExecutor.execute(MojoExecutor.java:209)
	... 27 more
channel stopped

Mime
View raw message