hbase-dev mailing list archives

Site index · List index
Message view « Date » · « Thread »
Top « Date » · « Thread »
From apurt...@apache.org
Subject Build failed in Jenkins: HBase-0.94-Security-Hadoop-2 #117
Date Wed, 08 May 2013 03:43:13 GMT
See <http://54.241.6.143/job/HBase-0.94-Security-Hadoop-2/117/>

------------------------------------------
[...truncated 4077 lines...]
Downloading: http://people.apache.org/~garyh/mvn/org/apache/maven/maven-monitor/2.0.5/maven-monitor-2.0.5.pom
Downloading: http://repo.maven.apache.org/maven2/org/apache/maven/maven-monitor/2.0.5/maven-monitor-2.0.5.pom
Downloaded: http://repo.maven.apache.org/maven2/org/apache/maven/maven-monitor/2.0.5/maven-monitor-2.0.5.pom
(404 B at 32.9 KB/sec)
Downloading: http://people.apache.org/~garyh/mvn/velocity/velocity-dep/1.4/velocity-dep-1.4.pom
Downloading: http://repo.maven.apache.org/maven2/velocity/velocity-dep/1.4/velocity-dep-1.4.pom
Downloaded: http://repo.maven.apache.org/maven2/velocity/velocity-dep/1.4/velocity-dep-1.4.pom
(2 KB at 142.4 KB/sec)
Downloading: http://people.apache.org/~garyh/mvn/org/apache/maven/shared/maven-common-artifact-filters/1.0/maven-common-artifact-filters-1.0.pom
Downloading: http://repo.maven.apache.org/maven2/org/apache/maven/shared/maven-common-artifact-filters/1.0/maven-common-artifact-filters-1.0.pom
Downloaded: http://repo.maven.apache.org/maven2/org/apache/maven/shared/maven-common-artifact-filters/1.0/maven-common-artifact-filters-1.0.pom
(2 KB at 164.0 KB/sec)
Downloading: http://people.apache.org/~garyh/mvn/org/apache/maven/maven-artifact/2.0.8/maven-artifact-2.0.8.pom
Downloading: http://repo.maven.apache.org/maven2/org/apache/maven/maven-artifact/2.0.8/maven-artifact-2.0.8.pom
Downloaded: http://repo.maven.apache.org/maven2/org/apache/maven/maven-artifact/2.0.8/maven-artifact-2.0.8.pom
(2 KB at 143.7 KB/sec)
Downloading: http://people.apache.org/~garyh/mvn/org/apache/maven/maven/2.0.8/maven-2.0.8.pom
Downloading: http://repo.maven.apache.org/maven2/org/apache/maven/maven/2.0.8/maven-2.0.8.pom
Downloaded: http://repo.maven.apache.org/maven2/org/apache/maven/maven/2.0.8/maven-2.0.8.pom
(12 KB at 908.6 KB/sec)
Downloading: http://people.apache.org/~garyh/mvn/org/apache/maven/maven-parent/6/maven-parent-6.pom
Downloading: http://repo.maven.apache.org/maven2/org/apache/maven/maven-parent/6/maven-parent-6.pom
Downloaded: http://repo.maven.apache.org/maven2/org/apache/maven/maven-parent/6/maven-parent-6.pom
(20 KB at 1505.9 KB/sec)
Downloading: http://people.apache.org/~garyh/mvn/org/apache/maven/shared/maven-plugin-testing-harness/1.1/maven-plugin-testing-harness-1.1.pom
Downloading: http://repo.maven.apache.org/maven2/org/apache/maven/shared/maven-plugin-testing-harness/1.1/maven-plugin-testing-harness-1.1.pom
Downloaded: http://repo.maven.apache.org/maven2/org/apache/maven/shared/maven-plugin-testing-harness/1.1/maven-plugin-testing-harness-1.1.pom
(7 KB at 363.9 KB/sec)
Downloading: http://people.apache.org/~garyh/mvn/org/apache/maven/shared/maven-shared-components/7/maven-shared-components-7.pom
Downloading: http://repo.maven.apache.org/maven2/org/apache/maven/shared/maven-shared-components/7/maven-shared-components-7.pom
Downloaded: http://repo.maven.apache.org/maven2/org/apache/maven/shared/maven-shared-components/7/maven-shared-components-7.pom
(3 KB at 195.2 KB/sec)
Downloading: http://people.apache.org/~garyh/mvn/org/apache/maven/maven-core/2.0/maven-core-2.0.pom
Downloading: http://repo.maven.apache.org/maven2/org/apache/maven/maven-core/2.0/maven-core-2.0.pom
Downloaded: http://repo.maven.apache.org/maven2/org/apache/maven/maven-core/2.0/maven-core-2.0.pom
(6 KB at 455.4 KB/sec)
Downloading: http://people.apache.org/~garyh/mvn/org/apache/maven/maven-settings/2.0/maven-settings-2.0.pom
Downloading: http://repo.maven.apache.org/maven2/org/apache/maven/maven-settings/2.0/maven-settings-2.0.pom
Downloaded: http://repo.maven.apache.org/maven2/org/apache/maven/maven-settings/2.0/maven-settings-2.0.pom
(2 KB at 96.3 KB/sec)
Downloading: http://people.apache.org/~garyh/mvn/org/apache/maven/maven-plugin-parameter-documenter/2.0/maven-plugin-parameter-documenter-2.0.pom
Downloading: http://repo.maven.apache.org/maven2/org/apache/maven/maven-plugin-parameter-documenter/2.0/maven-plugin-parameter-documenter-2.0.pom
Downloaded: http://repo.maven.apache.org/maven2/org/apache/maven/maven-plugin-parameter-documenter/2.0/maven-plugin-parameter-documenter-2.0.pom
(2 KB at 114.7 KB/sec)
Downloading: http://people.apache.org/~garyh/mvn/org/apache/maven/reporting/maven-reporting-api/2.0/maven-reporting-api-2.0.pom
Downloading: http://repo.maven.apache.org/maven2/org/apache/maven/reporting/maven-reporting-api/2.0/maven-reporting-api-2.0.pom
Downloaded: http://repo.maven.apache.org/maven2/org/apache/maven/reporting/maven-reporting-api/2.0/maven-reporting-api-2.0.pom
(2 KB at 45.1 KB/sec)
Downloading: http://people.apache.org/~garyh/mvn/org/apache/maven/reporting/maven-reporting/2.0/maven-reporting-2.0.pom
Downloading: http://repo.maven.apache.org/maven2/org/apache/maven/reporting/maven-reporting/2.0/maven-reporting-2.0.pom
Downloaded: http://repo.maven.apache.org/maven2/org/apache/maven/reporting/maven-reporting/2.0/maven-reporting-2.0.pom
(504 B at 15.4 KB/sec)
Downloading: http://people.apache.org/~garyh/mvn/doxia/doxia-sink-api/1.0-alpha-4/doxia-sink-api-1.0-alpha-4.pom
Downloading: http://repo.maven.apache.org/maven2/doxia/doxia-sink-api/1.0-alpha-4/doxia-sink-api-1.0-alpha-4.pom
Downloaded: http://repo.maven.apache.org/maven2/doxia/doxia-sink-api/1.0-alpha-4/doxia-sink-api-1.0-alpha-4.pom
(2 KB at 82.1 KB/sec)
Downloading: http://people.apache.org/~garyh/mvn/org/apache/maven/maven-error-diagnostics/2.0/maven-error-diagnostics-2.0.pom
Downloading: http://repo.maven.apache.org/maven2/org/apache/maven/maven-error-diagnostics/2.0/maven-error-diagnostics-2.0.pom
Downloaded: http://repo.maven.apache.org/maven2/org/apache/maven/maven-error-diagnostics/2.0/maven-error-diagnostics-2.0.pom
(812 B at 31.7 KB/sec)
Downloading: http://people.apache.org/~garyh/mvn/org/apache/maven/maven-plugin-registry/2.0/maven-plugin-registry-2.0.pom
Downloading: http://repo.maven.apache.org/maven2/org/apache/maven/maven-plugin-registry/2.0/maven-plugin-registry-2.0.pom
Downloaded: http://repo.maven.apache.org/maven2/org/apache/maven/maven-plugin-registry/2.0/maven-plugin-registry-2.0.pom
(2 KB at 33.0 KB/sec)
Downloading: http://people.apache.org/~garyh/mvn/org/apache/maven/maven-plugin-descriptor/2.0/maven-plugin-descriptor-2.0.pom
Downloading: http://repo.maven.apache.org/maven2/org/apache/maven/maven-plugin-descriptor/2.0/maven-plugin-descriptor-2.0.pom
Downloaded: http://repo.maven.apache.org/maven2/org/apache/maven/maven-plugin-descriptor/2.0/maven-plugin-descriptor-2.0.pom
(2 KB at 118.9 KB/sec)
Downloading: http://people.apache.org/~garyh/mvn/org/apache/maven/maven-monitor/2.0/maven-monitor-2.0.pom
Downloading: http://repo.maven.apache.org/maven2/org/apache/maven/maven-monitor/2.0/maven-monitor-2.0.pom
Downloaded: http://repo.maven.apache.org/maven2/org/apache/maven/maven-monitor/2.0/maven-monitor-2.0.pom
(400 B at 30.0 KB/sec)
Downloading: http://people.apache.org/~garyh/mvn/org/codehaus/plexus/plexus-utils/1.4.2/plexus-utils-1.4.2.pom
Downloading: http://repo.maven.apache.org/maven2/org/codehaus/plexus/plexus-utils/1.4.2/plexus-utils-1.4.2.pom
Downloaded: http://repo.maven.apache.org/maven2/org/codehaus/plexus/plexus-utils/1.4.2/plexus-utils-1.4.2.pom
(2 KB at 147.2 KB/sec)
Downloading: http://people.apache.org/~garyh/mvn/org/codehaus/plexus/plexus-archiver/1.0-alpha-7/plexus-archiver-1.0-alpha-7.pom
Downloading: http://repo.maven.apache.org/maven2/org/codehaus/plexus/plexus-archiver/1.0-alpha-7/plexus-archiver-1.0-alpha-7.pom
Downloaded: http://repo.maven.apache.org/maven2/org/codehaus/plexus/plexus-archiver/1.0-alpha-7/plexus-archiver-1.0-alpha-7.pom
(2 KB at 78.4 KB/sec)
Downloading: http://people.apache.org/~garyh/mvn/org/codehaus/plexus/plexus-components/1.1.6/plexus-components-1.1.6.pom
Downloading: http://repo.maven.apache.org/maven2/org/codehaus/plexus/plexus-components/1.1.6/plexus-components-1.1.6.pom
Downloaded: http://repo.maven.apache.org/maven2/org/codehaus/plexus/plexus-components/1.1.6/plexus-components-1.1.6.pom
(2 KB at 131.7 KB/sec)
Downloading: http://people.apache.org/~garyh/mvn/org/codehaus/plexus/plexus/1.0.8/plexus-1.0.8.pom
Downloading: http://repo.maven.apache.org/maven2/org/codehaus/plexus/plexus/1.0.8/plexus-1.0.8.pom
Downloaded: http://repo.maven.apache.org/maven2/org/codehaus/plexus/plexus/1.0.8/plexus-1.0.8.pom
(8 KB at 543.1 KB/sec)
Downloading: http://people.apache.org/~garyh/mvn/org/codehaus/plexus/plexus-utils/1.2/plexus-utils-1.2.pom
Downloading: http://repo.maven.apache.org/maven2/org/codehaus/plexus/plexus-utils/1.2/plexus-utils-1.2.pom
Downloaded: http://repo.maven.apache.org/maven2/org/codehaus/plexus/plexus-utils/1.2/plexus-utils-1.2.pom
(767 B at 62.4 KB/sec)
Downloading: http://people.apache.org/~garyh/mvn/org/codehaus/plexus/plexus/1.0.5/plexus-1.0.5.pom
Downloading: http://repo.maven.apache.org/maven2/org/codehaus/plexus/plexus/1.0.5/plexus-1.0.5.pom
Downloaded: http://repo.maven.apache.org/maven2/org/codehaus/plexus/plexus/1.0.5/plexus-1.0.5.pom
(6 KB at 414.5 KB/sec)
Downloading: http://people.apache.org/~garyh/mvn/org/apache/maven/shared/maven-downloader/1.1/maven-downloader-1.1.pom
Downloading: http://repo.maven.apache.org/maven2/org/apache/maven/shared/maven-downloader/1.1/maven-downloader-1.1.pom
Downloaded: http://repo.maven.apache.org/maven2/org/apache/maven/shared/maven-downloader/1.1/maven-downloader-1.1.pom
(2 KB at 136.5 KB/sec)
Downloading: http://people.apache.org/~garyh/mvn/org/apache/maven/shared/maven-shared-components/4/maven-shared-components-4.pom
Downloading: http://repo.maven.apache.org/maven2/org/apache/maven/shared/maven-shared-components/4/maven-shared-components-4.pom
Downloaded: http://repo.maven.apache.org/maven2/org/apache/maven/shared/maven-shared-components/4/maven-shared-components-4.pom
(3 KB at 134.8 KB/sec)
Downloading: http://people.apache.org/~garyh/mvn/org/apache/maven/maven-parent/4/maven-parent-4.pom
Downloading: http://repo.maven.apache.org/maven2/org/apache/maven/maven-parent/4/maven-parent-4.pom
Downloaded: http://repo.maven.apache.org/maven2/org/apache/maven/maven-parent/4/maven-parent-4.pom
(10 KB at 813.5 KB/sec)
Downloading: http://people.apache.org/~garyh/mvn/org/codehaus/plexus/plexus-utils/1.5.12/plexus-utils-1.5.12.pom
Downloading: http://repo.maven.apache.org/maven2/org/codehaus/plexus/plexus-utils/1.5.12/plexus-utils-1.5.12.pom
Downloaded: http://repo.maven.apache.org/maven2/org/codehaus/plexus/plexus-utils/1.5.12/plexus-utils-1.5.12.pom
(6 KB at 458.5 KB/sec)
Downloading: http://people.apache.org/~garyh/mvn/org/codehaus/plexus/plexus-velocity/1.1.3/plexus-velocity-1.1.3.pom
Downloading: http://repo.maven.apache.org/maven2/org/codehaus/plexus/plexus-velocity/1.1.3/plexus-velocity-1.1.3.pom
Downloaded: http://repo.maven.apache.org/maven2/org/codehaus/plexus/plexus-velocity/1.1.3/plexus-velocity-1.1.3.pom
(976 B at 79.4 KB/sec)
Downloading: http://people.apache.org/~garyh/mvn/org/codehaus/plexus/plexus-components/1.1.5/plexus-components-1.1.5.pom
Downloading: http://repo.maven.apache.org/maven2/org/codehaus/plexus/plexus-components/1.1.5/plexus-components-1.1.5.pom
Downloaded: http://repo.maven.apache.org/maven2/org/codehaus/plexus/plexus-components/1.1.5/plexus-components-1.1.5.pom
(3 KB at 89.8 KB/sec)
Downloading: http://people.apache.org/~garyh/mvn/commons-collections/commons-collections/2.0/commons-collections-2.0.pom
Downloading: http://repo.maven.apache.org/maven2/commons-collections/commons-collections/2.0/commons-collections-2.0.pom
Downloaded: http://repo.maven.apache.org/maven2/commons-collections/commons-collections/2.0/commons-collections-2.0.pom
(171 B at 8.8 KB/sec)
Downloading: http://people.apache.org/~garyh/mvn/velocity/velocity/1.4/velocity-1.4.pom
Downloading: http://repo.maven.apache.org/maven2/velocity/velocity/1.4/velocity-1.4.pom
Downloaded: http://repo.maven.apache.org/maven2/velocity/velocity/1.4/velocity-1.4.pom (3
KB at 188.8 KB/sec)
Downloading: http://people.apache.org/~garyh/mvn/org/codehaus/plexus/plexus-resources/1.0-alpha-5/plexus-resources-1.0-alpha-5.pom
Downloading: http://repo.maven.apache.org/maven2/org/codehaus/plexus/plexus-resources/1.0-alpha-5/plexus-resources-1.0-alpha-5.pom
Downloaded: http://repo.maven.apache.org/maven2/org/codehaus/plexus/plexus-resources/1.0-alpha-5/plexus-resources-1.0-alpha-5.pom
(2 KB at 60.3 KB/sec)
Downloading: http://people.apache.org/~garyh/mvn/org/apache/maven/shared/maven-artifact-resolver/1.0/maven-artifact-resolver-1.0.jar
Downloading: http://people.apache.org/~garyh/mvn/org/apache/maven/shared/maven-filtering/1.0-beta-3/maven-filtering-1.0-beta-3.jar
Downloading: http://people.apache.org/~garyh/mvn/org/sonatype/plexus/plexus-build-api/0.0.4/plexus-build-api-0.0.4.jar
Downloading: http://people.apache.org/~garyh/mvn/org/apache/maven/reporting/maven-reporting-api/2.0.5/maven-reporting-api-2.0.5.jar
Downloading: http://people.apache.org/~garyh/mvn/velocity/velocity-dep/1.4/velocity-dep-1.4.jar
Downloading: http://people.apache.org/~garyh/mvn/org/apache/maven/shared/maven-common-artifact-filters/1.0/maven-common-artifact-filters-1.0.jar
Downloading: http://people.apache.org/~garyh/mvn/org/apache/maven/shared/maven-plugin-testing-harness/1.1/maven-plugin-testing-harness-1.1.jar
Downloading: http://people.apache.org/~garyh/mvn/org/codehaus/plexus/plexus-archiver/1.0-alpha-7/plexus-archiver-1.0-alpha-7.jar
Downloading: http://people.apache.org/~garyh/mvn/org/apache/maven/shared/maven-downloader/1.1/maven-downloader-1.1.jar
Downloading: http://people.apache.org/~garyh/mvn/org/codehaus/plexus/plexus-interpolation/1.12/plexus-interpolation-1.12.jar
Downloading: http://people.apache.org/~garyh/mvn/org/codehaus/plexus/plexus-utils/1.5.12/plexus-utils-1.5.12.jar
Downloading: http://people.apache.org/~garyh/mvn/org/codehaus/plexus/plexus-velocity/1.1.3/plexus-velocity-1.1.3.jar
Downloading: http://people.apache.org/~garyh/mvn/commons-collections/commons-collections/2.0/commons-collections-2.0.jar
Downloading: http://people.apache.org/~garyh/mvn/velocity/velocity/1.4/velocity-1.4.jar
Downloading: http://people.apache.org/~garyh/mvn/org/codehaus/plexus/plexus-resources/1.0-alpha-5/plexus-resources-1.0-alpha-5.jar
Downloading: http://repo.maven.apache.org/maven2/org/apache/maven/shared/maven-artifact-resolver/1.0/maven-artifact-resolver-1.0.jar
Downloading: http://repo.maven.apache.org/maven2/org/apache/maven/shared/maven-filtering/1.0-beta-3/maven-filtering-1.0-beta-3.jar
Downloading: http://repo.maven.apache.org/maven2/org/apache/maven/reporting/maven-reporting-api/2.0.5/maven-reporting-api-2.0.5.jar
Downloading: http://repo.maven.apache.org/maven2/org/sonatype/plexus/plexus-build-api/0.0.4/plexus-build-api-0.0.4.jar
Downloading: http://repo.maven.apache.org/maven2/velocity/velocity-dep/1.4/velocity-dep-1.4.jar
Downloaded: http://repo.maven.apache.org/maven2/org/apache/maven/shared/maven-artifact-resolver/1.0/maven-artifact-resolver-1.0.jar
(14 KB at 697.6 KB/sec)
Downloading: http://repo.maven.apache.org/maven2/org/apache/maven/shared/maven-common-artifact-filters/1.0/maven-common-artifact-filters-1.0.jar
Downloaded: http://repo.maven.apache.org/maven2/org/apache/maven/reporting/maven-reporting-api/2.0.5/maven-reporting-api-2.0.5.jar
(10 KB at 510.9 KB/sec)
Downloading: http://repo.maven.apache.org/maven2/org/apache/maven/shared/maven-plugin-testing-harness/1.1/maven-plugin-testing-harness-1.1.jar
Downloaded: http://repo.maven.apache.org/maven2/org/sonatype/plexus/plexus-build-api/0.0.4/plexus-build-api-0.0.4.jar
(7 KB at 369.4 KB/sec)
Downloading: http://repo.maven.apache.org/maven2/org/codehaus/plexus/plexus-archiver/1.0-alpha-7/plexus-archiver-1.0-alpha-7.jar
Downloaded: http://repo.maven.apache.org/maven2/org/apache/maven/shared/maven-filtering/1.0-beta-3/maven-filtering-1.0-beta-3.jar
(34 KB at 1343.9 KB/sec)
Downloading: http://repo.maven.apache.org/maven2/org/apache/maven/shared/maven-downloader/1.1/maven-downloader-1.1.jar
Downloaded: http://repo.maven.apache.org/maven2/org/apache/maven/shared/maven-common-artifact-filters/1.0/maven-common-artifact-filters-1.0.jar
(27 KB at 1400.9 KB/sec)
Downloading: http://repo.maven.apache.org/maven2/org/codehaus/plexus/plexus-interpolation/1.12/plexus-interpolation-1.12.jar
Downloaded: http://repo.maven.apache.org/maven2/org/apache/maven/shared/maven-downloader/1.1/maven-downloader-1.1.jar
(7 KB at 486.6 KB/sec)
Downloading: http://repo.maven.apache.org/maven2/org/codehaus/plexus/plexus-utils/1.5.12/plexus-utils-1.5.12.jar
Downloaded: http://repo.maven.apache.org/maven2/org/apache/maven/shared/maven-plugin-testing-harness/1.1/maven-plugin-testing-harness-1.1.jar
(32 KB at 1866.7 KB/sec)
Downloading: http://repo.maven.apache.org/maven2/org/codehaus/plexus/plexus-velocity/1.1.3/plexus-velocity-1.1.3.jar
Downloaded: http://repo.maven.apache.org/maven2/org/codehaus/plexus/plexus-archiver/1.0-alpha-7/plexus-archiver-1.0-alpha-7.jar
(139 KB at 5137.3 KB/sec)
Downloading: http://repo.maven.apache.org/maven2/commons-collections/commons-collections/2.0/commons-collections-2.0.jar
Downloaded: http://repo.maven.apache.org/maven2/org/codehaus/plexus/plexus-velocity/1.1.3/plexus-velocity-1.1.3.jar
(8 KB at 594.5 KB/sec)
Downloading: http://repo.maven.apache.org/maven2/velocity/velocity/1.4/velocity-1.4.jar
Downloaded: http://repo.maven.apache.org/maven2/org/codehaus/plexus/plexus-interpolation/1.12/plexus-interpolation-1.12.jar
(60 KB at 3133.3 KB/sec)
Downloading: http://repo.maven.apache.org/maven2/org/codehaus/plexus/plexus-resources/1.0-alpha-5/plexus-resources-1.0-alpha-5.jar
Downloaded: http://repo.maven.apache.org/maven2/org/codehaus/plexus/plexus-utils/1.5.12/plexus-utils-1.5.12.jar
(276 KB at 9482.9 KB/sec)
Downloaded: http://repo.maven.apache.org/maven2/org/codehaus/plexus/plexus-resources/1.0-alpha-5/plexus-resources-1.0-alpha-5.jar
(22 KB at 1812.1 KB/sec)
Downloaded: http://repo.maven.apache.org/maven2/velocity/velocity/1.4/velocity-1.4.jar (353
KB at 11022.1 KB/sec)
Downloaded: http://repo.maven.apache.org/maven2/commons-collections/commons-collections/2.0/commons-collections-2.0.jar
(89 KB at 849.8 KB/sec)
May 8, 2013 3:40:11 AM org.apache.maven.wagon.providers.http.httpclient.impl.client.DefaultRequestDirector
tryExecute
INFO: I/O exception (java.net.SocketException) caught when processing request: Connection
reset
May 8, 2013 3:40:11 AM org.apache.maven.wagon.providers.http.httpclient.impl.client.DefaultRequestDirector
tryExecute
INFO: Retrying request
May 8, 2013 3:41:11 AM org.apache.maven.wagon.providers.http.httpclient.impl.client.DefaultRequestDirector
tryExecute
INFO: I/O exception (java.net.SocketException) caught when processing request: Connection
reset
May 8, 2013 3:41:11 AM org.apache.maven.wagon.providers.http.httpclient.impl.client.DefaultRequestDirector
tryExecute
INFO: Retrying request
May 8, 2013 3:42:11 AM org.apache.maven.wagon.providers.http.httpclient.impl.client.DefaultRequestDirector
tryExecute
INFO: I/O exception (java.net.SocketException) caught when processing request: Connection
reset
May 8, 2013 3:42:11 AM org.apache.maven.wagon.providers.http.httpclient.impl.client.DefaultRequestDirector
tryExecute
INFO: Retrying request
May 8, 2013 3:43:11 AM hudson.maven.ExecutedMojo <init>
WARNING: Failed to getClass for org.apache.maven.plugin.resources.remote.ProcessRemoteResourcesMojo
[INFO] ------------------------------------------------------------------------
[INFO] BUILD FAILURE
[INFO] ------------------------------------------------------------------------
[INFO] Total time: 6:25.896s
[INFO] Finished at: Wed May 08 03:43:11 UTC 2013
[INFO] Final Memory: 21M/191M
[INFO] ------------------------------------------------------------------------
[JENKINS] Archiving <http://54.241.6.143/job/HBase-0.94-Security-Hadoop-2/ws/pom.xml>
to /var/lib/jenkins/jobs/HBase-0.94-Security-Hadoop-2/modules/org.apache.hbase$hbase/builds/2013-05-08_03-36-36/archive/org.apache.hbase/hbase/0.94.8-SNAPSHOT/hbase-0.94.8-SNAPSHOT.pom
Waiting for Jenkins to finish collecting data
mavenExecutionResult exceptions not empty
message : Failed to execute goal org.apache.maven.plugins:maven-remote-resources-plugin:1.1:process
(default) on project hbase: Execution default of goal org.apache.maven.plugins:maven-remote-resources-plugin:1.1:process
failed: Plugin org.apache.maven.plugins:maven-remote-resources-plugin:1.1 or one of its dependencies
could not be resolved: Could not transfer artifact velocity:velocity-dep:jar:1.4 from/to central
(http://repo.maven.apache.org/maven2): Connection reset
cause : Execution default of goal org.apache.maven.plugins:maven-remote-resources-plugin:1.1:process
failed: Plugin org.apache.maven.plugins:maven-remote-resources-plugin:1.1 or one of its dependencies
could not be resolved: Could not transfer artifact velocity:velocity-dep:jar:1.4 from/to central
(http://repo.maven.apache.org/maven2): Connection reset
Stack trace : 
org.apache.maven.lifecycle.LifecycleExecutionException: Failed to execute goal org.apache.maven.plugins:maven-remote-resources-plugin:1.1:process
(default) on project hbase: Execution default of goal org.apache.maven.plugins:maven-remote-resources-plugin:1.1:process
failed: Plugin org.apache.maven.plugins:maven-remote-resources-plugin:1.1 or one of its dependencies
could not be resolved: Could not transfer artifact velocity:velocity-dep:jar:1.4 from/to central
(http://repo.maven.apache.org/maven2): Connection reset
	at org.apache.maven.lifecycle.internal.MojoExecutor.execute(MojoExecutor.java:225)
	at org.apache.maven.lifecycle.internal.MojoExecutor.execute(MojoExecutor.java:153)
	at org.apache.maven.lifecycle.internal.MojoExecutor.execute(MojoExecutor.java:145)
	at org.apache.maven.lifecycle.internal.LifecycleModuleBuilder.buildProject(LifecycleModuleBuilder.java:84)
	at org.apache.maven.lifecycle.internal.LifecycleModuleBuilder.buildProject(LifecycleModuleBuilder.java:59)
	at org.apache.maven.lifecycle.internal.LifecycleStarter.singleThreadedBuild(LifecycleStarter.java:183)
	at org.apache.maven.lifecycle.internal.LifecycleStarter.execute(LifecycleStarter.java:161)
	at org.apache.maven.DefaultMaven.doExecute(DefaultMaven.java:320)
	at org.apache.maven.DefaultMaven.execute(DefaultMaven.java:156)
	at org.jvnet.hudson.maven3.launcher.Maven3Launcher.main(Maven3Launcher.java:79)
	at sun.reflect.NativeMethodAccessorImpl.invoke0(Native Method)
	at sun.reflect.NativeMethodAccessorImpl.invoke(NativeMethodAccessorImpl.java:39)
	at sun.reflect.DelegatingMethodAccessorImpl.invoke(DelegatingMethodAccessorImpl.java:25)
	at java.lang.reflect.Method.invoke(Method.java:597)
	at org.codehaus.plexus.classworlds.launcher.Launcher.launchStandard(Launcher.java:329)
	at org.codehaus.plexus.classworlds.launcher.Launcher.launch(Launcher.java:239)
	at org.jvnet.hudson.maven3.agent.Maven3Main.launch(Maven3Main.java:158)
	at hudson.maven.Maven3Builder.call(Maven3Builder.java:100)
	at hudson.maven.Maven3Builder.call(Maven3Builder.java:66)
	at hudson.remoting.UserRequest.perform(UserRequest.java:118)
	at hudson.remoting.UserRequest.perform(UserRequest.java:48)
	at hudson.remoting.Request$2.run(Request.java:326)
	at hudson.remoting.InterceptingExecutorService$1.call(InterceptingExecutorService.java:72)
	at java.util.concurrent.FutureTask$Sync.innerRun(FutureTask.java:303)
	at java.util.concurrent.FutureTask.run(FutureTask.java:138)
	at java.util.concurrent.ThreadPoolExecutor$Worker.runTask(ThreadPoolExecutor.java:895)
	at java.util.concurrent.ThreadPoolExecutor$Worker.run(ThreadPoolExecutor.java:918)
	at java.lang.Thread.run(Thread.java:662)
Caused by: org.apache.maven.plugin.PluginExecutionException: Execution default of goal org.apache.maven.plugins:maven-remote-resources-plugin:1.1:process
failed: Plugin org.apache.maven.plugins:maven-remote-resources-plugin:1.1 or one of its dependencies
could not be resolved: Could not transfer artifact velocity:velocity-dep:jar:1.4 from/to central
(http://repo.maven.apache.org/maven2): Connection reset
	at org.apache.maven.plugin.DefaultBuildPluginManager.executeMojo(DefaultBuildPluginManager.java:82)
	at org.apache.maven.lifecycle.internal.MojoExecutor.execute(MojoExecutor.java:209)
	... 27 more
Caused by: org.apache.maven.plugin.PluginResolutionException: Plugin org.apache.maven.plugins:maven-remote-resources-plugin:1.1
or one of its dependencies could not be resolved: Could not transfer artifact velocity:velocity-dep:jar:1.4
from/to central (http://repo.maven.apache.org/maven2): Connection reset
	at org.apache.maven.plugin.internal.DefaultPluginDependenciesResolver.resolve(DefaultPluginDependenciesResolver.java:215)
	at org.apache.maven.plugin.internal.DefaultMavenPluginManager.createPluginRealm(DefaultMavenPluginManager.java:353)
	at org.apache.maven.plugin.internal.DefaultMavenPluginManager.setupPluginRealm(DefaultMavenPluginManager.java:321)
	at org.apache.maven.plugin.DefaultBuildPluginManager.getPluginRealm(DefaultBuildPluginManager.java:175)
	at org.apache.maven.plugin.DefaultBuildPluginManager.executeMojo(DefaultBuildPluginManager.java:78)
	... 28 more
Caused by: org.sonatype.aether.resolution.ArtifactResolutionException: Could not transfer
artifact velocity:velocity-dep:jar:1.4 from/to central (http://repo.maven.apache.org/maven2):
Connection reset
	at org.sonatype.aether.impl.internal.DefaultArtifactResolver.resolve(DefaultArtifactResolver.java:538)
	at org.sonatype.aether.impl.internal.DefaultArtifactResolver.resolveArtifacts(DefaultArtifactResolver.java:216)
	at org.sonatype.aether.impl.internal.DefaultRepositorySystem.resolveDependencies(DefaultRepositorySystem.java:358)
	at org.apache.maven.plugin.internal.DefaultPluginDependenciesResolver.resolve(DefaultPluginDependenciesResolver.java:207)
	... 32 more
Caused by: org.sonatype.aether.transfer.ArtifactTransferException: Could not transfer artifact
velocity:velocity-dep:jar:1.4 from/to central (http://repo.maven.apache.org/maven2): Connection
reset
	at org.sonatype.aether.connector.wagon.WagonRepositoryConnector$4.wrap(WagonRepositoryConnector.java:951)
	at org.sonatype.aether.connector.wagon.WagonRepositoryConnector$4.wrap(WagonRepositoryConnector.java:941)
	at org.sonatype.aether.connector.wagon.WagonRepositoryConnector$GetTask.run(WagonRepositoryConnector.java:669)
	at org.sonatype.aether.util.concurrency.RunnableErrorForwarder$1.run(RunnableErrorForwarder.java:60)
	... 3 more
Caused by: org.apache.maven.wagon.TransferFailedException: Connection reset
	at org.apache.maven.wagon.shared.http4.AbstractHttpClientWagon.fillInputData(AbstractHttpClientWagon.java:799)
	at org.apache.maven.wagon.StreamWagon.getInputStream(StreamWagon.java:116)
	at org.apache.maven.wagon.StreamWagon.getIfNewer(StreamWagon.java:88)
	at org.apache.maven.wagon.StreamWagon.get(StreamWagon.java:61)
	at org.sonatype.aether.connector.wagon.WagonRepositoryConnector$GetTask.run(WagonRepositoryConnector.java:601)
	... 4 more
Caused by: java.net.SocketException: Connection reset
	at java.net.SocketInputStream.read(SocketInputStream.java:168)
	at org.apache.maven.wagon.providers.http.httpclient.impl.io.AbstractSessionInputBuffer.fillBuffer(AbstractSessionInputBuffer.java:149)
	at org.apache.maven.wagon.providers.http.httpclient.impl.io.SocketInputBuffer.fillBuffer(SocketInputBuffer.java:110)
	at org.apache.maven.wagon.providers.http.httpclient.impl.io.AbstractSessionInputBuffer.readLine(AbstractSessionInputBuffer.java:264)
	at org.apache.maven.wagon.providers.http.httpclient.impl.conn.DefaultResponseParser.parseHead(DefaultResponseParser.java:98)
	at org.apache.maven.wagon.providers.http.httpclient.impl.io.AbstractMessageParser.parse(AbstractMessageParser.java:252)
	at org.apache.maven.wagon.providers.http.httpclient.impl.AbstractHttpClientConnection.receiveResponseHeader(AbstractHttpClientConnection.java:281)
	at org.apache.maven.wagon.providers.http.httpclient.impl.conn.DefaultClientConnection.receiveResponseHeader(DefaultClientConnection.java:247)
	at org.apache.maven.wagon.providers.http.httpclient.impl.conn.AbstractClientConnAdapter.receiveResponseHeader(AbstractClientConnAdapter.java:219)
	at org.apache.maven.wagon.providers.http.httpclient.protocol.HttpRequestExecutor.doReceiveResponse(HttpRequestExecutor.java:298)
	at org.apache.maven.wagon.providers.http.httpclient.protocol.HttpRequestExecutor.execute(HttpRequestExecutor.java:125)
	at org.apache.maven.wagon.providers.http.httpclient.impl.client.DefaultRequestDirector.tryExecute(DefaultRequestDirector.java:645)
	at org.apache.maven.wagon.providers.http.httpclient.impl.client.DefaultRequestDirector.execute(DefaultRequestDirector.java:464)
	at org.apache.maven.wagon.providers.http.httpclient.impl.client.AbstractHttpClient.execute(AbstractHttpClient.java:820)
	at org.apache.maven.wagon.providers.http.httpclient.impl.client.AbstractHttpClient.execute(AbstractHttpClient.java:754)
	at org.apache.maven.wagon.shared.http4.AbstractHttpClientWagon.execute(AbstractHttpClientWagon.java:674)
	at org.apache.maven.wagon.shared.http4.AbstractHttpClientWagon.fillInputData(AbstractHttpClientWagon.java:793)
	... 8 more
channel stopped

Mime
View raw message