hbase-dev mailing list archives

Site index · List index
Message view « Date » · « Thread »
Top « Date » · « Thread »
From apurt...@apache.org
Subject Build failed in Jenkins: HBase-0.94-Hadoop-2 #117
Date Wed, 08 May 2013 03:59:54 GMT
See <http://54.241.6.143/job/HBase-0.94-Hadoop-2/117/>

------------------------------------------
[...truncated 1693 lines...]
A         src/examples/mapreduce/org/apache
A         src/examples/mapreduce/org/apache/hadoop
A         src/examples/mapreduce/org/apache/hadoop/hbase
A         src/examples/mapreduce/org/apache/hadoop/hbase/mapreduce
A         src/examples/mapreduce/org/apache/hadoop/hbase/mapreduce/SampleUploader.java
A         src/examples/mapreduce/org/apache/hadoop/hbase/mapreduce/IndexBuilder.java
A         src/examples/mapreduce/index-builder-setup.rb
A         src/examples/README.txt
A         src/packages
A         src/packages/update-hbase-env.sh
A         src/packages/conf-pseudo
A         src/packages/conf-pseudo/hbase-site.xml
A         src/packages/deb
A         src/packages/deb/conf-pseudo.control
A         src/packages/deb/conf-pseudo.control/control
A         src/packages/deb/conf-pseudo.control/postinst
A         src/packages/deb/conf-pseudo.control/conffile
A         src/packages/deb/conf-pseudo.control/prerm
A         src/packages/deb/hbase.control
A         src/packages/deb/hbase.control/control
A         src/packages/deb/hbase.control/postinst
A         src/packages/deb/hbase.control/postrm
A         src/packages/deb/hbase.control/preinst
A         src/packages/deb/hbase.control/conffile
A         src/packages/deb/hbase.control/prerm
A         src/packages/deb/init.d
A         src/packages/deb/init.d/hbase-regionserver
A         src/packages/deb/init.d/hbase-master
A         src/packages/build.xml
A         src/packages/rpm
A         src/packages/rpm/init.d
A         src/packages/rpm/init.d/hbase-regionserver
A         src/packages/rpm/init.d/hbase-master
A         src/packages/rpm/spec
A         src/packages/rpm/spec/conf-pseudo.spec
A         src/packages/rpm/spec/hbase.spec
A         bin
AU        bin/hbase-daemons.sh
AU        bin/hbase
A         bin/get-active-master.rb
AU        bin/start-hbase.sh
A         bin/hirb.rb
A         bin/region_status.rb
AU        bin/hbase-daemon.sh
A         bin/region_mover.rb
A         bin/hbase-config.sh
AU        bin/local-regionservers.sh
AU        bin/zookeepers.sh
AU        bin/local-master-backup.sh
AU        bin/rolling-restart.sh
AU        bin/graceful_stop.sh
AU        bin/regionservers.sh
AU        bin/master-backup.sh
A         bin/replication
A         bin/replication/copy_tables_desc.rb
A         bin/hbase-jruby
AU        bin/stop-hbase.sh
A         dev-support
AU        dev-support/smart-apply-patch.sh
AU        dev-support/test-util.sh
AU        dev-support/findHangingTest.sh
AU        dev-support/test-patch.sh
A         dev-support/test-patch.properties
AU        dev-support/hbasetests.sh
A         .arcconfig
A         pom.xml
A         README.txt
 U        .
At revision 1480152
no change for https://svn.apache.org/repos/asf/hbase/branches/0.94 since the previous build
[HBase-0.94-Hadoop-2] $ /bin/bash -xe /tmp/hudson5730570236021816583.sh
+ uname -a
Linux ip-10-196-24-226 3.4.36-39.44.amzn1.x86_64 #1 SMP Tue Mar 19 05:24:46 UTC 2013 x86_64
x86_64 x86_64 GNU/Linux
+ ulimit -a
core file size          (blocks, -c) 0
data seg size           (kbytes, -d) unlimited
scheduling priority             (-e) 0
file size               (blocks, -f) unlimited
pending signals                 (-i) 119688
max locked memory       (kbytes, -l) 64
max memory size         (kbytes, -m) unlimited
open files                      (-n) 65536
pipe size            (512 bytes, -p) 8
POSIX message queues     (bytes, -q) 819200
real-time priority              (-r) 0
stack size              (kbytes, -s) 8192
cpu time               (seconds, -t) unlimited
max user processes              (-u) 65536
virtual memory          (kbytes, -v) unlimited
file locks                      (-x) unlimited
+ mvn -version
Apache Maven 3.0.4 (r1232337; 2012-01-17 08:44:56+0000)
Maven home: /opt/maven
Java version: 1.6.0_43, vendor: Sun Microsystems Inc.
Java home: /usr/java/jdk1.6.0_43/jre
Default locale: en_US, platform encoding: UTF-8
OS name: "linux", version: "3.4.36-39.44.amzn1.x86_64", arch: "amd64", family: "unix"
Parsing POMs
[HBase-0.94-Hadoop-2] $ /usr/java/default/bin/java -Xmx3g -XX:MaxPermSize=768m -cp /home/ec2-user/jenkins/maven3-agent.jar:/opt/maven/boot/plexus-classworlds-2.4.jar
org.jvnet.hudson.maven3.agent.Maven3Main /opt/maven /tmp/slave.jar /home/ec2-user/jenkins/maven3-interceptor.jar
33332
<===[JENKINS REMOTING CAPACITY]===>   channel started
log4j:WARN No appenders could be found for logger (org.apache.commons.beanutils.converters.BooleanConverter).
log4j:WARN Please initialize the log4j system properly.
Executing Maven:  -B -f <http://54.241.6.143/job/HBase-0.94-Hadoop-2/ws/pom.xml> -Dmaven.repo.local=/home/ec2-user/jenkins/maven-repositories/0
-PrunAllTests -Dmaven.test.redirectTestOutputToFile=true -DskipITs -Prelease -Dhadoop.profile=2.0
install site assembly:single
[INFO] Scanning for projects...
[INFO]                                                                         
[INFO] ------------------------------------------------------------------------
[INFO] Building HBase 0.94.8-SNAPSHOT
[INFO] ------------------------------------------------------------------------
[INFO] 
[INFO] --- maven-antrun-plugin:1.6:run (arc-setup) @ hbase ---
[WARNING] Parameter tasks is deprecated, use target instead
[INFO] Executing tasks

main:
[INFO] Executed tasks
[INFO] 
[INFO] --- avro-maven-plugin:1.5.3:schema (generate-avro-sources) @ hbase ---
[INFO] 
[INFO] --- avro-maven-plugin:1.5.3:protocol (generate-avro-sources) @ hbase ---
[INFO] 
[INFO] --- maven-antrun-plugin:1.6:run (generate) @ hbase ---
[INFO] Executing tasks

main:
    [mkdir] Created dir: <http://54.241.6.143/job/HBase-0.94-Hadoop-2/ws/target/hbase-webapps>
     [copy] Copying 8 files to <http://54.241.6.143/job/HBase-0.94-Hadoop-2/ws/target/hbase-webapps>
2013-05-08 03:55:48,867 INFO  [pool-1-thread-1] mortbay.log (Slf4jLog.java:info(67)) - Logging
to org.slf4j.impl.Log4jLoggerAdapter(org.mortbay.log) via org.mortbay.log.Slf4jLog
    [mkdir] Created dir: <http://54.241.6.143/job/HBase-0.94-Hadoop-2/ws/target/hbase-webapps/master/WEB-INF>
    [mkdir] Created dir: <http://54.241.6.143/job/HBase-0.94-Hadoop-2/ws/target/hbase-webapps/regionserver/WEB-INF>
    [mkdir] Created dir: <http://54.241.6.143/job/HBase-0.94-Hadoop-2/ws/target/hbase-webapps/rest/WEB-INF>
    [mkdir] Created dir: <http://54.241.6.143/job/HBase-0.94-Hadoop-2/ws/target/hbase-webapps/thrift/WEB-INF>
[INFO] Executed tasks
[INFO] 
[INFO] --- build-helper-maven-plugin:1.5:add-source (jspcSource-packageInfo-Avro-source) @
hbase ---
[INFO] Source directory: <http://54.241.6.143/job/HBase-0.94-Hadoop-2/ws/target/generated-jamon>
added.
[INFO] Source directory: <http://54.241.6.143/job/HBase-0.94-Hadoop-2/ws/target/generated-sources/java>
added.
[INFO] 
[INFO] --- jamon-maven-plugin:2.3.4:translate (default) @ hbase ---
[INFO] Translating 4 templates from <http://54.241.6.143/job/HBase-0.94-Hadoop-2/ws/src/main/jamon>
to <http://54.241.6.143/job/HBase-0.94-Hadoop-2/ws/target/generated-jamon>
[INFO] 
[INFO] --- maven-remote-resources-plugin:1.1:process (default) @ hbase ---
Downloading: http://people.apache.org/~garyh/mvn/velocity/velocity-dep/1.4/velocity-dep-1.4.jar
Downloading: http://repo.maven.apache.org/maven2/velocity/velocity-dep/1.4/velocity-dep-1.4.jar
May 8, 2013 3:56:52 AM org.apache.maven.wagon.providers.http.httpclient.impl.client.DefaultRequestDirector
tryExecute
INFO: I/O exception (java.net.SocketException) caught when processing request: Connection
reset
May 8, 2013 3:56:52 AM org.apache.maven.wagon.providers.http.httpclient.impl.client.DefaultRequestDirector
tryExecute
INFO: Retrying request
May 8, 2013 3:57:52 AM org.apache.maven.wagon.providers.http.httpclient.impl.client.DefaultRequestDirector
tryExecute
INFO: I/O exception (java.net.SocketException) caught when processing request: Connection
reset
May 8, 2013 3:57:52 AM org.apache.maven.wagon.providers.http.httpclient.impl.client.DefaultRequestDirector
tryExecute
INFO: Retrying request
May 8, 2013 3:58:52 AM org.apache.maven.wagon.providers.http.httpclient.impl.client.DefaultRequestDirector
tryExecute
INFO: I/O exception (java.net.SocketException) caught when processing request: Connection
reset
May 8, 2013 3:58:52 AM org.apache.maven.wagon.providers.http.httpclient.impl.client.DefaultRequestDirector
tryExecute
INFO: Retrying request
May 8, 2013 3:59:52 AM hudson.maven.ExecutedMojo <init>
WARNING: Failed to getClass for org.apache.maven.plugin.resources.remote.ProcessRemoteResourcesMojo
[INFO] ------------------------------------------------------------------------
[INFO] BUILD FAILURE
[INFO] ------------------------------------------------------------------------
[INFO] Total time: 4:12.604s
[INFO] Finished at: Wed May 08 03:59:52 UTC 2013
[INFO] Final Memory: 23M/408M
[INFO] ------------------------------------------------------------------------
[JENKINS] Archiving <http://54.241.6.143/job/HBase-0.94-Hadoop-2/ws/pom.xml> to /var/lib/jenkins/jobs/HBase-0.94-Hadoop-2/modules/org.apache.hbase$hbase/builds/2013-05-08_03-55-34/archive/org.apache.hbase/hbase/0.94.8-SNAPSHOT/hbase-0.94.8-SNAPSHOT.pom
Waiting for Jenkins to finish collecting data
mavenExecutionResult exceptions not empty
message : Failed to execute goal org.apache.maven.plugins:maven-remote-resources-plugin:1.1:process
(default) on project hbase: Execution default of goal org.apache.maven.plugins:maven-remote-resources-plugin:1.1:process
failed: Plugin org.apache.maven.plugins:maven-remote-resources-plugin:1.1 or one of its dependencies
could not be resolved: Could not transfer artifact velocity:velocity-dep:jar:1.4 from/to central
(http://repo.maven.apache.org/maven2): Connection reset
cause : Execution default of goal org.apache.maven.plugins:maven-remote-resources-plugin:1.1:process
failed: Plugin org.apache.maven.plugins:maven-remote-resources-plugin:1.1 or one of its dependencies
could not be resolved: Could not transfer artifact velocity:velocity-dep:jar:1.4 from/to central
(http://repo.maven.apache.org/maven2): Connection reset
Stack trace : 
org.apache.maven.lifecycle.LifecycleExecutionException: Failed to execute goal org.apache.maven.plugins:maven-remote-resources-plugin:1.1:process
(default) on project hbase: Execution default of goal org.apache.maven.plugins:maven-remote-resources-plugin:1.1:process
failed: Plugin org.apache.maven.plugins:maven-remote-resources-plugin:1.1 or one of its dependencies
could not be resolved: Could not transfer artifact velocity:velocity-dep:jar:1.4 from/to central
(http://repo.maven.apache.org/maven2): Connection reset
	at org.apache.maven.lifecycle.internal.MojoExecutor.execute(MojoExecutor.java:225)
	at org.apache.maven.lifecycle.internal.MojoExecutor.execute(MojoExecutor.java:153)
	at org.apache.maven.lifecycle.internal.MojoExecutor.execute(MojoExecutor.java:145)
	at org.apache.maven.lifecycle.internal.LifecycleModuleBuilder.buildProject(LifecycleModuleBuilder.java:84)
	at org.apache.maven.lifecycle.internal.LifecycleModuleBuilder.buildProject(LifecycleModuleBuilder.java:59)
	at org.apache.maven.lifecycle.internal.LifecycleStarter.singleThreadedBuild(LifecycleStarter.java:183)
	at org.apache.maven.lifecycle.internal.LifecycleStarter.execute(LifecycleStarter.java:161)
	at org.apache.maven.DefaultMaven.doExecute(DefaultMaven.java:320)
	at org.apache.maven.DefaultMaven.execute(DefaultMaven.java:156)
	at org.jvnet.hudson.maven3.launcher.Maven3Launcher.main(Maven3Launcher.java:79)
	at sun.reflect.NativeMethodAccessorImpl.invoke0(Native Method)
	at sun.reflect.NativeMethodAccessorImpl.invoke(NativeMethodAccessorImpl.java:39)
	at sun.reflect.DelegatingMethodAccessorImpl.invoke(DelegatingMethodAccessorImpl.java:25)
	at java.lang.reflect.Method.invoke(Method.java:597)
	at org.codehaus.plexus.classworlds.launcher.Launcher.launchStandard(Launcher.java:329)
	at org.codehaus.plexus.classworlds.launcher.Launcher.launch(Launcher.java:239)
	at org.jvnet.hudson.maven3.agent.Maven3Main.launch(Maven3Main.java:158)
	at hudson.maven.Maven3Builder.call(Maven3Builder.java:100)
	at hudson.maven.Maven3Builder.call(Maven3Builder.java:66)
	at hudson.remoting.UserRequest.perform(UserRequest.java:118)
	at hudson.remoting.UserRequest.perform(UserRequest.java:48)
	at hudson.remoting.Request$2.run(Request.java:326)
	at hudson.remoting.InterceptingExecutorService$1.call(InterceptingExecutorService.java:72)
	at java.util.concurrent.FutureTask$Sync.innerRun(FutureTask.java:303)
	at java.util.concurrent.FutureTask.run(FutureTask.java:138)
	at java.util.concurrent.ThreadPoolExecutor$Worker.runTask(ThreadPoolExecutor.java:895)
	at java.util.concurrent.ThreadPoolExecutor$Worker.run(ThreadPoolExecutor.java:918)
	at java.lang.Thread.run(Thread.java:662)
Caused by: org.apache.maven.plugin.PluginExecutionException: Execution default of goal org.apache.maven.plugins:maven-remote-resources-plugin:1.1:process
failed: Plugin org.apache.maven.plugins:maven-remote-resources-plugin:1.1 or one of its dependencies
could not be resolved: Could not transfer artifact velocity:velocity-dep:jar:1.4 from/to central
(http://repo.maven.apache.org/maven2): Connection reset
	at org.apache.maven.plugin.DefaultBuildPluginManager.executeMojo(DefaultBuildPluginManager.java:82)
	at org.apache.maven.lifecycle.internal.MojoExecutor.execute(MojoExecutor.java:209)
	... 27 more
Caused by: org.apache.maven.plugin.PluginResolutionException: Plugin org.apache.maven.plugins:maven-remote-resources-plugin:1.1
or one of its dependencies could not be resolved: Could not transfer artifact velocity:velocity-dep:jar:1.4
from/to central (http://repo.maven.apache.org/maven2): Connection reset
	at org.apache.maven.plugin.internal.DefaultPluginDependenciesResolver.resolve(DefaultPluginDependenciesResolver.java:215)
	at org.apache.maven.plugin.internal.DefaultMavenPluginManager.createPluginRealm(DefaultMavenPluginManager.java:353)
	at org.apache.maven.plugin.internal.DefaultMavenPluginManager.setupPluginRealm(DefaultMavenPluginManager.java:321)
	at org.apache.maven.plugin.DefaultBuildPluginManager.getPluginRealm(DefaultBuildPluginManager.java:175)
	at org.apache.maven.plugin.DefaultBuildPluginManager.executeMojo(DefaultBuildPluginManager.java:78)
	... 28 more
Caused by: org.sonatype.aether.resolution.ArtifactResolutionException: Could not transfer
artifact velocity:velocity-dep:jar:1.4 from/to central (http://repo.maven.apache.org/maven2):
Connection reset
	at org.sonatype.aether.impl.internal.DefaultArtifactResolver.resolve(DefaultArtifactResolver.java:538)
	at org.sonatype.aether.impl.internal.DefaultArtifactResolver.resolveArtifacts(DefaultArtifactResolver.java:216)
	at org.sonatype.aether.impl.internal.DefaultRepositorySystem.resolveDependencies(DefaultRepositorySystem.java:358)
	at org.apache.maven.plugin.internal.DefaultPluginDependenciesResolver.resolve(DefaultPluginDependenciesResolver.java:207)
	... 32 more
Caused by: org.sonatype.aether.transfer.ArtifactTransferException: Could not transfer artifact
velocity:velocity-dep:jar:1.4 from/to central (http://repo.maven.apache.org/maven2): Connection
reset
	at org.sonatype.aether.connector.wagon.WagonRepositoryConnector$4.wrap(WagonRepositoryConnector.java:951)
	at org.sonatype.aether.connector.wagon.WagonRepositoryConnector$4.wrap(WagonRepositoryConnector.java:941)
	at org.sonatype.aether.connector.wagon.WagonRepositoryConnector$GetTask.run(WagonRepositoryConnector.java:669)
	at org.sonatype.aether.util.concurrency.RunnableErrorForwarder$1.run(RunnableErrorForwarder.java:60)
	... 3 more
Caused by: org.apache.maven.wagon.TransferFailedException: Connection reset
	at org.apache.maven.wagon.shared.http4.AbstractHttpClientWagon.fillInputData(AbstractHttpClientWagon.java:799)
	at org.apache.maven.wagon.StreamWagon.getInputStream(StreamWagon.java:116)
	at org.apache.maven.wagon.StreamWagon.getIfNewer(StreamWagon.java:88)
	at org.apache.maven.wagon.StreamWagon.get(StreamWagon.java:61)
	at org.sonatype.aether.connector.wagon.WagonRepositoryConnector$GetTask.run(WagonRepositoryConnector.java:601)
	... 4 more
Caused by: java.net.SocketException: Connection reset
	at java.net.SocketInputStream.read(SocketInputStream.java:168)
	at org.apache.maven.wagon.providers.http.httpclient.impl.io.AbstractSessionInputBuffer.fillBuffer(AbstractSessionInputBuffer.java:149)
	at org.apache.maven.wagon.providers.http.httpclient.impl.io.SocketInputBuffer.fillBuffer(SocketInputBuffer.java:110)
	at org.apache.maven.wagon.providers.http.httpclient.impl.io.AbstractSessionInputBuffer.readLine(AbstractSessionInputBuffer.java:264)
	at org.apache.maven.wagon.providers.http.httpclient.impl.conn.DefaultResponseParser.parseHead(DefaultResponseParser.java:98)
	at org.apache.maven.wagon.providers.http.httpclient.impl.io.AbstractMessageParser.parse(AbstractMessageParser.java:252)
	at org.apache.maven.wagon.providers.http.httpclient.impl.AbstractHttpClientConnection.receiveResponseHeader(AbstractHttpClientConnection.java:281)
	at org.apache.maven.wagon.providers.http.httpclient.impl.conn.DefaultClientConnection.receiveResponseHeader(DefaultClientConnection.java:247)
	at org.apache.maven.wagon.providers.http.httpclient.impl.conn.AbstractClientConnAdapter.receiveResponseHeader(AbstractClientConnAdapter.java:219)
	at org.apache.maven.wagon.providers.http.httpclient.protocol.HttpRequestExecutor.doReceiveResponse(HttpRequestExecutor.java:298)
	at org.apache.maven.wagon.providers.http.httpclient.protocol.HttpRequestExecutor.execute(HttpRequestExecutor.java:125)
	at org.apache.maven.wagon.providers.http.httpclient.impl.client.DefaultRequestDirector.tryExecute(DefaultRequestDirector.java:645)
	at org.apache.maven.wagon.providers.http.httpclient.impl.client.DefaultRequestDirector.execute(DefaultRequestDirector.java:464)
	at org.apache.maven.wagon.providers.http.httpclient.impl.client.AbstractHttpClient.execute(AbstractHttpClient.java:820)
	at org.apache.maven.wagon.providers.http.httpclient.impl.client.AbstractHttpClient.execute(AbstractHttpClient.java:754)
	at org.apache.maven.wagon.shared.http4.AbstractHttpClientWagon.execute(AbstractHttpClientWagon.java:674)
	at org.apache.maven.wagon.shared.http4.AbstractHttpClientWagon.fillInputData(AbstractHttpClientWagon.java:793)
	... 8 more
channel stopped

Mime
View raw message