hbase-dev mailing list archives

Site index · List index
Message view « Date » · « Thread »
Top « Date » · « Thread »
From apurt...@apache.org
Subject Build failed in Jenkins: HBase-0.94-Hadoop-2 #131
Date Wed, 15 May 2013 04:47:43 GMT
See <http://54.241.6.143/job/HBase-0.94-Hadoop-2/131/>

------------------------------------------
[...truncated 5271 lines...]
Tests run: 12, Failures: 0, Errors: 0, Skipped: 0, Time elapsed: 13.331 sec
Running org.apache.hadoop.hbase.TestClusterBootOrder
Tests run: 2, Failures: 0, Errors: 0, Skipped: 0, Time elapsed: 29.739 sec
Running org.apache.hadoop.hbase.client.TestMetaMigrationRemovingHTD
Tests run: 3, Failures: 0, Errors: 0, Skipped: 0, Time elapsed: 21.286 sec
Running org.apache.hadoop.hbase.client.TestMetaScanner
Tests run: 1, Failures: 0, Errors: 0, Skipped: 0, Time elapsed: 12.572 sec
Running org.apache.hadoop.hbase.client.TestScannerTimeout
Tests run: 4, Failures: 0, Errors: 0, Skipped: 0, Time elapsed: 49.598 sec
Running org.apache.hadoop.hbase.client.TestShell
Tests run: 1, Failures: 0, Errors: 0, Skipped: 0, Time elapsed: 75.598 sec
Running org.apache.hadoop.hbase.client.TestSnapshotFromClient
Tests run: 3, Failures: 0, Errors: 0, Skipped: 0, Time elapsed: 27.683 sec
Running org.apache.hadoop.hbase.client.TestHCM
Running org.apache.hadoop.hbase.client.TestMultipleTimestamps
Tests run: 8, Failures: 0, Errors: 0, Skipped: 0, Time elapsed: 22.912 sec
Tests run: 8, Failures: 0, Errors: 0, Skipped: 0, Time elapsed: 80.349 sec
Running org.apache.hadoop.hbase.client.TestCloneSnapshotFromClient
Tests run: 3, Failures: 0, Errors: 0, Skipped: 0, Time elapsed: 82.892 sec
Running org.apache.hadoop.hbase.client.TestAdmin
Tests run: 41, Failures: 0, Errors: 0, Skipped: 0, Time elapsed: 127.4 sec
Running org.apache.hadoop.hbase.client.TestHTableUtil
Tests run: 2, Failures: 0, Errors: 0, Skipped: 0, Time elapsed: 12.998 sec
Running org.apache.hadoop.hbase.client.TestTimestampsFilter
Tests run: 3, Failures: 0, Errors: 0, Skipped: 0, Time elapsed: 16.746 sec
Running org.apache.hadoop.hbase.client.TestFromClientSide3
Tests run: 1, Failures: 0, Errors: 0, Skipped: 0, Time elapsed: 25.207 sec
Running org.apache.hadoop.hbase.client.TestHConnection
Tests run: 2, Failures: 0, Errors: 0, Skipped: 0, Time elapsed: 39.686 sec
Running org.apache.hadoop.hbase.client.TestMultiParallel
Tests run: 11, Failures: 0, Errors: 0, Skipped: 0, Time elapsed: 43.406 sec
Running org.apache.hadoop.hbase.client.replication.TestReplicationAdmin
Tests run: 1, Failures: 0, Errors: 0, Skipped: 0, Time elapsed: 2.22 sec
Running org.apache.hadoop.hbase.client.TestHTablePool$TestHTableReusablePool
Tests run: 8, Failures: 0, Errors: 0, Skipped: 0, Time elapsed: 4.221 sec
Running org.apache.hadoop.hbase.client.TestHTablePool$TestHTableThreadLocalPool
Tests run: 8, Failures: 0, Errors: 0, Skipped: 0, Time elapsed: 22.63 sec
Running org.apache.hadoop.hbase.snapshot.TestFlushSnapshotFromClient
Tests run: 5, Failures: 0, Errors: 0, Skipped: 0, Time elapsed: 38.433 sec
Running org.apache.hadoop.hbase.snapshot.TestSnapshotDescriptionUtils
Tests run: 2, Failures: 0, Errors: 0, Skipped: 0, Time elapsed: 1.168 sec
Running org.apache.hadoop.hbase.client.TestRestoreSnapshotFromClient
Tests run: 3, Failures: 0, Errors: 0, Skipped: 0, Time elapsed: 75.089 sec
Running org.apache.hadoop.hbase.snapshot.TestExportSnapshot
Tests run: 4, Failures: 0, Errors: 0, Skipped: 0, Time elapsed: 24.537 sec
Running org.apache.hadoop.hbase.TestMultiVersions
Tests run: 3, Failures: 0, Errors: 0, Skipped: 0, Time elapsed: 23.361 sec
Running org.apache.hadoop.hbase.client.TestFromClientSide
Tests run: 59, Failures: 0, Errors: 0, Skipped: 3, Time elapsed: 176.525 sec
Running org.apache.hadoop.hbase.client.TestFromClientSideWithCoprocessor
Tests run: 59, Failures: 0, Errors: 0, Skipped: 3, Time elapsed: 177.167 sec
Running org.apache.hadoop.hbase.util.TestPoolMap$TestRoundRobinPoolType
Tests run: 3, Failures: 0, Errors: 0, Skipped: 0, Time elapsed: 0.013 sec
Running org.apache.hadoop.hbase.util.TestPoolMap$TestThreadLocalPoolType
Tests run: 3, Failures: 0, Errors: 0, Skipped: 0, Time elapsed: 0.008 sec
Running org.apache.hadoop.hbase.util.TestPoolMap$TestReusablePoolType
Tests run: 3, Failures: 0, Errors: 0, Skipped: 0, Time elapsed: 0.049 sec
Running org.apache.hadoop.hbase.avro.TestAvroServer
Tests run: 3, Failures: 0, Errors: 0, Skipped: 0, Time elapsed: 24.4 sec
Running org.apache.hadoop.hbase.util.TestFSVisitor
Tests run: 3, Failures: 0, Errors: 0, Skipped: 0, Time elapsed: 17.349 sec
Running org.apache.hadoop.hbase.util.TestIdLock
Tests run: 1, Failures: 0, Errors: 0, Skipped: 0, Time elapsed: 17.379 sec
Running org.apache.hadoop.hbase.snapshot.TestRestoreFlushSnapshotFromClient
Tests run: 5, Failures: 0, Errors: 0, Skipped: 0, Time elapsed: 76.697 sec
Running org.apache.hadoop.hbase.util.TestRegionSplitter
Tests run: 5, Failures: 0, Errors: 0, Skipped: 0, Time elapsed: 19.403 sec
Running org.apache.hadoop.hbase.util.TestCoprocessorScanPolicy
Tests run: 2, Failures: 0, Errors: 0, Skipped: 0, Time elapsed: 17.507 sec
Running org.apache.hadoop.hbase.util.TestEnvironmentEdgeManager
Tests run: 2, Failures: 0, Errors: 0, Skipped: 0, Time elapsed: 0.676 sec
Running org.apache.hadoop.hbase.util.TestMiniClusterLoadEncoded
Tests run: 4, Failures: 0, Errors: 0, Skipped: 0, Time elapsed: 59.454 sec
Running org.apache.hadoop.hbase.util.hbck.TestOfflineMetaRebuildBase
Tests run: 1, Failures: 0, Errors: 0, Skipped: 0, Time elapsed: 26.65 sec
Running org.apache.hadoop.hbase.util.hbck.TestOfflineMetaRebuildOverlap
Tests run: 1, Failures: 0, Errors: 0, Skipped: 0, Time elapsed: 29.764 sec
Running org.apache.hadoop.hbase.util.hbck.TestOfflineMetaRebuildHole
Tests run: 1, Failures: 0, Errors: 0, Skipped: 0, Time elapsed: 27.471 sec
Running org.apache.hadoop.hbase.util.TestFSUtils
Tests run: 4, Failures: 0, Errors: 0, Skipped: 0, Time elapsed: 9.36 sec
Running org.apache.hadoop.hbase.util.TestMergeTable
Tests run: 1, Failures: 0, Errors: 0, Skipped: 0, Time elapsed: 19.493 sec
Running org.apache.hadoop.hbase.util.TestDefaultEnvironmentEdge
Tests run: 1, Failures: 0, Errors: 0, Skipped: 0, Time elapsed: 0.322 sec
Running org.apache.hadoop.hbase.util.TestFSTableDescriptors
Tests run: 11, Failures: 0, Errors: 0, Skipped: 0, Time elapsed: 1.892 sec
Running org.apache.hadoop.hbase.util.TestSizeBasedThrottler
Tests run: 3, Failures: 0, Errors: 0, Skipped: 0, Time elapsed: 157.687 sec
Running org.apache.hadoop.hbase.util.TestMiniClusterLoadParallel
Tests run: 4, Failures: 0, Errors: 0, Skipped: 0, Time elapsed: 122.499 sec
Running org.apache.hadoop.hbase.io.hfile.TestHFilePerformance
Tests run: 1, Failures: 0, Errors: 0, Skipped: 0, Time elapsed: 8.015 sec
Running org.apache.hadoop.hbase.io.hfile.TestCacheOnWrite
Tests run: 36, Failures: 0, Errors: 0, Skipped: 0, Time elapsed: 47.06 sec
Running org.apache.hadoop.hbase.io.hfile.TestLruBlockCache
Tests run: 16, Failures: 0, Errors: 0, Skipped: 0, Time elapsed: 1.272 sec
Running org.apache.hadoop.hbase.io.hfile.TestChecksum
Tests run: 3, Failures: 0, Errors: 0, Skipped: 0, Time elapsed: 2.69 sec
Running org.apache.hadoop.hbase.io.hfile.TestFixedFileTrailer
Tests run: 2, Failures: 0, Errors: 0, Skipped: 0, Time elapsed: 2.205 sec
Running org.apache.hadoop.hbase.util.TestMiniClusterLoadSequential
Tests run: 4, Failures: 0, Errors: 0, Skipped: 0, Time elapsed: 109.234 sec
Running org.apache.hadoop.hbase.util.TestHBaseFsck
Tests run: 34, Failures: 0, Errors: 0, Skipped: 0, Time elapsed: 249.48 sec
Running org.apache.hadoop.hbase.io.hfile.TestHFileBlock
Tests run: 16, Failures: 0, Errors: 0, Skipped: 0, Time elapsed: 56.702 sec
Running org.apache.hadoop.hbase.util.TestMergeTool
Tests run: 1, Failures: 0, Errors: 0, Skipped: 0, Time elapsed: 280.052 sec
Running org.apache.hadoop.hbase.io.hfile.slab.TestSingleSizeCache
Tests run: 5, Failures: 0, Errors: 0, Skipped: 0, Time elapsed: 59.112 sec
Running org.apache.hadoop.hbase.io.hfile.TestHFileBlockIndex
Tests run: 10, Failures: 0, Errors: 0, Skipped: 0, Time elapsed: 18.14 sec
Running org.apache.hadoop.hbase.io.hfile.TestHFileBlockCompatibility
Tests run: 10, Failures: 0, Errors: 0, Skipped: 0, Time elapsed: 3.516 sec
Running org.apache.hadoop.hbase.io.hfile.TestHFileSeek
Tests run: 1, Failures: 0, Errors: 0, Skipped: 0, Time elapsed: 6.457 sec
Running org.apache.hadoop.hbase.io.hfile.slab.TestSlabCache
Tests run: 7, Failures: 0, Errors: 0, Skipped: 0, Time elapsed: 31.99 sec
Running org.apache.hadoop.hbase.io.hfile.TestForceCacheImportantBlocks
Tests run: 4, Failures: 0, Errors: 0, Skipped: 0, Time elapsed: 98.216 sec
Running org.apache.hadoop.hbase.io.encoding.TestLoadAndSwitchEncodeOnDisk
Tests run: 1, Failures: 0, Errors: 0, Skipped: 0, Time elapsed: 37.444 sec
Running org.apache.hadoop.hbase.io.TestFileLink
Tests run: 3, Failures: 0, Errors: 0, Skipped: 0, Time elapsed: 19.176 sec
Running org.apache.hadoop.hbase.replication.TestReplicationZookeeper
Tests run: 1, Failures: 0, Errors: 0, Skipped: 0, Time elapsed: 2.824 sec
Running org.apache.hadoop.hbase.replication.regionserver.TestReplicationSink
Tests run: 5, Failures: 0, Errors: 0, Skipped: 0, Time elapsed: 18.078 sec
Running org.apache.hadoop.hbase.replication.regionserver.TestReplicationSourceManager
Tests run: 3, Failures: 0, Errors: 0, Skipped: 0, Time elapsed: 3.488 sec
Running org.apache.hadoop.hbase.io.encoding.TestUpgradeFromHFileV1ToEncoding
Tests run: 1, Failures: 0, Errors: 0, Skipped: 0, Time elapsed: 108.943 sec
Running org.apache.hadoop.hbase.replication.TestMultiSlaveReplication
Tests run: 1, Failures: 0, Errors: 0, Skipped: 0, Time elapsed: 32.846 sec
Running org.apache.hadoop.hbase.io.encoding.TestDataBlockEncoders
Tests run: 12, Failures: 0, Errors: 0, Skipped: 0, Time elapsed: 184.096 sec
Running org.apache.hadoop.hbase.replication.TestReplicationDisableInactivePeer
Tests run: 1, Failures: 0, Errors: 0, Skipped: 0, Time elapsed: 80.915 sec
Running org.apache.hadoop.hbase.replication.TestReplicationSmallTests
Tests run: 8, Failures: 0, Errors: 0, Skipped: 0, Time elapsed: 120.374 sec
Running org.apache.hadoop.hbase.replication.TestMasterReplication
Tests run: 2, Failures: 0, Errors: 0, Skipped: 0, Time elapsed: 53.54 sec
Running org.apache.hadoop.hbase.replication.TestReplicationSource
Tests run: 1, Failures: 0, Errors: 0, Skipped: 0, Time elapsed: 5.701 sec
Running org.apache.hadoop.hbase.io.encoding.TestChangingEncoding
Tests run: 4, Failures: 0, Errors: 0, Skipped: 0, Time elapsed: 250.018 sec
Running org.apache.hadoop.hbase.replication.TestReplicationQueueFailover
Tests run: 1, Failures: 0, Errors: 0, Skipped: 0, Time elapsed: 61.51 sec
Running org.apache.hadoop.hbase.replication.TestReplicationQueueFailoverCompressed
Tests run: 1, Failures: 0, Errors: 0, Skipped: 0, Time elapsed: 55.482 sec

Results :

Failed tests:   testMRIncrementalLoad(org.apache.hadoop.hbase.mapreduce.TestHFileOutputFormat)
  testMRIncrementalLoadWithSplit(org.apache.hadoop.hbase.mapreduce.TestHFileOutputFormat)
  testExcludeAllFromMinorCompaction(org.apache.hadoop.hbase.mapreduce.TestHFileOutputFormat)
  testExcludeMinorCompaction(org.apache.hadoop.hbase.mapreduce.TestHFileOutputFormat)
  testMultithreadedTableMapper(org.apache.hadoop.hbase.mapreduce.TestMultithreadedTableMapper)
  testScanEmptyToEmpty(org.apache.hadoop.hbase.mapreduce.TestTableInputFormatScan1)
  testScanEmptyToAPP(org.apache.hadoop.hbase.mapreduce.TestTableInputFormatScan1)
  testScanEmptyToBBA(org.apache.hadoop.hbase.mapreduce.TestTableInputFormatScan1)
  testScanEmptyToBBB(org.apache.hadoop.hbase.mapreduce.TestTableInputFormatScan1)
  testScanEmptyToOPP(org.apache.hadoop.hbase.mapreduce.TestTableInputFormatScan1)
  testMultiRegionTable(org.apache.hadoop.hbase.mapreduce.TestTableMapReduce)
  testScanEmptyToEmpty(org.apache.hadoop.hbase.mapreduce.TestMultiTableInputFormat)
  testScanEmptyToAPP(org.apache.hadoop.hbase.mapreduce.TestMultiTableInputFormat)
  testScanOPPToEmpty(org.apache.hadoop.hbase.mapreduce.TestMultiTableInputFormat)
  testScanYZYToEmpty(org.apache.hadoop.hbase.mapreduce.TestMultiTableInputFormat)
  testScanOBBToOPP(org.apache.hadoop.hbase.mapreduce.TestTableInputFormatScan2)
  testScanOBBToQPP(org.apache.hadoop.hbase.mapreduce.TestTableInputFormatScan2)
  testScanYYXToEmpty(org.apache.hadoop.hbase.mapreduce.TestTableInputFormatScan2)
  testScanYYYToEmpty(org.apache.hadoop.hbase.mapreduce.TestTableInputFormatScan2)
  testScanYZYToEmpty(org.apache.hadoop.hbase.mapreduce.TestTableInputFormatScan2)
  testScanFromConfiguration(org.apache.hadoop.hbase.mapreduce.TestTableInputFormatScan2)

Tests in error: 
  testSimpleCase(org.apache.hadoop.hbase.mapreduce.TestImportExport)
  testMetaExport(org.apache.hadoop.hbase.mapreduce.TestImportExport)
  testWithDeletes(org.apache.hadoop.hbase.mapreduce.TestImportExport)
  testWithFilter(org.apache.hadoop.hbase.mapreduce.TestImportExport)
  testTimeRangeMapRed(org.apache.hadoop.hbase.mapreduce.TestTimeRangeMapRed): Failed to Start
org.apache.hadoop.mapred.MiniMRCluster
  testScanOBBToOPP(org.apache.hadoop.hbase.mapreduce.TestMultiTableInputFormat)
  testScanOPPToEmpty(org.apache.hadoop.hbase.mapreduce.TestTableInputFormatScan2)
  testMultiRegionTable(org.apache.hadoop.hbase.mapred.TestTableMapReduce)

Tests run: 1336, Failures: 21, Errors: 8, Skipped: 13

[JENKINS] Recording test results
[INFO] ------------------------------------------------------------------------
[INFO] BUILD FAILURE
[INFO] ------------------------------------------------------------------------
[INFO] Total time: 44:26.005s
[INFO] Finished at: Wed May 15 04:47:41 UTC 2013
[INFO] Final Memory: 144M/842M
[INFO] ------------------------------------------------------------------------
[JENKINS] Archiving <http://54.241.6.143/job/HBase-0.94-Hadoop-2/ws/pom.xml> to /var/lib/jenkins/jobs/HBase-0.94-Hadoop-2/modules/org.apache.hbase$hbase/builds/2013-05-15_04-03-09/archive/org.apache.hbase/hbase/0.94.8-SNAPSHOT/hbase-0.94.8-SNAPSHOT.pom
Waiting for Jenkins to finish collecting data
mavenExecutionResult exceptions not empty
message : Failed to execute goal org.apache.maven.plugins:maven-surefire-plugin:2.12-TRUNK-HBASE-2:test
(secondPartTestsExecution) on project hbase: There are test failures.

Please refer to <http://54.241.6.143/job/HBase-0.94-Hadoop-2/ws/target/surefire-reports>
for the individual test results.
cause : There are test failures.

Please refer to <http://54.241.6.143/job/HBase-0.94-Hadoop-2/ws/target/surefire-reports>
for the individual test results.
Stack trace : 
org.apache.maven.lifecycle.LifecycleExecutionException: Failed to execute goal org.apache.maven.plugins:maven-surefire-plugin:2.12-TRUNK-HBASE-2:test
(secondPartTestsExecution) on project hbase: There are test failures.

Please refer to <http://54.241.6.143/job/HBase-0.94-Hadoop-2/ws/target/surefire-reports>
for the individual test results.
	at org.apache.maven.lifecycle.internal.MojoExecutor.execute(MojoExecutor.java:213)
	at org.apache.maven.lifecycle.internal.MojoExecutor.execute(MojoExecutor.java:153)
	at org.apache.maven.lifecycle.internal.MojoExecutor.execute(MojoExecutor.java:145)
	at org.apache.maven.lifecycle.internal.LifecycleModuleBuilder.buildProject(LifecycleModuleBuilder.java:84)
	at org.apache.maven.lifecycle.internal.LifecycleModuleBuilder.buildProject(LifecycleModuleBuilder.java:59)
	at org.apache.maven.lifecycle.internal.LifecycleStarter.singleThreadedBuild(LifecycleStarter.java:183)
	at org.apache.maven.lifecycle.internal.LifecycleStarter.execute(LifecycleStarter.java:161)
	at org.apache.maven.DefaultMaven.doExecute(DefaultMaven.java:320)
	at org.apache.maven.DefaultMaven.execute(DefaultMaven.java:156)
	at org.jvnet.hudson.maven3.launcher.Maven3Launcher.main(Maven3Launcher.java:79)
	at sun.reflect.NativeMethodAccessorImpl.invoke0(Native Method)
	at sun.reflect.NativeMethodAccessorImpl.invoke(NativeMethodAccessorImpl.java:39)
	at sun.reflect.DelegatingMethodAccessorImpl.invoke(DelegatingMethodAccessorImpl.java:25)
	at java.lang.reflect.Method.invoke(Method.java:597)
	at org.codehaus.plexus.classworlds.launcher.Launcher.launchStandard(Launcher.java:329)
	at org.codehaus.plexus.classworlds.launcher.Launcher.launch(Launcher.java:239)
	at org.jvnet.hudson.maven3.agent.Maven3Main.launch(Maven3Main.java:158)
	at hudson.maven.Maven3Builder.call(Maven3Builder.java:100)
	at hudson.maven.Maven3Builder.call(Maven3Builder.java:66)
	at hudson.remoting.UserRequest.perform(UserRequest.java:118)
	at hudson.remoting.UserRequest.perform(UserRequest.java:48)
	at hudson.remoting.Request$2.run(Request.java:326)
	at hudson.remoting.InterceptingExecutorService$1.call(InterceptingExecutorService.java:72)
	at java.util.concurrent.FutureTask$Sync.innerRun(FutureTask.java:303)
	at java.util.concurrent.FutureTask.run(FutureTask.java:138)
	at java.util.concurrent.ThreadPoolExecutor$Worker.runTask(ThreadPoolExecutor.java:895)
	at java.util.concurrent.ThreadPoolExecutor$Worker.run(ThreadPoolExecutor.java:918)
	at java.lang.Thread.run(Thread.java:662)
Caused by: org.apache.maven.plugin.MojoFailureException: There are test failures.

Please refer to <http://54.241.6.143/job/HBase-0.94-Hadoop-2/ws/target/surefire-reports>
for the individual test results.
	at org.apache.maven.plugin.surefire.SurefireHelper.reportExecution(SurefireHelper.java:87)
	at org.apache.maven.plugin.surefire.SurefirePlugin.writeSummary(SurefirePlugin.java:651)
	at org.apache.maven.plugin.surefire.SurefirePlugin.handleSummary(SurefirePlugin.java:625)
	at org.apache.maven.plugin.surefire.AbstractSurefireMojo.executeAfterPreconditionsChecked(AbstractSurefireMojo.java:137)
	at org.apache.maven.plugin.surefire.AbstractSurefireMojo.execute(AbstractSurefireMojo.java:98)
	at org.apache.maven.plugin.DefaultBuildPluginManager.executeMojo(DefaultBuildPluginManager.java:101)
	at org.apache.maven.lifecycle.internal.MojoExecutor.execute(MojoExecutor.java:209)
	... 27 more
channel stopped

Mime
View raw message