hbase-dev mailing list archives

Site index · List index
Message view « Date » · « Thread »
Top « Date » · « Thread »
From apurt...@apache.org
Subject Build failed in Jenkins: HBase-0.94 #202
Date Wed, 29 May 2013 05:41:34 GMT
See <http://54.241.6.143/job/HBase-0.94/202/changes>

Changes:

[tedyu] HBASE-8609 Make the CopyTable support startRow, stopRow options (Shaohui)

------------------------------------------
[...truncated 34186 lines...]
85 warnings
[WARNING] Javadoc Warnings
[WARNING] <http://54.241.6.143/job/HBase-0.94/ws/src/main/java/org/apache/hadoop/hbase/util/Bytes.java>:44:
warning: sun.misc.Unsafe is Sun proprietary API and may be removed in a future release
[WARNING] import sun.misc.Unsafe;
[WARNING] ^
[WARNING] <http://54.241.6.143/job/HBase-0.94/ws/src/main/java/org/apache/hadoop/hbase/util/Bytes.java>:1051:
warning: sun.misc.Unsafe is Sun proprietary API and may be removed in a future release
[WARNING] static final Unsafe theUnsafe;
[WARNING] ^
[WARNING] <http://54.241.6.143/job/HBase-0.94/ws/src/main/java/org/apache/hadoop/hbase/HBaseFileSystem.java>:175:
warning - @return tag has no arguments.
[WARNING] <http://54.241.6.143/job/HBase-0.94/ws/src/main/java/org/apache/hadoop/hbase/HBaseFileSystem.java>:203:
warning - @return tag has no arguments.
[WARNING] <http://54.241.6.143/job/HBase-0.94/ws/src/main/java/org/apache/hadoop/hbase/HBaseFileSystem.java>:228:
warning - @param argument "dir" is not a parameter name.
[WARNING] <http://54.241.6.143/job/HBase-0.94/ws/src/main/java/org/apache/hadoop/hbase/HBaseIOException.java>:36:
warning - Tag @inheritDoc cannot be used in constructor documentation.  It can only be used
in the following types of documentation: method, inline text.
[WARNING] <http://54.241.6.143/job/HBase-0.94/ws/src/main/java/org/apache/hadoop/hbase/HBaseIOException.java>:43:
warning - Tag @inheritDoc cannot be used in constructor documentation.  It can only be used
in the following types of documentation: method, inline text.
[WARNING] <http://54.241.6.143/job/HBase-0.94/ws/src/main/java/org/apache/hadoop/hbase/HBaseIOException.java>:50:
warning - Tag @inheritDoc cannot be used in constructor documentation.  It can only be used
in the following types of documentation: method, inline text.
[WARNING] <http://54.241.6.143/job/HBase-0.94/ws/src/main/java/org/apache/hadoop/hbase/HBaseIOException.java>:36:
warning - Tag @inheritDoc cannot be used in constructor documentation.  It can only be used
in the following types of documentation: method, inline text.
[WARNING] <http://54.241.6.143/job/HBase-0.94/ws/src/main/java/org/apache/hadoop/hbase/HBaseIOException.java>:36:
warning - Tag @inheritDoc cannot be used in constructor documentation.  It can only be used
in the following types of documentation: method, inline text.
[WARNING] <http://54.241.6.143/job/HBase-0.94/ws/src/main/java/org/apache/hadoop/hbase/HBaseIOException.java>:43:
warning - Tag @inheritDoc cannot be used in constructor documentation.  It can only be used
in the following types of documentation: method, inline text.
[WARNING] <http://54.241.6.143/job/HBase-0.94/ws/src/main/java/org/apache/hadoop/hbase/HBaseIOException.java>:43:
warning - Tag @inheritDoc cannot be used in constructor documentation.  It can only be used
in the following types of documentation: method, inline text.
[WARNING] <http://54.241.6.143/job/HBase-0.94/ws/src/main/java/org/apache/hadoop/hbase/HBaseIOException.java>:50:
warning - Tag @inheritDoc cannot be used in constructor documentation.  It can only be used
in the following types of documentation: method, inline text.
[WARNING] <http://54.241.6.143/job/HBase-0.94/ws/src/main/java/org/apache/hadoop/hbase/HBaseIOException.java>:50:
warning - Tag @inheritDoc cannot be used in constructor documentation.  It can only be used
in the following types of documentation: method, inline text.
[WARNING] <http://54.241.6.143/job/HBase-0.94/ws/src/main/java/org/apache/hadoop/hbase/replication/regionserver/ReplicationHLogReaderManager.java>:62:
warning - @return tag has no arguments.
[WARNING] <http://54.241.6.143/job/HBase-0.94/ws/src/main/java/org/apache/hadoop/hbase/util/ByteBufferUtils.java>:409:
warning - @return tag has no arguments.
[WARNING] <http://54.241.6.143/job/HBase-0.94/ws/src/main/java/org/apache/hadoop/hbase/util/ByteBufferUtils.java>:386:
warning - @param argument "rightArray" is not a parameter name.
[WARNING] <http://54.241.6.143/job/HBase-0.94/ws/src/main/java/org/apache/hadoop/hbase/util/ChecksumFactory.java>:57:
warning - @param argument "theClass" is not a parameter name.
[WARNING] <http://54.241.6.143/job/HBase-0.94/ws/src/main/java/org/apache/hadoop/hbase/util/ChecksumType.java>:172:
warning - @param argument "b" is not a parameter name.
[WARNING] <http://54.241.6.143/job/HBase-0.94/ws/src/main/java/org/apache/hadoop/hbase/util/FSUtils.java>:1301:
warning - @return tag has no arguments.
[WARNING] <http://54.241.6.143/job/HBase-0.94/ws/src/main/java/org/apache/hadoop/hbase/util/FSUtils.java>:1352:
warning - @return tag has no arguments.
[WARNING] <http://54.241.6.143/job/HBase-0.94/ws/src/main/java/org/apache/hadoop/hbase/util/FSUtils.java>:132:
warning - DEFAULT_BUFFER_SIZE (referenced by @value tag) is an unknown reference.
[WARNING] <http://54.241.6.143/job/HBase-0.94/ws/src/main/java/org/apache/hadoop/hbase/util/FSUtils.java>:155:
warning - DEFAULT_BUFFER_SIZE (referenced by @value tag) is an unknown reference.
[WARNING] <http://54.241.6.143/job/HBase-0.94/ws/src/main/java/org/apache/hadoop/hbase/util/HBaseFsckRepair.java>:87:
warning - @param argument "conf" is not a parameter name.
[WARNING] <http://54.241.6.143/job/HBase-0.94/ws/src/main/java/org/apache/hadoop/hbase/util/HFileArchiveUtil.java>:50:
warning - @param argument "family" is not a parameter name.
[WARNING] <http://54.241.6.143/job/HBase-0.94/ws/src/main/java/org/apache/hadoop/hbase/util/RegionSplitter.java>:149:
warning - Tag @link: can't find rollingSplit(String, String, Configuration) in org.apache.hadoop.hbase.util.RegionSplitter
[WARNING] <http://54.241.6.143/job/HBase-0.94/ws/src/main/java/org/apache/hadoop/hbase/regionserver/ExplicitColumnTracker.java>:78:
warning - @param argument "ttl" is not a parameter name.
[WARNING] <http://54.241.6.143/job/HBase-0.94/ws/src/main/java/org/apache/hadoop/hbase/regionserver/HRegion.java>:438:
warning - @param argument "conf" is not a parameter name.
[WARNING] <http://54.241.6.143/job/HBase-0.94/ws/src/main/java/org/apache/hadoop/hbase/regionserver/HRegion.java>:4225:
warning - @param argument "boolean" is not a parameter name.
[WARNING] <http://54.241.6.143/job/HBase-0.94/ws/src/main/java/org/apache/hadoop/hbase/regionserver/HRegion.java>:4253:
warning - @param argument "boolean" is not a parameter name.
[WARNING] <http://54.241.6.143/job/HBase-0.94/ws/src/main/java/org/apache/hadoop/hbase/regionserver/HRegion.java>:4253:
warning - @param argument "boolean" is not a parameter name.
[WARNING] <http://54.241.6.143/job/HBase-0.94/ws/src/main/java/org/apache/hadoop/hbase/regionserver/RegionCoprocessorHost.java>:528:
warning - Tag @link: can't find preFlush(ObserverContext, Store, KeyValueScanner) in org.apache.hadoop.hbase.coprocessor.RegionObserver
[WARNING] <http://54.241.6.143/job/HBase-0.94/ws/src/main/java/org/apache/hadoop/hbase/regionserver/RegionSplitPolicy.java>:98:
warning - @return tag has no arguments.
[WARNING] <http://54.241.6.143/job/HBase-0.94/ws/src/main/java/org/apache/hadoop/hbase/regionserver/RegionSplitPolicy.java>:98:
warning - @param argument "htd" is not a parameter name.
[WARNING] <http://54.241.6.143/job/HBase-0.94/ws/src/main/java/org/apache/hadoop/hbase/regionserver/StoreFile.java>:94:
warning - Tag @link: can't find WriterBuilder in org.apache.hadoop.hbase.regionserver.StoreFile
[WARNING] <http://54.241.6.143/job/HBase-0.94/ws/src/main/java/org/apache/hadoop/hbase/regionserver/StoreFile.java>:254:
warning - @param argument "blockcache" is not a parameter name.
[WARNING] <http://54.241.6.143/job/HBase-0.94/ws/src/main/java/org/apache/hadoop/hbase/regionserver/StoreFileScanner.java>:224:
warning - @return tag has no arguments.
[WARNING] <http://54.241.6.143/job/HBase-0.94/ws/src/main/java/org/apache/hadoop/hbase/regionserver/metrics/OperationMetrics.java>:99:
warning - @param argument "conf" is not a parameter name.
[WARNING] <http://54.241.6.143/job/HBase-0.94/ws/src/main/java/org/apache/hadoop/hbase/regionserver/compactions/CompactionRequest.java>:124:
warning - @return tag has no arguments.
[WARNING] <http://54.241.6.143/job/HBase-0.94/ws/src/main/java/org/apache/hadoop/hbase/regionserver/compactions/CompactSelection.java>:129:
warning - @return tag has no arguments.
[WARNING] <http://54.241.6.143/job/HBase-0.94/ws/src/main/java/org/apache/hadoop/hbase/regionserver/compactions/CompactSelection.java>:129:
warning - @param argument "currentHour" is not a parameter name.
[WARNING] <http://54.241.6.143/job/HBase-0.94/ws/src/main/java/org/apache/hadoop/hbase/client/HTableInterface.java>:512:
warning - Tag @link: can't find autoFlush in org.apache.hadoop.hbase.client.HTableInterface
[WARNING] <http://54.241.6.143/job/HBase-0.94/ws/src/main/java/org/apache/hadoop/hbase/client/HTableInterface.java>:512:
warning - Tag @link: can't find autoFlush in org.apache.hadoop.hbase.client.HTableInterface
[WARNING] <http://54.241.6.143/job/HBase-0.94/ws/src/main/java/org/apache/hadoop/hbase/client/HTableInterface.java>:512:
warning - Tag @link: can't find clearBufferOnFail in org.apache.hadoop.hbase.client.HTableInterface
[WARNING] <http://54.241.6.143/job/HBase-0.94/ws/src/main/java/org/apache/hadoop/hbase/ipc/HRegionInterface.java>:91:
warning - @param argument "region" is not a parameter name.
[WARNING] <http://54.241.6.143/job/HBase-0.94/ws/src/main/java/org/apache/hadoop/hbase/ipc/HRegionInterface.java>:99:
warning - @param argument "region" is not a parameter name.
[WARNING] <http://54.241.6.143/job/HBase-0.94/ws/src/main/java/org/apache/hadoop/hbase/ipc/HRegionInterface.java>:99:
warning - @param argument "timestamp" is not a parameter name.
[WARNING] <http://54.241.6.143/job/HBase-0.94/ws/src/main/java/org/apache/hadoop/hbase/ipc/HRegionInterface.java>:114:
warning - @param argument "region" is not a parameter name.
[WARNING] <http://54.241.6.143/job/HBase-0.94/ws/src/main/java/org/apache/hadoop/hbase/ipc/HRegionInterface.java>:114:
warning - @param argument "CF" is not a parameter name.
[WARNING] <http://54.241.6.143/job/HBase-0.94/ws/src/main/java/org/apache/hadoop/hbase/ipc/HRegionInterface.java>:123:
warning - @param argument "region" is not a parameter name.
[WARNING] <http://54.241.6.143/job/HBase-0.94/ws/src/main/java/org/apache/hadoop/hbase/ipc/HRegionInterface.java>:123:
warning - @param argument "CF" is not a parameter name.
[WARNING] <http://54.241.6.143/job/HBase-0.94/ws/src/main/java/org/apache/hadoop/hbase/ipc/HRegionInterface.java>:131:
warning - @param argument "region" is not a parameter name.
[WARNING] <http://54.241.6.143/job/HBase-0.94/ws/src/main/java/org/apache/hadoop/hbase/coprocessor/example/BulkDeleteProtocol.java>:82:
warning - @return tag has no arguments.
[WARNING] <http://54.241.6.143/job/HBase-0.94/ws/src/main/java/org/apache/hadoop/hbase/coprocessor/RegionObserver.java>:244:
warning - @param argument "scantype" is not a parameter name.
[WARNING] <http://54.241.6.143/job/HBase-0.94/ws/src/main/java/org/apache/hadoop/hbase/client/HBaseAdmin.java>:509:
warning - @link: is an unknown tag.
[WARNING] <http://54.241.6.143/job/HBase-0.94/ws/src/main/java/org/apache/hadoop/hbase/client/HBaseAdmin.java>:509:
warning - @link: is an unknown tag.
[WARNING] <http://54.241.6.143/job/HBase-0.94/ws/src/main/java/org/apache/hadoop/hbase/client/HConnection.java>:297:
warning - Tag @link: can't find withoutRetries(ServerCallable) in org.apache.hadoop.hbase.client.HConnectionManager
[WARNING] <http://54.241.6.143/job/HBase-0.94/ws/src/main/java/org/apache/hadoop/hbase/client/HConnection.java>:284:
warning - Tag @link: can't find withoutRetries(ServerCallable) in org.apache.hadoop.hbase.client.HConnectionManager
[WARNING] <http://54.241.6.143/job/HBase-0.94/ws/src/main/java/org/apache/hadoop/hbase/client/HTable.java>:496:
warning - @param argument "startRow" is not a parameter name.
[WARNING] <http://54.241.6.143/job/HBase-0.94/ws/src/main/java/org/apache/hadoop/hbase/client/HTable.java>:496:
warning - @param argument "endRow" is not a parameter name.
[WARNING] <http://54.241.6.143/job/HBase-0.94/ws/src/main/java/org/apache/hadoop/hbase/client/HTableInterface.java>:274:
warning - @param argument "arm" is not a parameter name.
[WARNING] <http://54.241.6.143/job/HBase-0.94/ws/src/main/java/org/apache/hadoop/hbase/client/ServerCallable.java>:151:
warning - @param argument "<T>" is not a type parameter name.
[WARNING] <http://54.241.6.143/job/HBase-0.94/ws/src/main/java/org/apache/hadoop/hbase/client/ServerCallable.java>:210:
warning - @param argument "<T>" is not a type parameter name.
[WARNING] <http://54.241.6.143/job/HBase-0.94/ws/src/main/java/org/apache/hadoop/hbase/zookeeper/ZKTableReadOnly.java>:52:
warning - Tag @link: can't find isDisabledTable(String) in org.apache.hadoop.hbase.zookeeper.ZKTableReadOnly
[WARNING] <http://54.241.6.143/job/HBase-0.94/ws/src/main/java/org/apache/hadoop/hbase/zookeeper/ZKUtil.java>:1274:
warning - Tag @link: reference not found: ZKOp
[WARNING] <http://54.241.6.143/job/HBase-0.94/ws/src/main/java/org/apache/hadoop/hbase/zookeeper/ZKUtil.java>:1356:
warning - Tag @return cannot be used in class documentation.  It can only be used in the following
types of documentation: method.
[WARNING] <http://54.241.6.143/job/HBase-0.94/ws/src/main/java/org/apache/hadoop/hbase/io/hfile/BlockCache.java>:56:
warning - Tag @see cannot be used in inline documentation.  It can only be used in the following
types of documentation: overview, package, class/interface, constructor, field, method.
[WARNING] <http://54.241.6.143/job/HBase-0.94/ws/src/main/java/org/apache/hadoop/hbase/io/hfile/BlockCache.java>:56:
warning - Tag @see cannot be used in inline documentation.  It can only be used in the following
types of documentation: overview, package, class/interface, constructor, field, method.
[WARNING] <http://54.241.6.143/job/HBase-0.94/ws/src/main/java/org/apache/hadoop/hbase/io/hfile/HFileBlock.java>:628:
warning - Tag @link: can't find startWriting(BlockType, boolean) in org.apache.hadoop.hbase.io.hfile.HFileBlock.Writer
[WARNING] <http://54.241.6.143/job/HBase-0.94/ws/src/main/java/org/apache/hadoop/hbase/io/hfile/HFileBlock.java>:628:
warning - Tag @link: can't find getHeaderAndData() in org.apache.hadoop.hbase.io.hfile.HFileBlock.Writer
[WARNING] <http://54.241.6.143/job/HBase-0.94/ws/src/main/java/org/apache/hadoop/hbase/io/hfile/HFileBlock.java>:734:
warning - @param argument "dataBlockEncoderAlgo" is not a parameter name.
[WARNING] <http://54.241.6.143/job/HBase-0.94/ws/src/main/java/org/apache/hadoop/hbase/io/hfile/HFileReaderV1.java>:418:
warning - @return tag has no arguments.
[WARNING] <http://54.241.6.143/job/HBase-0.94/ws/src/main/java/org/apache/hadoop/hbase/io/hfile/LruBlockCache.java>:355:
warning - Tag @see cannot be used in inline documentation.  It can only be used in the following
types of documentation: overview, package, class/interface, constructor, field, method.
[WARNING] <http://54.241.6.143/job/HBase-0.94/ws/src/main/java/org/apache/hadoop/hbase/io/hfile/BlockCache.java>:56:
warning - Tag @see cannot be used in inline documentation.  It can only be used in the following
types of documentation: overview, package, class/interface, constructor, field, method.
[WARNING] <http://54.241.6.143/job/HBase-0.94/ws/src/main/java/org/apache/hadoop/hbase/io/hfile/BlockCache.java>:56:
warning - Tag @see cannot be used in inline documentation.  It can only be used in the following
types of documentation: overview, package, class/interface, constructor, field, method.
[WARNING] <http://54.241.6.143/job/HBase-0.94/ws/src/main/java/org/apache/hadoop/hbase/io/FileLink.java>:89:
warning - Tag @link: reference not found: CleanerChore
[WARNING] <http://54.241.6.143/job/HBase-0.94/ws/src/main/java/org/apache/hadoop/hbase/master/SplitLogManager.java>:138:
warning - Tag @link: can't find SplitLogManager(ZooKeeperWatcher, Configuration,
[WARNING] Stoppable, String, TaskFinisher) in org.apache.hadoop.hbase.master.SplitLogManager
[WARNING] <http://54.241.6.143/job/HBase-0.94/ws/src/main/java/org/apache/hadoop/hbase/master/cleaner/TimeToLiveHFileCleaner.java>:36:
warning - TimeToLiveHFileCleaner#DEFAULT_TTL (referenced by @value tag) is an unknown reference.
[WARNING] <http://54.241.6.143/job/HBase-0.94/ws/src/main/java/org/apache/hadoop/hbase/master/handler/ServerShutdownHandler.java>:381:
warning - @param argument "hris" is not a parameter name.
[WARNING] <http://54.241.6.143/job/HBase-0.94/ws/src/main/java/org/apache/hadoop/hbase/mapreduce/MultithreadedTableMapper.java>:62:
warning - Tag @link: can't find setMapperClass(Configuration, Class) in org.apache.hadoop.hbase.mapreduce.MultithreadedTableMapper
[WARNING] <http://54.241.6.143/job/HBase-0.94/ws/src/main/java/org/apache/hadoop/hbase/mapreduce/MultithreadedTableMapper.java>:62:
warning - Missing closing '}' character for inline tag: "{@link #getNumberOfThreads(Configuration)
method. The default
[WARNING] value is 10 threads.
[WARNING] <p>"
[WARNING] <http://54.241.6.143/job/HBase-0.94/ws/src/main/java/org/apache/hadoop/hbase/fs/HFileSystem.java>:56:
warning - @param argument "useHBaseChecksums" is not a parameter name.
[WARNING] <http://54.241.6.143/job/HBase-0.94/ws/src/main/java/org/apache/hadoop/hbase/HBaseIOException.java>:36:
warning - Tag @inheritDoc cannot be used in constructor documentation.  It can only be used
in the following types of documentation: method, inline text.
[WARNING] <http://54.241.6.143/job/HBase-0.94/ws/src/main/java/org/apache/hadoop/hbase/HBaseIOException.java>:43:
warning - Tag @inheritDoc cannot be used in constructor documentation.  It can only be used
in the following types of documentation: method, inline text.
[WARNING] <http://54.241.6.143/job/HBase-0.94/ws/src/main/java/org/apache/hadoop/hbase/HBaseIOException.java>:50:
warning - Tag @inheritDoc cannot be used in constructor documentation.  It can only be used
in the following types of documentation: method, inline text.
[INFO] 
[INFO] --- maven-jar-plugin:2.3:jar (default-jar) @ hbase ---
[INFO] Building jar: <http://54.241.6.143/job/HBase-0.94/ws/target/hbase-0.94.8.jar>
[INFO] 
[INFO] --- maven-assembly-plugin:2.2-beta-5:single (tarball) @ hbase ---
Downloading: http://people.apache.org/~garyh/mvn/org/apache/maven/shared/maven-common-artifact-filters/1.1/maven-common-artifact-filters-1.1.pom
Downloading: http://repo.maven.apache.org/maven2/org/apache/maven/shared/maven-common-artifact-filters/1.1/maven-common-artifact-filters-1.1.pom
Downloaded: http://repo.maven.apache.org/maven2/org/apache/maven/shared/maven-common-artifact-filters/1.1/maven-common-artifact-filters-1.1.pom
(3 KB at 180.2 KB/sec)
Downloading: http://people.apache.org/~garyh/mvn/org/codehaus/plexus/plexus-interpolation/1.7/plexus-interpolation-1.7.pom
Downloading: http://repo.maven.apache.org/maven2/org/codehaus/plexus/plexus-interpolation/1.7/plexus-interpolation-1.7.pom
Downloaded: http://repo.maven.apache.org/maven2/org/codehaus/plexus/plexus-interpolation/1.7/plexus-interpolation-1.7.pom
(3 KB at 97.9 KB/sec)
Downloading: http://people.apache.org/~garyh/mvn/org/apache/maven/shared/file-management/1.1/file-management-1.1.pom
Downloading: http://repo.maven.apache.org/maven2/org/apache/maven/shared/file-management/1.1/file-management-1.1.pom
Downloaded: http://repo.maven.apache.org/maven2/org/apache/maven/shared/file-management/1.1/file-management-1.1.pom
(3 KB at 236.0 KB/sec)
Downloading: http://people.apache.org/~garyh/mvn/org/apache/maven/shared/maven-shared-io/1.0/maven-shared-io-1.0.pom
Downloading: http://repo.maven.apache.org/maven2/org/apache/maven/shared/maven-shared-io/1.0/maven-shared-io-1.0.pom
Downloaded: http://repo.maven.apache.org/maven2/org/apache/maven/shared/maven-shared-io/1.0/maven-shared-io-1.0.pom
(3 KB at 268.9 KB/sec)
Downloading: http://people.apache.org/~garyh/mvn/org/apache/maven/shared/maven-filtering/1.0-beta-2/maven-filtering-1.0-beta-2.pom
Downloading: http://repo.maven.apache.org/maven2/org/apache/maven/shared/maven-filtering/1.0-beta-2/maven-filtering-1.0-beta-2.pom
Downloaded: http://repo.maven.apache.org/maven2/org/apache/maven/shared/maven-filtering/1.0-beta-2/maven-filtering-1.0-beta-2.pom
(4 KB at 327.8 KB/sec)
Downloading: http://people.apache.org/~garyh/mvn/org/codehaus/plexus/plexus-active-collections/1.0-beta-2/plexus-active-collections-1.0-beta-2.pom
Downloading: http://repo.maven.apache.org/maven2/org/codehaus/plexus/plexus-active-collections/1.0-beta-2/plexus-active-collections-1.0-beta-2.pom
Downloaded: http://repo.maven.apache.org/maven2/org/codehaus/plexus/plexus-active-collections/1.0-beta-2/plexus-active-collections-1.0-beta-2.pom
(3 KB at 226.6 KB/sec)
Downloading: http://people.apache.org/~garyh/mvn/org/codehaus/plexus/plexus-container-default/1.0-alpha-22/plexus-container-default-1.0-alpha-22.pom
Downloading: http://repo.maven.apache.org/maven2/org/codehaus/plexus/plexus-container-default/1.0-alpha-22/plexus-container-default-1.0-alpha-22.pom
Downloaded: http://repo.maven.apache.org/maven2/org/codehaus/plexus/plexus-container-default/1.0-alpha-22/plexus-container-default-1.0-alpha-22.pom
(3 KB at 243.4 KB/sec)
Downloading: http://people.apache.org/~garyh/mvn/org/codehaus/plexus/plexus-containers/1.0-alpha-22/plexus-containers-1.0-alpha-22.pom
Downloading: http://repo.maven.apache.org/maven2/org/codehaus/plexus/plexus-containers/1.0-alpha-22/plexus-containers-1.0-alpha-22.pom
Downloaded: http://repo.maven.apache.org/maven2/org/codehaus/plexus/plexus-containers/1.0-alpha-22/plexus-containers-1.0-alpha-22.pom
(2 KB at 167.4 KB/sec)
Downloading: http://people.apache.org/~garyh/mvn/org/codehaus/plexus/plexus-utils/2.0.1/plexus-utils-2.0.1.pom
Downloading: http://repo.maven.apache.org/maven2/org/codehaus/plexus/plexus-utils/2.0.1/plexus-utils-2.0.1.pom
Downloaded: http://repo.maven.apache.org/maven2/org/codehaus/plexus/plexus-utils/2.0.1/plexus-utils-2.0.1.pom
(4 KB at 272.1 KB/sec)
Downloading: http://people.apache.org/~garyh/mvn/org/apache/maven/shared/maven-repository-builder/1.0-alpha-2/maven-repository-builder-1.0-alpha-2.pom
Downloading: http://repo.maven.apache.org/maven2/org/apache/maven/shared/maven-repository-builder/1.0-alpha-2/maven-repository-builder-1.0-alpha-2.pom
Downloaded: http://repo.maven.apache.org/maven2/org/apache/maven/shared/maven-repository-builder/1.0-alpha-2/maven-repository-builder-1.0-alpha-2.pom
(4 KB at 150.2 KB/sec)
Downloading: http://people.apache.org/~garyh/mvn/org/apache/maven/shared/maven-common-artifact-filters/1.0-alpha-1/maven-common-artifact-filters-1.0-alpha-1.pom
Downloading: http://repo.maven.apache.org/maven2/org/apache/maven/shared/maven-common-artifact-filters/1.0-alpha-1/maven-common-artifact-filters-1.0-alpha-1.pom
Downloaded: http://repo.maven.apache.org/maven2/org/apache/maven/shared/maven-common-artifact-filters/1.0-alpha-1/maven-common-artifact-filters-1.0-alpha-1.pom
(2 KB at 146.5 KB/sec)
Downloading: http://people.apache.org/~garyh/mvn/org/apache/maven/shared/maven-shared-components/6/maven-shared-components-6.pom
Downloading: http://repo.maven.apache.org/maven2/org/apache/maven/shared/maven-shared-components/6/maven-shared-components-6.pom
Downloaded: http://repo.maven.apache.org/maven2/org/apache/maven/shared/maven-shared-components/6/maven-shared-components-6.pom
(4 KB at 252.8 KB/sec)
Downloading: http://people.apache.org/~garyh/mvn/org/apache/maven/shared/maven-common-artifact-filters/1.1/maven-common-artifact-filters-1.1.jar
Downloading: http://people.apache.org/~garyh/mvn/org/codehaus/plexus/plexus-interpolation/1.7/plexus-interpolation-1.7.jar
Downloading: http://people.apache.org/~garyh/mvn/org/apache/maven/shared/file-management/1.1/file-management-1.1.jar
Downloading: http://people.apache.org/~garyh/mvn/org/apache/maven/shared/maven-filtering/1.0-beta-2/maven-filtering-1.0-beta-2.jar
Downloading: http://people.apache.org/~garyh/mvn/org/codehaus/plexus/plexus-active-collections/1.0-beta-2/plexus-active-collections-1.0-beta-2.jar
Downloading: http://people.apache.org/~garyh/mvn/org/codehaus/plexus/plexus-utils/2.0.1/plexus-utils-2.0.1.jar
Downloading: http://people.apache.org/~garyh/mvn/org/apache/maven/shared/maven-repository-builder/1.0-alpha-2/maven-repository-builder-1.0-alpha-2.jar
Downloading: http://repo.maven.apache.org/maven2/org/apache/maven/shared/maven-common-artifact-filters/1.1/maven-common-artifact-filters-1.1.jar
Downloading: http://repo.maven.apache.org/maven2/org/codehaus/plexus/plexus-interpolation/1.7/plexus-interpolation-1.7.jar
Downloading: http://repo.maven.apache.org/maven2/org/apache/maven/shared/file-management/1.1/file-management-1.1.jar
Downloading: http://repo.maven.apache.org/maven2/org/apache/maven/shared/maven-filtering/1.0-beta-2/maven-filtering-1.0-beta-2.jar
Downloading: http://repo.maven.apache.org/maven2/org/codehaus/plexus/plexus-active-collections/1.0-beta-2/plexus-active-collections-1.0-beta-2.jar
Downloaded: http://repo.maven.apache.org/maven2/org/apache/maven/shared/maven-common-artifact-filters/1.1/maven-common-artifact-filters-1.1.jar
(30 KB at 1954.9 KB/sec)
Downloading: http://repo.maven.apache.org/maven2/org/codehaus/plexus/plexus-utils/2.0.1/plexus-utils-2.0.1.jar
Downloaded: http://repo.maven.apache.org/maven2/org/apache/maven/shared/maven-filtering/1.0-beta-2/maven-filtering-1.0-beta-2.jar
(33 KB at 1472.8 KB/sec)
Downloading: http://repo.maven.apache.org/maven2/org/apache/maven/shared/maven-repository-builder/1.0-alpha-2/maven-repository-builder-1.0-alpha-2.jar
Downloaded: http://repo.maven.apache.org/maven2/org/codehaus/plexus/plexus-active-collections/1.0-beta-2/plexus-active-collections-1.0-beta-2.jar
(21 KB at 934.2 KB/sec)
Downloaded: http://repo.maven.apache.org/maven2/org/codehaus/plexus/plexus-interpolation/1.7/plexus-interpolation-1.7.jar
(50 KB at 2078.2 KB/sec)
Downloaded: http://repo.maven.apache.org/maven2/org/codehaus/plexus/plexus-utils/2.0.1/plexus-utils-2.0.1.jar
(217 KB at 7730.8 KB/sec)
Downloaded: http://repo.maven.apache.org/maven2/org/apache/maven/shared/maven-repository-builder/1.0-alpha-2/maven-repository-builder-1.0-alpha-2.jar
(23 KB at 779.7 KB/sec)
Downloaded: http://repo.maven.apache.org/maven2/org/apache/maven/shared/file-management/1.1/file-management-1.1.jar
(31 KB at 483.2 KB/sec)
[INFO] Reading assembly descriptor: src/assembly/all.xml
[INFO] Copying files to <http://54.241.6.143/job/HBase-0.94/ws/target/hbase-0.94.8>
[WARNING] Assembly file: <http://54.241.6.143/job/HBase-0.94/ws/target/hbase-0.94.8>
is not a regular file (it may be a directory). It cannot be attached to the project build
for installation or deployment.
[INFO] 
[INFO] --- maven-antrun-plugin:1.6:run (package) @ hbase ---
[INFO] Executing tasks

main:
[INFO] Executed tasks
[INFO] 
[INFO] --- apache-rat-plugin:0.8:check (default) @ hbase ---
Downloading: http://people.apache.org/~garyh/mvn/org/apache/maven/doxia/doxia-site-renderer/1.0-alpha-8/doxia-site-renderer-1.0-alpha-8.jar
Downloading: http://people.apache.org/~garyh/mvn/org/apache/maven/reporting/maven-reporting-api/2.0.4/maven-reporting-api-2.0.4.jar
Downloading: http://people.apache.org/~garyh/mvn/org/apache/maven/doxia/doxia-sink-api/1.0-alpha-8/doxia-sink-api-1.0-alpha-8.jar
Downloading: http://repo.maven.apache.org/maven2/org/apache/maven/doxia/doxia-site-renderer/1.0-alpha-8/doxia-site-renderer-1.0-alpha-8.jar
Downloading: http://repo.maven.apache.org/maven2/org/apache/maven/doxia/doxia-sink-api/1.0-alpha-8/doxia-sink-api-1.0-alpha-8.jar
Downloading: http://repo.maven.apache.org/maven2/org/apache/maven/reporting/maven-reporting-api/2.0.4/maven-reporting-api-2.0.4.jar
Downloaded: http://repo.maven.apache.org/maven2/org/apache/maven/doxia/doxia-site-renderer/1.0-alpha-8/doxia-site-renderer-1.0-alpha-8.jar
(34 KB at 1587.8 KB/sec)
Downloaded: http://repo.maven.apache.org/maven2/org/apache/maven/reporting/maven-reporting-api/2.0.4/maven-reporting-api-2.0.4.jar
(5 KB at 128.2 KB/sec)
Downloaded: http://repo.maven.apache.org/maven2/org/apache/maven/doxia/doxia-sink-api/1.0-alpha-8/doxia-sink-api-1.0-alpha-8.jar
(7 KB at 78.9 KB/sec)
[INFO] Exclude: **/*.log
[INFO] Exclude: **/.*
[INFO] Exclude: **/*.tgz
[INFO] Exclude: **/*.orig
[INFO] Exclude: test/**
[INFO] Exclude: **/8e8ab58dcf39412da19833fcd8f687ac
[INFO] Exclude: **/.git/**
[INFO] Exclude: **/target/**
[INFO] Exclude: **/CHANGES.txt
[INFO] Exclude: **/generated/**
[INFO] Exclude: **/conf/*
[INFO] Exclude: **/*.avpr
[INFO] Exclude: **/*.svg
[INFO] Exclude: **/*.vm
[INFO] Exclude: **/control
[INFO] Exclude: **/conffile
[INFO] Exclude: docs/*
[INFO] Exclude: **/src/site/resources/css/freebsd_docbook.css
[INFO] Exclude: .git/**
[INFO] Exclude: .svn/**
[INFO] ------------------------------------------------------------------------
[INFO] BUILD FAILURE
[INFO] ------------------------------------------------------------------------
[INFO] Total time: 1:11:49.825s
[INFO] Finished at: Wed May 29 05:41:04 UTC 2013
[INFO] Final Memory: 52M/1156M
[INFO] ------------------------------------------------------------------------
[JENKINS] Archiving <http://54.241.6.143/job/HBase-0.94/ws/pom.xml> to /var/lib/jenkins/jobs/HBase-0.94/modules/org.apache.hbase$hbase/builds/2013-05-29_04-29-08/archive/org.apache.hbase/hbase/0.94.8/hbase-0.94.8.pom
[JENKINS] Archiving <http://54.241.6.143/job/HBase-0.94/ws/target/hbase-0.94.8.jar>
to /var/lib/jenkins/jobs/HBase-0.94/modules/org.apache.hbase$hbase/builds/2013-05-29_04-29-08/archive/org.apache.hbase/hbase/0.94.8/hbase-0.94.8.jar
[JENKINS] Archiving <http://54.241.6.143/job/HBase-0.94/ws/target/hbase-0.94.8-tests.jar>
to /var/lib/jenkins/jobs/HBase-0.94/modules/org.apache.hbase$hbase/builds/2013-05-29_04-29-08/archive/org.apache.hbase/hbase/0.94.8/hbase-0.94.8-tests.jar
[JENKINS] Archiving <http://54.241.6.143/job/HBase-0.94/ws/target/hbase-0.94.8-sources.jar>
to /var/lib/jenkins/jobs/HBase-0.94/modules/org.apache.hbase$hbase/builds/2013-05-29_04-29-08/archive/org.apache.hbase/hbase/0.94.8/hbase-0.94.8-sources.jar
Waiting for Jenkins to finish collecting data
mavenExecutionResult exceptions not empty
message : Failed to execute goal org.apache.rat:apache-rat-plugin:0.8:check (default) on project
hbase: Too many unapproved licenses: 1785
cause : Too many unapproved licenses: 1785
Stack trace : 
org.apache.maven.lifecycle.LifecycleExecutionException: Failed to execute goal org.apache.rat:apache-rat-plugin:0.8:check
(default) on project hbase: Too many unapproved licenses: 1785
	at org.apache.maven.lifecycle.internal.MojoExecutor.execute(MojoExecutor.java:213)
	at org.apache.maven.lifecycle.internal.MojoExecutor.execute(MojoExecutor.java:153)
	at org.apache.maven.lifecycle.internal.MojoExecutor.execute(MojoExecutor.java:145)
	at org.apache.maven.lifecycle.internal.LifecycleModuleBuilder.buildProject(LifecycleModuleBuilder.java:84)
	at org.apache.maven.lifecycle.internal.LifecycleModuleBuilder.buildProject(LifecycleModuleBuilder.java:59)
	at org.apache.maven.lifecycle.internal.LifecycleStarter.singleThreadedBuild(LifecycleStarter.java:183)
	at org.apache.maven.lifecycle.internal.LifecycleStarter.execute(LifecycleStarter.java:161)
	at org.apache.maven.DefaultMaven.doExecute(DefaultMaven.java:320)
	at org.apache.maven.DefaultMaven.execute(DefaultMaven.java:156)
	at org.jvnet.hudson.maven3.launcher.Maven3Launcher.main(Maven3Launcher.java:79)
	at sun.reflect.NativeMethodAccessorImpl.invoke0(Native Method)
	at sun.reflect.NativeMethodAccessorImpl.invoke(NativeMethodAccessorImpl.java:39)
	at sun.reflect.DelegatingMethodAccessorImpl.invoke(DelegatingMethodAccessorImpl.java:25)
	at java.lang.reflect.Method.invoke(Method.java:597)
	at org.codehaus.plexus.classworlds.launcher.Launcher.launchStandard(Launcher.java:329)
	at org.codehaus.plexus.classworlds.launcher.Launcher.launch(Launcher.java:239)
	at org.jvnet.hudson.maven3.agent.Maven3Main.launch(Maven3Main.java:158)
	at hudson.maven.Maven3Builder.call(Maven3Builder.java:100)
	at hudson.maven.Maven3Builder.call(Maven3Builder.java:66)
	at hudson.remoting.UserRequest.perform(UserRequest.java:118)
	at hudson.remoting.UserRequest.perform(UserRequest.java:48)
	at hudson.remoting.Request$2.run(Request.java:326)
	at hudson.remoting.InterceptingExecutorService$1.call(InterceptingExecutorService.java:72)
	at java.util.concurrent.FutureTask$Sync.innerRun(FutureTask.java:303)
	at java.util.concurrent.FutureTask.run(FutureTask.java:138)
	at java.util.concurrent.ThreadPoolExecutor$Worker.runTask(ThreadPoolExecutor.java:895)
	at java.util.concurrent.ThreadPoolExecutor$Worker.run(ThreadPoolExecutor.java:918)
	at java.lang.Thread.run(Thread.java:662)
Caused by: org.apache.rat.mp.RatCheckException: Too many unapproved licenses: 1785
	at org.apache.rat.mp.RatCheckMojo.check(RatCheckMojo.java:167)
	at org.apache.rat.mp.RatCheckMojo.execute(RatCheckMojo.java:159)
	at org.apache.maven.plugin.DefaultBuildPluginManager.executeMojo(DefaultBuildPluginManager.java:101)
	at org.apache.maven.lifecycle.internal.MojoExecutor.execute(MojoExecutor.java:209)
	... 27 more
channel stopped
Archiving artifacts

Mime
View raw message