hbase-dev mailing list archives

Site index · List index
Message view « Date » · « Thread »
Top « Date » · « Thread »
From Sergey Shelukhin <ser...@hortonworks.com>
Subject Re: Build failed in Jenkins: HBase-TRUNK #4047
Date Wed, 10 Apr 2013 00:01:39 GMT
I noticed that integration tests ran as part of the build... one of them
has 30-minutes runtime by default and so it failed.
Did anything change recently w/the setup? I thought the tests didn't run as
part of the build before.

On Tue, Apr 9, 2013 at 4:33 PM, Apache Jenkins Server <
jenkins@builds.apache.org> wrote:

> See <https://builds.apache.org/job/HBase-TRUNK/4047/changes>
>
> Changes:
>
> [eclark] HBASE-8296 Add svn ignores to hbase-assembly
>
> [tedyu] HBASE-8308 Lower the number of expected regions in
> TestTableLockManager#testTableReadLock (Ted Yu)
>
> [sershe] HBASE-8239 ChaosMonkey action for root is irrelevant
>
> [stack] HBASE-8295
> TestMasterFailover.testMasterFailoverWithMockedRITOnDeadRS is flaky
>
> [nkeywal] HBASE-8303  Increse the test timeout to 60s when they are less
> than 20s
>
> [nkeywal] HBASE-8305  Too much logs in the some tests
>
> ------------------------------------------
> [...truncated 3823 lines...]
> Tests run: 10, Failures: 0, Errors: 0, Skipped: 0, Time elapsed: 26.267 sec
> Running org.apache.hadoop.hbase.rest.TestRowResource
> Tests run: 12, Failures: 0, Errors: 0, Skipped: 0, Time elapsed: 24.427 sec
> Running org.apache.hadoop.hbase.rest.client.TestRemoteAdmin
> Tests run: 1, Failures: 0, Errors: 0, Skipped: 0, Time elapsed: 23.363 sec
> Running org.apache.hadoop.hbase.rest.client.TestRemoteTable
> Tests run: 4, Failures: 0, Errors: 0, Skipped: 0, Time elapsed: 22.823 sec
> Running org.apache.hadoop.hbase.rest.TestVersionResource
> Tests run: 7, Failures: 0, Errors: 0, Skipped: 0, Time elapsed: 19.677 sec
> Running org.apache.hadoop.hbase.rest.TestScannerResource
> Tests run: 5, Failures: 0, Errors: 0, Skipped: 0, Time elapsed: 31.182 sec
> Running org.apache.hadoop.hbase.rest.TestTableResource
> Tests run: 8, Failures: 0, Errors: 0, Skipped: 0, Time elapsed: 34.261 sec
> Running org.apache.hadoop.hbase.rest.TestStatusResource
> Tests run: 2, Failures: 0, Errors: 0, Skipped: 0, Time elapsed: 22.088 sec
> Running org.apache.hadoop.hbase.rest.TestSchemaResource
> Tests run: 2, Failures: 0, Errors: 0, Skipped: 0, Time elapsed: 30.947 sec
> Running org.apache.hadoop.hbase.thrift.TestThriftServerCmdLine
> Tests run: 32, Failures: 0, Errors: 0, Skipped: 0, Time elapsed: 67.609 sec
> Running org.apache.hadoop.hbase.io.encoding.TestLoadAndSwitchEncodeOnDisk
> Tests run: 1, Failures: 0, Errors: 0, Skipped: 0, Time elapsed: 42.3 sec
> Running org.apache.hadoop.hbase.thrift.TestThriftServer
> Tests run: 1, Failures: 0, Errors: 0, Skipped: 0, Time elapsed: 102.621 sec
> Running org.apache.hadoop.hbase.io.encoding.TestEncodedSeekers
> Tests run: 10, Failures: 0, Errors: 0, Skipped: 0, Time elapsed: 40.319 sec
> Running org.apache.hadoop.hbase.io.encoding.TestBufferedDataBlockEncoder
> Tests run: 1, Failures: 0, Errors: 0, Skipped: 0, Time elapsed: 22.948 sec
> Running org.apache.hadoop.hbase.io.encoding.TestDataBlockEncoders
> Tests run: 12, Failures: 0, Errors: 0, Skipped: 0, Time elapsed: 113.571
> sec
> Running org.apache.hadoop.hbase.io.hfile.TestHFileSeek
> Tests run: 1, Failures: 0, Errors: 0, Skipped: 0, Time elapsed: 6.618 sec
> Running org.apache.hadoop.hbase.io.hfile.slab.TestSlabCache
> Tests run: 7, Failures: 0, Errors: 0, Skipped: 0, Time elapsed: 21.743 sec
> Running org.apache.hadoop.hbase.io.encoding.TestChangingEncoding
> Tests run: 4, Failures: 0, Errors: 0, Skipped: 0, Time elapsed: 218.515 sec
> Running org.apache.hadoop.hbase.io.hfile.slab.TestSingleSizeCache
> Tests run: 5, Failures: 0, Errors: 0, Skipped: 0, Time elapsed: 25.86 sec
> Running org.apache.hadoop.hbase.io.hfile.TestHFilePerformance
> Tests run: 1, Failures: 0, Errors: 0, Skipped: 0, Time elapsed: 6.707 sec
> Running org.apache.hadoop.hbase.io.hfile.TestHFileBlockIndex
> Tests run: 10, Failures: 0, Errors: 0, Skipped: 0, Time elapsed: 9.708 sec
> Running org.apache.hadoop.hbase.io.hfile.TestForceCacheImportantBlocks
> Tests run: 2, Failures: 0, Errors: 0, Skipped: 0, Time elapsed: 25.754 sec
> Running org.apache.hadoop.hbase.io.hfile.TestScannerSelectionUsingTTL
> Tests run: 6, Failures: 0, Errors: 0, Skipped: 0, Time elapsed: 61.993 sec
> Running org.apache.hadoop.hbase.io.hfile.TestHFileBlock
> Tests run: 14, Failures: 0, Errors: 0, Skipped: 0, Time elapsed: 52.007 sec
> Running org.apache.hadoop.hbase.io.hfile.TestCacheOnWrite
> Tests run: 36, Failures: 0, Errors: 0, Skipped: 0, Time elapsed: 44.145 sec
> Running org.apache.hadoop.hbase.io.TestFileLink
> Tests run: 3, Failures: 0, Errors: 0, Skipped: 0, Time elapsed: 26.439 sec
> Running org.apache.hadoop.hbase.TestClusterBootOrder
> Tests run: 2, Failures: 0, Errors: 0, Skipped: 0, Time elapsed: 37.767 sec
> Running
> org.apache.hadoop.hbase.replication.TestReplicationDisableInactivePeer
> Tests run: 1, Failures: 0, Errors: 0, Skipped: 0, Time elapsed: 55.208 sec
> Running
> org.apache.hadoop.hbase.replication.regionserver.TestReplicationSourceManager
> Tests run: 3, Failures: 0, Errors: 0, Skipped: 0, Time elapsed: 4.241 sec
> Running
> org.apache.hadoop.hbase.replication.regionserver.TestReplicationSink
> Tests run: 5, Failures: 0, Errors: 0, Skipped: 0, Time elapsed: 27.524 sec
> Running org.apache.hadoop.hbase.replication.TestReplicationStateZKImpl
> Tests run: 2, Failures: 0, Errors: 0, Skipped: 0, Time elapsed: 2.964 sec
> Running org.apache.hadoop.hbase.replication.TestMultiSlaveReplication
> Tests run: 1, Failures: 0, Errors: 0, Skipped: 0, Time elapsed: 62.741 sec
> Running org.apache.hadoop.hbase.replication.TestReplicationSource
> Tests run: 1, Failures: 0, Errors: 0, Skipped: 0, Time elapsed: 7.685 sec
> Running org.apache.hadoop.hbase.replication.TestMasterReplication
> Tests run: 2, Failures: 0, Errors: 0, Skipped: 0, Time elapsed: 86.741 sec
> Running org.apache.hadoop.hbase.replication.TestReplicationZookeeper
> Tests run: 4, Failures: 0, Errors: 0, Skipped: 0, Time elapsed: 2.886 sec
> Running org.apache.hadoop.hbase.replication.TestReplicationSmallTests
> Tests run: 8, Failures: 0, Errors: 0, Skipped: 0, Time elapsed: 94.911 sec
> Running org.apache.hadoop.hbase.replication.TestReplicationQueueFailover
> Tests run: 1, Failures: 0, Errors: 0, Skipped: 0, Time elapsed: 65.204 sec
> Running org.apache.hadoop.hbase.ipc.TestDelayedRpc
> Tests run: 4, Failures: 0, Errors: 0, Skipped: 0, Time elapsed: 2.87 sec
> Running org.apache.hadoop.hbase.ipc.TestProtoBufRpc
> Tests run: 1, Failures: 0, Errors: 0, Skipped: 0, Time elapsed: 1.03 sec
> Running org.apache.hadoop.hbase.ipc.TestHBaseClient
> Tests run: 1, Failures: 0, Errors: 0, Skipped: 0, Time elapsed: 0.272 sec
> Running
> org.apache.hadoop.hbase.replication.TestReplicationQueueFailoverCompressed
> Tests run: 1, Failures: 0, Errors: 0, Skipped: 0, Time elapsed: 67.863 sec
> Running org.apache.hadoop.hbase.TestZooKeeper
> Tests run: 9, Failures: 0, Errors: 0, Skipped: 0, Time elapsed: 34.839 sec
> Running org.apache.hadoop.hbase.TestHBaseTestingUtility
> Tests run: 7, Failures: 0, Errors: 0, Skipped: 0, Time elapsed: 76.261 sec
>
> Results :
>
> Tests run: 1484, Failures: 0, Errors: 0, Skipped: 13
>
> [INFO]
> [INFO] --- maven-jar-plugin:2.4:test-jar (default) @ hbase-server ---
> [INFO] Building jar: <
> https://builds.apache.org/job/HBase-TRUNK/ws/trunk/hbase-server/target/hbase-server-0.97.0-SNAPSHOT-tests.jar
> >
> [INFO]
> [INFO] --- maven-source-plugin:2.2.1:jar-no-fork (attach-sources) @
> hbase-server ---
> [INFO] Building jar: <
> https://builds.apache.org/job/HBase-TRUNK/ws/trunk/hbase-server/target/hbase-server-0.97.0-SNAPSHOT-sources.jar
> >
> [INFO]
> [INFO] --- maven-jar-plugin:2.4:jar (default-jar) @ hbase-server ---
> [INFO] Building jar: <
> https://builds.apache.org/job/HBase-TRUNK/ws/trunk/hbase-server/target/hbase-server-0.97.0-SNAPSHOT.jar
> >
> [INFO]
> [INFO] --- maven-install-plugin:2.3.1:install (default-install) @
> hbase-server ---
> [INFO] Installing <
> https://builds.apache.org/job/HBase-TRUNK/ws/trunk/hbase-server/target/hbase-server-0.97.0-SNAPSHOT.jar>
> to
> /home/jenkins/.m2/repository/org/apache/hbase/hbase-server/0.97.0-SNAPSHOT/hbase-server-0.97.0-SNAPSHOT.jar
> [INFO] Installing <
> https://builds.apache.org/job/HBase-TRUNK/ws/trunk/hbase-server/pom.xml>
> to
> /home/jenkins/.m2/repository/org/apache/hbase/hbase-server/0.97.0-SNAPSHOT/hbase-server-0.97.0-SNAPSHOT.pom
> [INFO] Installing <
> https://builds.apache.org/job/HBase-TRUNK/ws/trunk/hbase-server/target/hbase-server-0.97.0-SNAPSHOT-tests.jar>
> to
> /home/jenkins/.m2/repository/org/apache/hbase/hbase-server/0.97.0-SNAPSHOT/hbase-server-0.97.0-SNAPSHOT-tests.jar
> [INFO] Installing <
> https://builds.apache.org/job/HBase-TRUNK/ws/trunk/hbase-server/target/hbase-server-0.97.0-SNAPSHOT-sources.jar>
> to
> /home/jenkins/.m2/repository/org/apache/hbase/hbase-server/0.97.0-SNAPSHOT/hbase-server-0.97.0-SNAPSHOT-sources.jar
> [INFO]
> [INFO]
> ------------------------------------------------------------------------
> [INFO] Building HBase - Integration Tests 0.97.0-SNAPSHOT
> [INFO]
> ------------------------------------------------------------------------
> [INFO]
> [INFO] --- maven-remote-resources-plugin:1.4:process (default) @ hbase-it
> ---
> [INFO]
> [INFO] --- maven-resources-plugin:2.6:resources (default-resources) @
> hbase-it ---
> [INFO] Using 'UTF-8' encoding to copy filtered resources.
> [INFO] skip non existing resourceDirectory <
> https://builds.apache.org/job/HBase-TRUNK/ws/trunk/hbase-it/src/main/resources
> >
> [INFO] Copying 3 resources
> [INFO]
> [INFO] --- maven-compiler-plugin:2.5.1:compile (default-compile) @
> hbase-it ---
> [INFO] No sources to compile
> [INFO]
> [INFO] --- maven-resources-plugin:2.6:testResources
> (default-testResources) @ hbase-it ---
> [INFO] Using 'UTF-8' encoding to copy filtered resources.
> [INFO] Copying 6 resources
> [INFO] Copying 3 resources
> [INFO]
> [INFO] --- maven-compiler-plugin:2.5.1:testCompile (default-testCompile) @
> hbase-it ---
> [INFO] Compiling 15 source files to <
> https://builds.apache.org/job/HBase-TRUNK/ws/trunk/hbase-it/target/test-classes
> >
> [INFO]
> [INFO] --- maven-surefire-plugin:2.12-TRUNK-HBASE-2:test (default-test) @
> hbase-it ---
> [INFO] Surefire report directory: <
> https://builds.apache.org/job/HBase-TRUNK/ws/trunk/hbase-it/target/surefire-reports
> >
> [INFO] Using configured provider
> org.apache.maven.surefire.junitcore.JUnitCoreProvider
>
> -------------------------------------------------------
>  T E S T S
> -------------------------------------------------------
>
> Results :
>
> Tests run: 0, Failures: 0, Errors: 0, Skipped: 0
>
> [INFO]
> [INFO] --- maven-dependency-plugin:2.1:build-classpath
> (create-hbase-generated-classpath) @ hbase-it ---
> [INFO] Wrote classpath file '<
> https://builds.apache.org/job/HBase-TRUNK/ws/trunk/hbase-it/target/../../target/cached_classpath.txt'
> .>
> [INFO]
> [INFO] --- maven-surefire-plugin:2.12-TRUNK-HBASE-2:test
> (secondPartTestsExecution) @ hbase-it ---
> [INFO] Surefire report directory: <
> https://builds.apache.org/job/HBase-TRUNK/ws/trunk/hbase-it/target/surefire-reports
> >
> [INFO] Using configured provider
> org.apache.maven.surefire.junitcore.JUnitCoreProvider
>
> -------------------------------------------------------
>  T E S T S
> -------------------------------------------------------
>
> -------------------------------------------------------
>  T E S T S
> -------------------------------------------------------
>
> Results :
>
> Tests run: 0, Failures: 0, Errors: 0, Skipped: 0
>
> [INFO]
> [INFO] --- maven-jar-plugin:2.4:test-jar (default) @ hbase-it ---
> [INFO] Building jar: <
> https://builds.apache.org/job/HBase-TRUNK/ws/trunk/hbase-it/target/hbase-it-0.97.0-SNAPSHOT-tests.jar
> >
> [INFO]
> [INFO] --- maven-jar-plugin:2.4:jar (default-jar) @ hbase-it ---
> [INFO] Building jar: <
> https://builds.apache.org/job/HBase-TRUNK/ws/trunk/hbase-it/target/hbase-it-0.97.0-SNAPSHOT.jar
> >
> [INFO]
> [INFO] --- maven-failsafe-plugin:2.12-TRUNK-HBASE-2:integration-test
> (integration-test) @ hbase-it ---
> [INFO] Failsafe report directory: <
> https://builds.apache.org/job/HBase-TRUNK/ws/trunk/hbase-it/target/failsafe-reports
> >
> [INFO] Using configured provider
> org.apache.maven.surefire.junit4.JUnit4Provider
>
> -------------------------------------------------------
>  T E S T S
> -------------------------------------------------------
>
> -------------------------------------------------------
>  T E S T S
> -------------------------------------------------------
> Running org.apache.hadoop.hbase.IntegrationTestLazyCfLoading
> Tests run: 1, Failures: 0, Errors: 0, Skipped: 0, Time elapsed: 212.088 sec
> Running org.apache.hadoop.hbase.IntegrationTestDataIngestSlowDeterministic
> Tests run: 1, Failures: 1, Errors: 0, Skipped: 0, Time elapsed: 570.779
> sec <<< FAILURE!
> Running org.apache.hadoop.hbase.IntegrationTestDataIngestWithChaosMonkey
> Tests run: 1, Failures: 0, Errors: 0, Skipped: 0, Time elapsed: 373.39 sec
> Running org.apache.hadoop.hbase.IntegrationTestManyRegions
> Tests run: 1, Failures: 0, Errors: 0, Skipped: 0, Time elapsed: 142.48 sec
> Running org.apache.hadoop.hbase.mapreduce.IntegrationTestImportTsv
> Tests run: 2, Failures: 0, Errors: 0, Skipped: 0, Time elapsed: 31.167 sec
> Running org.apache.hadoop.hbase.test.IntegrationTestBigLinkedList
> Tests run: 1, Failures: 0, Errors: 0, Skipped: 0, Time elapsed: 408.711 sec
> Running org.apache.hadoop.hbase.test.IntegrationTestLoadAndVerify
> Tests run: 1, Failures: 0, Errors: 0, Skipped: 0, Time elapsed: 43.499 sec
> Running
> org.apache.hadoop.hbase.IntegrationTestRebalanceAndKillServersTargeted
> Tests run: 1, Failures: 0, Errors: 0, Skipped: 0, Time elapsed: 326.871 sec
>
> Results :
>
> Failed tests:
> testDataIngest(org.apache.hadoop.hbase.IntegrationTestDataIngestSlowDeterministic):
> Load failed with error code 1
>
> Tests run: 9, Failures: 1, Errors: 0, Skipped: 0
>
> [WARNING] File encoding has not been set, using platform encoding
> ANSI_X3.4-1968, i.e. build is platform dependent!
> [INFO]
> [INFO] --- maven-failsafe-plugin:2.12-TRUNK-HBASE-2:verify (verify) @
> hbase-it ---
> [INFO] Failsafe report directory: <
> https://builds.apache.org/job/HBase-TRUNK/ws/trunk/hbase-it/target/failsafe-reports
> >
> [WARNING] File encoding has not been set, using platform encoding
> ANSI_X3.4-1968, i.e. build is platform dependent!
> [INFO]
> ------------------------------------------------------------------------
> [INFO] Reactor Summary:
> [INFO]
> [INFO] HBase ............................................. SUCCESS [4.035s]
> [INFO] HBase - Common .................................... SUCCESS
> [17.883s]
> [INFO] HBase - Protocol .................................. SUCCESS
> [16.373s]
> [INFO] HBase - Client .................................... SUCCESS [8.049s]
> [INFO] HBase - Prefix Tree ............................... SUCCESS [3.643s]
> [INFO] HBase - Hadoop Compatibility ...................... SUCCESS [0.703s]
> [INFO] HBase - Hadoop One Compatibility .................. SUCCESS [1.662s]
> [INFO] HBase - Server .................................... SUCCESS
> [2:02:21.958s]
> [INFO] HBase - Integration Tests ......................... FAILURE
> [35:19.292s]
> [INFO] HBase - Examples .................................. SKIPPED
> [INFO] HBase - Assembly .................................. SKIPPED
> [INFO]
> ------------------------------------------------------------------------
> [INFO] BUILD FAILURE
> [INFO]
> ------------------------------------------------------------------------
> [INFO] Total time: 2:38:34.191s
> [INFO] Finished at: Tue Apr 09 23:32:33 UTC 2013
> [INFO] Final Memory: 33M/667M
> [INFO]
> ------------------------------------------------------------------------
> [ERROR] Failed to execute goal
> org.apache.maven.plugins:maven-failsafe-plugin:2.12-TRUNK-HBASE-2:verify
> (verify) on project hbase-it: There are test failures.
> [ERROR]
> [ERROR] Please refer to <
> https://builds.apache.org/job/HBase-TRUNK/ws/trunk/hbase-it/target/failsafe-reports>
> for the individual test results.
> [ERROR] -> [Help 1]
> [ERROR]
> [ERROR] To see the full stack trace of the errors, re-run Maven with the
> -e switch.
> [ERROR] Re-run Maven using the -X switch to enable full debug logging.
> [ERROR]
> [ERROR] For more information about the errors and possible solutions,
> please read the following articles:
> [ERROR] [Help 1]
> http://cwiki.apache.org/confluence/display/MAVEN/MojoFailureException
> [ERROR]
> [ERROR] After correcting the problems, you can resume the build with the
> command
> [ERROR]   mvn <goals> -rf :hbase-it
> Build step 'Invoke top-level Maven targets' marked build as failure
> Archiving artifacts
> Recording test results
> Updating HBASE-8303
> Updating HBASE-8308
> Updating HBASE-8305
> Updating HBASE-8295
> Updating HBASE-8296
> Updating HBASE-8239
>

Mime
  • Unnamed multipart/alternative (inline, None, 0 bytes)
View raw message