hbase-dev mailing list archives

Site index · List index
Message view « Date » · « Thread »
Top « Date » · « Thread »
From Apache Jenkins Server <jenk...@builds.apache.org>
Subject Build failed in Jenkins: hbase-0.95-on-hadoop2 #76
Date Mon, 22 Apr 2013 18:50:45 GMT
See <https://builds.apache.org/job/hbase-0.95-on-hadoop2/76/changes>

Changes:

[tedyu] HBASE-8379 bin/graceful_stop.sh does not return the balancer to original state (Jean-Marc)

[zjushch] HBASE-6870 HTable#coprocessorExec always scan the whole table

------------------------------------------
[...truncated 4344 lines...]
[DEBUG]   (f) basedir = <https://builds.apache.org/job/hbase-0.95-on-hadoop2/ws/0.95-on-hadoop2>
[DEBUG]   (f) inputEncoding = UTF-8
[DEBUG]   (f) localRepository =        id: local
      url: file:///home/jenkins/.m2/repository/
   layout: none

[DEBUG]   (f) outputEncoding = UTF-8
[DEBUG]   (f) pomPackagingOnly = true
[DEBUG]   (f) reactorProjects = [MavenProject: org.apache.hbase:hbase:0.95.0-SNAPSHOT @ <https://builds.apache.org/job/hbase-0.95-on-hadoop2/ws/0.95-on-hadoop2/pom.xml,>
MavenProject: org.apache.hbase:hbase-common:0.95.0-SNAPSHOT @ <https://builds.apache.org/job/hbase-0.95-on-hadoop2/ws/0.95-on-hadoop2/hbase-common/pom.xml,>
MavenProject: org.apache.hbase:hbase-protocol:0.95.0-SNAPSHOT @ <https://builds.apache.org/job/hbase-0.95-on-hadoop2/ws/0.95-on-hadoop2/hbase-protocol/pom.xml,>
MavenProject: org.apache.hbase:hbase-client:0.95.0-SNAPSHOT @ <https://builds.apache.org/job/hbase-0.95-on-hadoop2/ws/0.95-on-hadoop2/hbase-client/pom.xml,>
MavenProject: org.apache.hbase:hbase-prefix-tree:0.95.0-SNAPSHOT @ <https://builds.apache.org/job/hbase-0.95-on-hadoop2/ws/0.95-on-hadoop2/hbase-prefix-tree/pom.xml,>
MavenProject: org.apache.hbase:hbase-hadoop-compat:0.95.0-SNAPSHOT @ <https://builds.apache.org/job/hbase-0.95-on-hadoop2/ws/0.95-on-hadoop2/hbase-hadoop-compat/pom.xml,>
MavenProject: org.apache.hbase:hbase-hadoop2-compat:0.95.0-SNAPSHOT @ <https://builds.apache.org/job/hbase-0.95-on-hadoop2/ws/0.95-on-hadoop2/hbase-hadoop2-compat/pom.xml,>
MavenProject: org.apache.hbase:hbase-server:0.95.0-SNAPSHOT @ <https://builds.apache.org/job/hbase-0.95-on-hadoop2/ws/0.95-on-hadoop2/hbase-server/pom.xml,>
MavenProject: org.apache.hbase:hbase-it:0.95.0-SNAPSHOT @ <https://builds.apache.org/job/hbase-0.95-on-hadoop2/ws/0.95-on-hadoop2/hbase-it/pom.xml,>
MavenProject: org.apache.hbase:hbase-examples:0.95.0-SNAPSHOT @ <https://builds.apache.org/job/hbase-0.95-on-hadoop2/ws/0.95-on-hadoop2/hbase-examples/pom.xml,>
MavenProject: org.apache.hbase:hbase-assembly:0.95.0-SNAPSHOT @ <https://builds.apache.org/job/hbase-0.95-on-hadoop2/ws/0.95-on-hadoop2/hbase-assembly/pom.xml]>
[DEBUG]   (f) siteDirectory = <https://builds.apache.org/job/hbase-0.95-on-hadoop2/ws/0.95-on-hadoop2/src/main/site>
[DEBUG]   (f) project = MavenProject: org.apache.hbase:hbase:0.95.0-SNAPSHOT @ <https://builds.apache.org/job/hbase-0.95-on-hadoop2/ws/0.95-on-hadoop2/pom.xml>
[DEBUG] -- end configuration --
[DEBUG] Mapped url: <https://builds.apache.org/job/hbase-0.95-on-hadoop2/ws/0.95-on-hadoop2/src/main/site>
to relative path: src/main/site
[DEBUG] Attaching the site descriptor '<https://builds.apache.org/job/hbase-0.95-on-hadoop2/ws/0.95-on-hadoop2/target/hbase-0.95.0-SNAPSHOT-site.xml'>
with classifier 'site' to the project.
[INFO] 
[INFO] --- apache-rat-plugin:0.8:check (default) @ hbase ---
[DEBUG] Using mirror Nexus (http://repository.apache.org/snapshots) for apache.snapshots (http://repository.apache.org/snapshots).
[DEBUG] Using mirror Nexus (http://repository.apache.org/snapshots) for apache.snapshots (http://repository.apache.org/snapshots).
[DEBUG] Using mirror Nexus (http://repository.apache.org/snapshots) for apache.snapshots (http://repository.apache.org/snapshots).
[DEBUG] Using mirror Nexus (http://repository.apache.org/snapshots) for apache.snapshots (http://repository.apache.org/snapshots).
[DEBUG] Using mirror Nexus (http://repository.apache.org/snapshots) for apache.snapshots (http://people.apache.org/repo/m2-snapshot-repository).
[DEBUG] Using mirror Nexus (http://repository.apache.org/snapshots) for apache.snapshots (http://people.apache.org/repo/m2-snapshot-repository).
[DEBUG] Using mirror Nexus (http://repository.apache.org/snapshots) for apache.snapshots (http://people.apache.org/repo/m2-snapshot-repository).
[DEBUG] Using mirror Nexus (http://repository.apache.org/snapshots) for apache.snapshots (http://people.apache.org/repo/m2-snapshot-repository).
[DEBUG] Using mirror Nexus (http://repository.apache.org/snapshots) for apache.snapshots (http://people.apache.org/repo/m2-snapshot-repository).
[DEBUG] Using mirror Nexus (http://repository.apache.org/snapshots) for apache.snapshots (http://cvs.apache.org/maven-snapshot-repository).
[DEBUG] Using mirror Nexus (http://repository.apache.org/snapshots) for apache.snapshots (http://cvs.apache.org/maven-snapshot-repository).
[DEBUG] Using mirror Nexus (http://repository.apache.org/snapshots) for apache.snapshots (http://svn.apache.org/maven-snapshot-repository).
[DEBUG] Using mirror Nexus (http://repository.apache.org/snapshots) for apache.snapshots (http://svn.apache.org/maven-snapshot-repository).
[DEBUG] Using mirror Nexus (http://repository.apache.org/snapshots) for apache.snapshots (http://svn.apache.org/maven-snapshot-repository).
[DEBUG] Using mirror Nexus (http://repository.apache.org/snapshots) for apache.snapshots (http://svn.apache.org/maven-snapshot-repository).
[DEBUG] Using mirror Nexus (http://repository.apache.org/snapshots) for apache.snapshots (http://svn.apache.org/maven-snapshot-repository).
[DEBUG] Using mirror Nexus (http://repository.apache.org/snapshots) for apache.snapshots (http://svn.apache.org/maven-snapshot-repository).
[DEBUG] Using mirror Nexus (http://repository.apache.org/snapshots) for apache.snapshots (http://svn.apache.org/maven-snapshot-repository).
[DEBUG] Using mirror Nexus (http://repository.apache.org/snapshots) for apache.snapshots (http://cvs.apache.org/maven-snapshot-repository).
[DEBUG] Using mirror Nexus (http://repository.apache.org/snapshots) for apache.snapshots (http://cvs.apache.org/maven-snapshot-repository).
[DEBUG] Using mirror Nexus (http://repository.apache.org/snapshots) for apache.snapshots (http://cvs.apache.org/maven-snapshot-repository).
[DEBUG] Using mirror Nexus (http://repository.apache.org/snapshots) for apache.snapshots (http://cvs.apache.org/maven-snapshot-repository).
[DEBUG] Using mirror Nexus (http://repository.apache.org/snapshots) for apache.snapshots (http://cvs.apache.org/maven-snapshot-repository).
[DEBUG] Using mirror Nexus (http://repository.apache.org/snapshots) for apache.snapshots (http://cvs.apache.org/maven-snapshot-repository).
[DEBUG] Using mirror Nexus (http://repository.apache.org/snapshots) for apache.snapshots (http://cvs.apache.org/maven-snapshot-repository).
[DEBUG] Using mirror Nexus (http://repository.apache.org/snapshots) for apache.snapshots (http://cvs.apache.org/maven-snapshot-repository).
[DEBUG] Using mirror Nexus (http://repository.apache.org/snapshots) for apache.snapshots (http://cvs.apache.org/maven-snapshot-repository).
[DEBUG] Using mirror Nexus (http://repository.apache.org/snapshots) for apache.snapshots (http://cvs.apache.org/maven-snapshot-repository).
[DEBUG] Using mirror Nexus (http://repository.apache.org/snapshots) for apache.snapshots (http://cvs.apache.org/maven-snapshot-repository).
[DEBUG] Using mirror Nexus (http://repository.apache.org/snapshots) for apache.snapshots (http://cvs.apache.org/maven-snapshot-repository).
[DEBUG] Using mirror Nexus (http://repository.apache.org/snapshots) for apache.snapshots (http://cvs.apache.org/maven-snapshot-repository).
[DEBUG] Using mirror Nexus (http://repository.apache.org/snapshots) for apache.snapshots (http://cvs.apache.org/maven-snapshot-repository).
[DEBUG] Using mirror Nexus (http://repository.apache.org/snapshots) for apache.snapshots (http://cvs.apache.org/maven-snapshot-repository).
[DEBUG] Using mirror Nexus (http://repository.apache.org/snapshots) for apache.snapshots (http://people.apache.org/repo/m2-snapshot-repository).
[DEBUG] Using mirror Nexus (http://repository.apache.org/snapshots) for apache.snapshots (http://people.apache.org/repo/m2-snapshot-repository).
[DEBUG] org.apache.rat:apache-rat-plugin:jar:0.8:
[DEBUG]    org.apache.rat:apache-rat-core:jar:0.8:compile
[DEBUG]       commons-collections:commons-collections:jar:3.2:compile
[DEBUG]       commons-lang:commons-lang:jar:2.1:compile
[DEBUG]       commons-io:commons-io:jar:1.4:compile
[DEBUG]       org.apache.commons:commons-compress:jar:1.0:compile
[DEBUG]       commons-cli:commons-cli:jar:1.2:compile
[DEBUG]    org.codehaus.plexus:plexus-utils:jar:1.4:compile
[DEBUG]    org.apache.maven:maven-plugin-api:jar:2.0.4:compile
[DEBUG]    org.apache.maven.doxia:doxia-site-renderer:jar:1.0-alpha-8:compile
[DEBUG]       org.apache.maven.doxia:doxia-core:jar:1.0-alpha-8:compile
[DEBUG]          org.apache.maven.doxia:doxia-sink-api:jar:1.0-alpha-8:compile
[DEBUG]       org.codehaus.plexus:plexus-i18n:jar:1.0-beta-6:compile
[DEBUG]       org.codehaus.plexus:plexus-velocity:jar:1.1.3:compile
[DEBUG]          velocity:velocity:jar:1.4:compile
[DEBUG]             velocity:velocity-dep:jar:1.4:runtime
[DEBUG]       org.apache.maven.doxia:doxia-decoration-model:jar:1.0-alpha-8:compile
[DEBUG]    org.apache.maven.reporting:maven-reporting-impl:jar:2.0.4:compile
[DEBUG]       org.apache.maven:maven-project:jar:2.0.4:compile
[DEBUG]          org.apache.maven:maven-settings:jar:2.0.4:compile
[DEBUG]          org.apache.maven:maven-profile:jar:2.0.4:compile
[DEBUG]          org.apache.maven:maven-model:jar:2.0.4:compile
[DEBUG]       commons-validator:commons-validator:jar:1.2.0:compile
[DEBUG]          commons-beanutils:commons-beanutils:jar:1.7.0:compile
[DEBUG]          commons-digester:commons-digester:jar:1.6:compile
[DEBUG]          commons-logging:commons-logging:jar:1.0.4:compile
[DEBUG]          xml-apis:xml-apis:jar:1.0.b2:compile
[DEBUG]       oro:oro:jar:2.0.7:compile
[DEBUG]       org.apache.maven.reporting:maven-reporting-api:jar:2.0.4:compile
[DEBUG]    org.apache.maven:maven-artifact-manager:jar:2.0.4:compile
[DEBUG]       org.apache.maven:maven-repository-metadata:jar:2.0.4:compile
[DEBUG]       org.apache.maven:maven-artifact:jar:2.0.4:compile
[DEBUG]       org.codehaus.plexus:plexus-container-default:jar:1.0-alpha-9:compile
[DEBUG]          classworlds:classworlds:jar:1.1-alpha-2:compile
[DEBUG]    org.apache.maven.shared:maven-plugin-testing-harness:jar:1.1:compile
[DEBUG]       org.apache.maven:maven-core:jar:2.0:compile
[DEBUG]          org.apache.maven:maven-plugin-parameter-documenter:jar:2.0:compile
[DEBUG]          org.apache.maven:maven-error-diagnostics:jar:2.0:compile
[DEBUG]          org.apache.maven:maven-plugin-registry:jar:2.0:compile
[DEBUG]          org.apache.maven:maven-plugin-descriptor:jar:2.0:compile
[DEBUG]          org.codehaus.plexus:plexus-interactivity-api:jar:1.0-alpha-4:compile
[DEBUG]          org.apache.maven:maven-monitor:jar:2.0:compile
[DEBUG]       junit:junit:jar:3.8.2:test (scope managed from compile) (version managed from
3.8.1)
[DEBUG]       org.codehaus.plexus:plexus-archiver:jar:1.0-alpha-7:compile
[DEBUG] Created new class realm plugin>org.apache.rat:apache-rat-plugin:0.8
[DEBUG] Importing foreign packages into class realm plugin>org.apache.rat:apache-rat-plugin:0.8
[DEBUG]   Imported:  < maven.api
[DEBUG] Populating class realm plugin>org.apache.rat:apache-rat-plugin:0.8
[DEBUG]   Included: org.apache.rat:apache-rat-plugin:jar:0.8
[DEBUG]   Included: org.apache.rat:apache-rat-core:jar:0.8
[DEBUG]   Included: commons-collections:commons-collections:jar:3.2
[DEBUG]   Included: commons-lang:commons-lang:jar:2.1
[DEBUG]   Included: commons-io:commons-io:jar:1.4
[DEBUG]   Included: org.apache.commons:commons-compress:jar:1.0
[DEBUG]   Included: commons-cli:commons-cli:jar:1.2
[DEBUG]   Included: org.codehaus.plexus:plexus-utils:jar:1.4
[DEBUG]   Included: org.apache.maven.doxia:doxia-site-renderer:jar:1.0-alpha-8
[DEBUG]   Included: org.apache.maven.doxia:doxia-core:jar:1.0-alpha-8
[DEBUG]   Included: org.apache.maven.doxia:doxia-sink-api:jar:1.0-alpha-8
[DEBUG]   Included: org.codehaus.plexus:plexus-i18n:jar:1.0-beta-6
[DEBUG]   Included: org.codehaus.plexus:plexus-velocity:jar:1.1.3
[DEBUG]   Included: velocity:velocity:jar:1.4
[DEBUG]   Included: velocity:velocity-dep:jar:1.4
[DEBUG]   Included: org.apache.maven.doxia:doxia-decoration-model:jar:1.0-alpha-8
[DEBUG]   Included: org.apache.maven.reporting:maven-reporting-impl:jar:2.0.4
[DEBUG]   Included: commons-validator:commons-validator:jar:1.2.0
[DEBUG]   Included: commons-beanutils:commons-beanutils:jar:1.7.0
[DEBUG]   Included: commons-digester:commons-digester:jar:1.6
[DEBUG]   Included: commons-logging:commons-logging:jar:1.0.4
[DEBUG]   Included: xml-apis:xml-apis:jar:1.0.b2
[DEBUG]   Included: oro:oro:jar:2.0.7
[DEBUG]   Included: org.apache.maven.reporting:maven-reporting-api:jar:2.0.4
[DEBUG]   Included: org.apache.maven.shared:maven-plugin-testing-harness:jar:1.1
[DEBUG]   Included: org.codehaus.plexus:plexus-interactivity-api:jar:1.0-alpha-4
[DEBUG]   Included: org.codehaus.plexus:plexus-archiver:jar:1.0-alpha-7
[DEBUG]   Excluded: org.apache.maven:maven-plugin-api:jar:2.0.4
[DEBUG]   Excluded: org.apache.maven:maven-project:jar:2.0.4
[DEBUG]   Excluded: org.apache.maven:maven-settings:jar:2.0.4
[DEBUG]   Excluded: org.apache.maven:maven-profile:jar:2.0.4
[DEBUG]   Excluded: org.apache.maven:maven-model:jar:2.0.4
[DEBUG]   Excluded: org.apache.maven:maven-artifact-manager:jar:2.0.4
[DEBUG]   Excluded: org.apache.maven:maven-repository-metadata:jar:2.0.4
[DEBUG]   Excluded: org.apache.maven:maven-artifact:jar:2.0.4
[DEBUG]   Excluded: org.codehaus.plexus:plexus-container-default:jar:1.0-alpha-9
[DEBUG]   Excluded: classworlds:classworlds:jar:1.1-alpha-2
[DEBUG]   Excluded: org.apache.maven:maven-core:jar:2.0
[DEBUG]   Excluded: org.apache.maven:maven-plugin-parameter-documenter:jar:2.0
[DEBUG]   Excluded: org.apache.maven:maven-error-diagnostics:jar:2.0
[DEBUG]   Excluded: org.apache.maven:maven-plugin-registry:jar:2.0
[DEBUG]   Excluded: org.apache.maven:maven-plugin-descriptor:jar:2.0
[DEBUG]   Excluded: org.apache.maven:maven-monitor:jar:2.0
[DEBUG]   Excluded: junit:junit:jar:3.8.2
[DEBUG] Configuring mojo org.apache.rat:apache-rat-plugin:0.8:check from plugin realm ClassRealm[plugin>org.apache.rat:apache-rat-plugin:0.8,
parent: sun.misc.Launcher$AppClassLoader@192d342]
[DEBUG] Configuring mojo 'org.apache.rat:apache-rat-plugin:0.8:check' with basic configurator
-->
[DEBUG]   (f) addDefaultLicenseMatchers = true
[DEBUG]   (f) addLicenseHeaders = false
[DEBUG]   (f) basedir = <https://builds.apache.org/job/hbase-0.95-on-hadoop2/ws/0.95-on-hadoop2>
[DEBUG]   (f) excludeSubProjects = true
[DEBUG]   (f) excludes = [**/*.versionsBackup, **/*.log, **/.*, **/*.tgz, **/*.orig, **/test/**,
**/8e8ab58dcf39412da19833fcd8f687ac, **/.git/**, **/.idea/**, **/*.iml, **/target/**, **/CHANGES.txt,
**/generated/**, **/gen-*/**, **/conf/*, **/*.avpr, **/*.svg, **/META-INF/services/**, **/html5shiv.js,
**/jquery.min.js, **/*.vm, **/control, **/conffile, docs/*, **/src/site/resources/css/freebsd_docbook.css,
.git/**, .svn/**]
[DEBUG]   (f) numUnapprovedLicenses = 0
[DEBUG]   (f) project = MavenProject: org.apache.hbase:hbase:0.95.0-SNAPSHOT @ <https://builds.apache.org/job/hbase-0.95-on-hadoop2/ws/0.95-on-hadoop2/pom.xml>
[DEBUG]   (f) reportFile = <https://builds.apache.org/job/hbase-0.95-on-hadoop2/76/artifact/0.95-on-hadoop2/target/rat.txt>
[DEBUG]   (f) reportStyle = plain
[DEBUG]   (f) useDefaultExcludes = true
[DEBUG]   (f) useEclipseDefaultExcludes = true
[DEBUG]   (f) useIdeaDefaultExcludes = true
[DEBUG]   (f) useMavenDefaultExcludes = true
[DEBUG] -- end configuration --
[INFO] Exclude: **/*.versionsBackup
[INFO] Exclude: **/*.log
[INFO] Exclude: **/.*
[INFO] Exclude: **/*.tgz
[INFO] Exclude: **/*.orig
[INFO] Exclude: **/test/**
[INFO] Exclude: **/8e8ab58dcf39412da19833fcd8f687ac
[INFO] Exclude: **/.git/**
[INFO] Exclude: **/.idea/**
[INFO] Exclude: **/*.iml
[INFO] Exclude: **/target/**
[INFO] Exclude: **/CHANGES.txt
[INFO] Exclude: **/generated/**
[INFO] Exclude: **/gen-*/**
[INFO] Exclude: **/conf/*
[INFO] Exclude: **/*.avpr
[INFO] Exclude: **/*.svg
[INFO] Exclude: **/META-INF/services/**
[INFO] Exclude: **/html5shiv.js
[INFO] Exclude: **/jquery.min.js
[INFO] Exclude: **/*.vm
[INFO] Exclude: **/control
[INFO] Exclude: **/conffile
[INFO] Exclude: docs/*
[INFO] Exclude: **/src/site/resources/css/freebsd_docbook.css
[INFO] Exclude: .git/**
[INFO] Exclude: .svn/**
[INFO]                                                                         
[INFO] ------------------------------------------------------------------------
[INFO] Skipping HBase
[INFO] This project has been banned from the build due to previous failures.
[INFO] ------------------------------------------------------------------------
[INFO] ------------------------------------------------------------------------
[INFO] Reactor Summary:
[INFO] 
[INFO] HBase ............................................. FAILURE [16.234s]
[INFO] HBase - Common .................................... SKIPPED
[INFO] HBase - Protocol .................................. SKIPPED
[INFO] HBase - Client .................................... SKIPPED
[INFO] HBase - Prefix Tree ............................... SKIPPED
[INFO] HBase - Hadoop Compatibility ...................... SKIPPED
[INFO] HBase - Hadoop Two Compatibility .................. SKIPPED
[INFO] HBase - Server .................................... SKIPPED
[INFO] HBase - Integration Tests ......................... SKIPPED
[INFO] HBase - Examples .................................. SKIPPED
[INFO] HBase - Assembly .................................. SKIPPED
[INFO] ------------------------------------------------------------------------
[INFO] BUILD FAILURE
[INFO] ------------------------------------------------------------------------
[INFO] Total time: 24.893s
[INFO] Finished at: Mon Apr 22 18:50:41 UTC 2013
[INFO] Final Memory: 27M/149M
[INFO] ------------------------------------------------------------------------
[ERROR] Failed to execute goal org.apache.rat:apache-rat-plugin:0.8:check (default) on project
hbase: Too many unapproved licenses: 1 -> [Help 1]
org.apache.maven.lifecycle.LifecycleExecutionException: Failed to execute goal org.apache.rat:apache-rat-plugin:0.8:check
(default) on project hbase: Too many unapproved licenses: 1
	at org.apache.maven.lifecycle.internal.MojoExecutor.execute(MojoExecutor.java:213)
	at org.apache.maven.lifecycle.internal.MojoExecutor.execute(MojoExecutor.java:153)
	at org.apache.maven.lifecycle.internal.MojoExecutor.execute(MojoExecutor.java:145)
	at org.apache.maven.lifecycle.internal.LifecycleModuleBuilder.buildProject(LifecycleModuleBuilder.java:84)
	at org.apache.maven.lifecycle.internal.LifecycleModuleBuilder.buildProject(LifecycleModuleBuilder.java:59)
	at org.apache.maven.lifecycle.internal.LifecycleStarter.singleThreadedBuild(LifecycleStarter.java:183)
	at org.apache.maven.lifecycle.internal.LifecycleStarter.execute(LifecycleStarter.java:161)
	at org.apache.maven.DefaultMaven.doExecute(DefaultMaven.java:320)
	at org.apache.maven.DefaultMaven.execute(DefaultMaven.java:156)
	at org.apache.maven.cli.MavenCli.execute(MavenCli.java:537)
	at org.apache.maven.cli.MavenCli.doMain(MavenCli.java:196)
	at org.apache.maven.cli.MavenCli.main(MavenCli.java:141)
	at sun.reflect.NativeMethodAccessorImpl.invoke0(Native Method)
	at sun.reflect.NativeMethodAccessorImpl.invoke(NativeMethodAccessorImpl.java:39)
	at sun.reflect.DelegatingMethodAccessorImpl.invoke(DelegatingMethodAccessorImpl.java:25)
	at java.lang.reflect.Method.invoke(Method.java:597)
	at org.codehaus.plexus.classworlds.launcher.Launcher.launchEnhanced(Launcher.java:290)
	at org.codehaus.plexus.classworlds.launcher.Launcher.launch(Launcher.java:230)
	at org.codehaus.plexus.classworlds.launcher.Launcher.mainWithExitCode(Launcher.java:409)
	at org.codehaus.plexus.classworlds.launcher.Launcher.main(Launcher.java:352)
Caused by: org.apache.rat.mp.RatCheckException: Too many unapproved licenses: 1
	at org.apache.rat.mp.RatCheckMojo.check(RatCheckMojo.java:167)
	at org.apache.rat.mp.RatCheckMojo.execute(RatCheckMojo.java:159)
	at org.apache.maven.plugin.DefaultBuildPluginManager.executeMojo(DefaultBuildPluginManager.java:101)
	at org.apache.maven.lifecycle.internal.MojoExecutor.execute(MojoExecutor.java:209)
	... 19 more
[ERROR] 
[ERROR] 
[ERROR] For more information about the errors and possible solutions, please read the following
articles:
[ERROR] [Help 1] http://cwiki.apache.org/confluence/display/MAVEN/MojoFailureException
Build step 'Invoke top-level Maven targets' marked build as failure
Archiving artifacts
Recording test results
Updating HBASE-8379
Updating HBASE-6870

Mime
View raw message