hbase-dev mailing list archives

Site index · List index
Message view « Date » · « Thread »
Top « Date » · « Thread »
From Apache Jenkins Server <jenk...@builds.apache.org>
Subject Build failed in Jenkins: hbase-0.95 #147
Date Sun, 14 Apr 2013 16:08:13 GMT
See <https://builds.apache.org/job/hbase-0.95/147/changes>

Changes:

[jxiang] HBASE-8314 HLogSplitter can retry to open a 0-length hlog file

------------------------------------------
[...truncated 2476 lines...]
A         hbase-hadoop-compat/src/test/java/org/apache/hadoop/hbase/replication
A         hbase-hadoop-compat/src/test/java/org/apache/hadoop/hbase/replication/regionserver
A         hbase-hadoop-compat/src/test/java/org/apache/hadoop/hbase/replication/regionserver/metrics
A         hbase-hadoop-compat/src/test/java/org/apache/hadoop/hbase/replication/regionserver/TestMetricsReplicationSourceFactory.java
A         hbase-hadoop-compat/src/test/java/org/apache/hadoop/hbase/regionserver
A         hbase-hadoop-compat/src/test/java/org/apache/hadoop/hbase/regionserver/wal
A         hbase-hadoop-compat/src/test/java/org/apache/hadoop/hbase/regionserver/wal/TestMetricsHLogSource.java
A         hbase-hadoop-compat/src/test/java/org/apache/hadoop/hbase/regionserver/TestMetricsRegionServerSourceFactory.java
A         hbase-hadoop-compat/src/test/java/org/apache/hadoop/hbase/master
A         hbase-hadoop-compat/src/test/java/org/apache/hadoop/hbase/master/metrics
A         hbase-hadoop-compat/src/test/java/org/apache/hadoop/hbase/master/TestMetricsMasterSourceFactory.java
A         hbase-hadoop-compat/src/test/java/org/apache/hadoop/hbase/rest
A         hbase-hadoop-compat/src/test/java/org/apache/hadoop/hbase/rest/TestMetricsRESTSource.java
A         hbase-hadoop-compat/src/test/java/org/apache/hadoop/hbase/rest/metrics
A         hbase-hadoop-compat/src/test/java/org/apache/hadoop/hbase/HadoopShims.java
A         hbase-hadoop-compat/src/main
A         hbase-hadoop-compat/src/main/java
A         hbase-hadoop-compat/src/main/java/org
A         hbase-hadoop-compat/src/main/java/org/apache
A         hbase-hadoop-compat/src/main/java/org/apache/hadoop
A         hbase-hadoop-compat/src/main/java/org/apache/hadoop/hbase
A         hbase-hadoop-compat/src/main/java/org/apache/hadoop/hbase/thrift
A         hbase-hadoop-compat/src/main/java/org/apache/hadoop/hbase/thrift/MetricsThriftServerSource.java
A         hbase-hadoop-compat/src/main/java/org/apache/hadoop/hbase/thrift/metrics
A         hbase-hadoop-compat/src/main/java/org/apache/hadoop/hbase/thrift/MetricsThriftServerSourceFactory.java
A         hbase-hadoop-compat/src/main/java/org/apache/hadoop/hbase/CompatibilityFactory.java
A         hbase-hadoop-compat/src/main/java/org/apache/hadoop/hbase/CompatibilitySingletonFactory.java
A         hbase-hadoop-compat/src/main/java/org/apache/hadoop/hbase/metrics
A         hbase-hadoop-compat/src/main/java/org/apache/hadoop/hbase/metrics/MBeanSource.java
A         hbase-hadoop-compat/src/main/java/org/apache/hadoop/hbase/metrics/BaseSource.java
A         hbase-hadoop-compat/src/main/java/org/apache/hadoop/hbase/replication
A         hbase-hadoop-compat/src/main/java/org/apache/hadoop/hbase/replication/regionserver
A         hbase-hadoop-compat/src/main/java/org/apache/hadoop/hbase/replication/regionserver/MetricsReplicationSource.java
A         hbase-hadoop-compat/src/main/java/org/apache/hadoop/hbase/replication/regionserver/metrics
A         hbase-hadoop-compat/src/main/java/org/apache/hadoop/hbase/regionserver
A         hbase-hadoop-compat/src/main/java/org/apache/hadoop/hbase/regionserver/MetricsRegionAggregateSource.java
A         hbase-hadoop-compat/src/main/java/org/apache/hadoop/hbase/regionserver/MetricsRegionServerSource.java
A         hbase-hadoop-compat/src/main/java/org/apache/hadoop/hbase/regionserver/MetricsRegionServerWrapper.java
A         hbase-hadoop-compat/src/main/java/org/apache/hadoop/hbase/regionserver/wal
A         hbase-hadoop-compat/src/main/java/org/apache/hadoop/hbase/regionserver/wal/MetricsWALSource.java
A         hbase-hadoop-compat/src/main/java/org/apache/hadoop/hbase/regionserver/MetricsRegionServerSourceFactory.java
A         hbase-hadoop-compat/src/main/java/org/apache/hadoop/hbase/regionserver/MetricsRegionSource.java
A         hbase-hadoop-compat/src/main/java/org/apache/hadoop/hbase/regionserver/MetricsRegionWrapper.java
A         hbase-hadoop-compat/src/main/java/org/apache/hadoop/hbase/ipc
A         hbase-hadoop-compat/src/main/java/org/apache/hadoop/hbase/ipc/MetricsHBaseServerSource.java
A         hbase-hadoop-compat/src/main/java/org/apache/hadoop/hbase/ipc/MetricsHBaseServerWrapper.java
A         hbase-hadoop-compat/src/main/java/org/apache/hadoop/hbase/ipc/MetricsHBaseServerSourceFactory.java
A         hbase-hadoop-compat/src/main/java/org/apache/hadoop/hbase/master
A         hbase-hadoop-compat/src/main/java/org/apache/hadoop/hbase/master/MetricsMasterSource.java
A         hbase-hadoop-compat/src/main/java/org/apache/hadoop/hbase/master/MetricsMasterWrapper.java
A         hbase-hadoop-compat/src/main/java/org/apache/hadoop/hbase/master/metrics
A         hbase-hadoop-compat/src/main/java/org/apache/hadoop/hbase/master/MetricsMasterSourceFactory.java
A         hbase-hadoop-compat/src/main/java/org/apache/hadoop/hbase/rest
A         hbase-hadoop-compat/src/main/java/org/apache/hadoop/hbase/rest/MetricsRESTSource.java
A         hbase-hadoop-compat/src/main/java/org/apache/hadoop/hbase/rest/metrics
A         hbase-hadoop-compat/src/main/java/org/apache/hadoop/metrics
A         hbase-hadoop-compat/src/main/java/org/apache/hadoop/metrics2
A         hbase-hadoop-compat/src/main/java/org/apache/hadoop/metrics2/MetricHistogram.java
A         hbase-hadoop-compat/src/main/java/org/apache/hadoop/metrics2/MetricsExecutor.java
A         hbase-hadoop-compat/pom.xml
A         README.txt
 U        .
At revision 1467796
[hbase-0.95] $ /bin/bash -xe /tmp/hudson9102461670426372564.sh
+ ulimit -a
core file size          (blocks, -c) 0
data seg size           (kbytes, -d) unlimited
scheduling priority             (-e) 0
file size               (blocks, -f) unlimited
pending signals                 (-i) 192653
max locked memory       (kbytes, -l) 64
max memory size         (kbytes, -m) unlimited
open files                      (-n) 40000
pipe size            (512 bytes, -p) 8
POSIX message queues     (bytes, -q) 819200
real-time priority              (-r) 0
stack size              (kbytes, -s) 8192
cpu time               (seconds, -t) unlimited
max user processes              (-u) 192653
virtual memory          (kbytes, -v) unlimited
file locks                      (-x) unlimited
+ java -version
java version "1.7.0_04"
Java(TM) SE Runtime Environment (build 1.7.0_04-b20)
Java HotSpot(TM) 64-Bit Server VM (build 23.0-b21, mixed mode)
+ rm -rf /tmp/hbase-jenkins/hbase
[0.95] $ /home/hudson/tools/maven/latest3/bin/mvn -PrunAllTests -Dmaven.test.redirectTestOutputToFile=true
install -Dsurefire.secondPartThreadCount=2 -Dit.test=noItTest
[INFO] Scanning for projects...
[WARNING] 
[WARNING] Some problems were encountered while building the effective model for org.apache.hbase:hbase-assembly:pom:0.95.0-SNAPSHOT
[WARNING] The expression ${pom.version} is deprecated. Please use ${project.version} instead.
[WARNING] 
[WARNING] It is highly recommended to fix these problems because they threaten the stability
of your build.
[WARNING] 
[WARNING] For this reason, future Maven versions might no longer support building such malformed
projects.
[WARNING] 
[INFO] ------------------------------------------------------------------------
[INFO] Reactor Build Order:
[INFO] 
[INFO] HBase
[INFO] HBase - Common
[INFO] HBase - Protocol
[INFO] HBase - Client
[INFO] HBase - Prefix Tree
[INFO] HBase - Hadoop Compatibility
[INFO] HBase - Hadoop One Compatibility
[INFO] HBase - Server
[INFO] HBase - Integration Tests
[INFO] HBase - Examples
[INFO] HBase - Assembly
[INFO]                                                                         
[INFO] ------------------------------------------------------------------------
[INFO] Building HBase 0.95.0-SNAPSHOT
[INFO] ------------------------------------------------------------------------
[INFO] 
[INFO] --- maven-remote-resources-plugin:1.4:process (default) @ hbase ---
[INFO] 
[INFO] --- findbugs-maven-plugin:2.5.2:findbugs (default) @ hbase ---
[INFO] 
[INFO] --- maven-site-plugin:3.2:attach-descriptor (attach-descriptor) @ hbase ---
[INFO] 
[INFO] --- maven-install-plugin:2.3.1:install (default-install) @ hbase ---
[INFO] Installing /x1/jenkins/jenkins-slave/workspace/hbase-0.95/0.95/pom.xml to /home/jenkins/.m2/repository/org/apache/hbase/hbase/0.95.0-SNAPSHOT/hbase-0.95.0-SNAPSHOT.pom
[INFO] Installing /x1/jenkins/jenkins-slave/workspace/hbase-0.95/0.95/target/hbase-0.95.0-SNAPSHOT-site.xml
to /home/jenkins/.m2/repository/org/apache/hbase/hbase/0.95.0-SNAPSHOT/hbase-0.95.0-SNAPSHOT-site.xml
[INFO]                                                                         
[INFO] ------------------------------------------------------------------------
[INFO] Building HBase - Common 0.95.0-SNAPSHOT
[INFO] ------------------------------------------------------------------------
[INFO] 
[INFO] --- maven-antrun-plugin:1.6:run (generate) @ hbase-common ---
[INFO] Executing tasks

main:
[INFO] Executed tasks
[INFO] 
[INFO] --- build-helper-maven-plugin:1.5:add-source (versionInfo-source) @ hbase-common ---
[INFO] Source directory: /x1/jenkins/jenkins-slave/workspace/hbase-0.95/0.95/hbase-common/target/generated-sources/java
added.
[INFO] 
[INFO] --- maven-remote-resources-plugin:1.4:process (default) @ hbase-common ---
[INFO] 
[INFO] --- maven-resources-plugin:2.6:resources (default-resources) @ hbase-common ---
[INFO] Using 'UTF-8' encoding to copy filtered resources.
[INFO] Copying 1 resource
[INFO] Copying 3 resources
[INFO] 
[INFO] --- maven-antrun-plugin:1.6:run (default) @ hbase-common ---
[INFO] Executing tasks

main:
    [mkdir] Created dir: /x1/jenkins/jenkins-slave/workspace/hbase-0.95/0.95/hbase-common/target/nativelib
     [exec] tar: hadoop-snappy-nativelibs.tar: Cannot open: No such file or directory
     [exec] tar: Error is not recoverable: exiting now
     [exec] Result: 2
[INFO] Executed tasks
[INFO] 
[INFO] --- maven-compiler-plugin:2.5.1:compile (default-compile) @ hbase-common ---
[INFO] Compiling 78 source files to /x1/jenkins/jenkins-slave/workspace/hbase-0.95/0.95/hbase-common/target/classes
[WARNING] /x1/jenkins/jenkins-slave/workspace/hbase-0.95/0.95/hbase-common/src/main/java/org/apache/hadoop/hbase/util/Bytes.java:[51,15]
Unsafe is internal proprietary API and may be removed in a future release
[WARNING] /x1/jenkins/jenkins-slave/workspace/hbase-0.95/0.95/hbase-common/src/main/java/org/apache/hadoop/hbase/util/Bytes.java:[1043,19]
Unsafe is internal proprietary API and may be removed in a future release
[WARNING] /x1/jenkins/jenkins-slave/workspace/hbase-0.95/0.95/hbase-common/src/main/java/org/apache/hadoop/hbase/util/Bytes.java:[1049,21]
Unsafe is internal proprietary API and may be removed in a future release
[WARNING] /x1/jenkins/jenkins-slave/workspace/hbase-0.95/0.95/hbase-common/src/main/java/org/apache/hadoop/hbase/util/Bytes.java:[1054,28]
Unsafe is internal proprietary API and may be removed in a future release
[INFO] 
[INFO] --- maven-resources-plugin:2.6:testResources (default-testResources) @ hbase-common
---
[INFO] Using 'UTF-8' encoding to copy filtered resources.
[INFO] skip non existing resourceDirectory /x1/jenkins/jenkins-slave/workspace/hbase-0.95/0.95/hbase-common/src/test/resources
[INFO] Copying 3 resources
[INFO] 
[INFO] --- maven-compiler-plugin:2.5.1:testCompile (default-testCompile) @ hbase-common ---
[INFO] Compiling 24 source files to /x1/jenkins/jenkins-slave/workspace/hbase-0.95/0.95/hbase-common/target/test-classes
[INFO] 
[INFO] --- maven-surefire-plugin:2.12-TRUNK-HBASE-2:test (default-test) @ hbase-common ---
[INFO] Surefire report directory: /x1/jenkins/jenkins-slave/workspace/hbase-0.95/0.95/hbase-common/target/surefire-reports
[INFO] Using configured provider org.apache.maven.surefire.junitcore.JUnitCoreProvider

-------------------------------------------------------
 T E S T S
-------------------------------------------------------
Running org.apache.hadoop.hbase.codec.TestKeyValueCodec
Tests run: 3, Failures: 0, Errors: 0, Skipped: 0, Time elapsed: 0.062 sec
Running org.apache.hadoop.hbase.codec.TestCellCodec
Tests run: 3, Failures: 0, Errors: 0, Skipped: 0, Time elapsed: 0.046 sec
Running org.apache.hadoop.hbase.TestCompoundConfiguration
Tests run: 5, Failures: 0, Errors: 0, Skipped: 0, Time elapsed: 0.325 sec
Running org.apache.hadoop.hbase.TestKeyValue
Tests run: 16, Failures: 0, Errors: 0, Skipped: 0, Time elapsed: 0.193 sec
Running org.apache.hadoop.hbase.TestClassFinder
Tests run: 11, Failures: 0, Errors: 0, Skipped: 0, Time elapsed: 1.276 sec
Running org.apache.hadoop.hbase.util.TestBytes
Tests run: 27, Failures: 0, Errors: 0, Skipped: 0, Time elapsed: 1.514 sec
Running org.apache.hadoop.hbase.util.TestEnvironmentEdgeManager
Tests run: 2, Failures: 0, Errors: 0, Skipped: 0, Time elapsed: 0.196 sec
Running org.apache.hadoop.hbase.util.TestByteRange
Tests run: 2, Failures: 0, Errors: 0, Skipped: 0, Time elapsed: 0.018 sec
Running org.apache.hadoop.hbase.util.TestThreads
Tests run: 1, Failures: 0, Errors: 0, Skipped: 0, Time elapsed: 3.01 sec
Running org.apache.hadoop.hbase.util.TestBase64
Tests run: 1, Failures: 0, Errors: 0, Skipped: 0, Time elapsed: 0.011 sec
Running org.apache.hadoop.hbase.util.TestDrainBarrier
Tests run: 6, Failures: 0, Errors: 0, Skipped: 0, Time elapsed: 1.053 sec
Running org.apache.hadoop.hbase.util.TestDynamicClassLoader
Tests run: 2, Failures: 2, Errors: 0, Skipped: 0, Time elapsed: 10.377 sec <<< FAILURE!
Running org.apache.hadoop.hbase.util.TestLoadTestKVGenerator
Tests run: 3, Failures: 0, Errors: 0, Skipped: 0, Time elapsed: 10.377 sec

Results :

Failed tests:   testLoadClassFromAnotherPath(org.apache.hadoop.hbase.util.TestDynamicClassLoader):
Should not be able to load class TestLoadClassFromAnotherPath
  testLoadClassFromLocalPath(org.apache.hadoop.hbase.util.TestDynamicClassLoader): Should
not be able to load class TestLoadClassFromLocalPath

Tests run: 82, Failures: 2, Errors: 0, Skipped: 0

[INFO] ------------------------------------------------------------------------
[INFO] Reactor Summary:
[INFO] 
[INFO] HBase ............................................. SUCCESS [10.787s]
[INFO] HBase - Common .................................... FAILURE [19.007s]
[INFO] HBase - Protocol .................................. SKIPPED
[INFO] HBase - Client .................................... SKIPPED
[INFO] HBase - Prefix Tree ............................... SKIPPED
[INFO] HBase - Hadoop Compatibility ...................... SKIPPED
[INFO] HBase - Hadoop One Compatibility .................. SKIPPED
[INFO] HBase - Server .................................... SKIPPED
[INFO] HBase - Integration Tests ......................... SKIPPED
[INFO] HBase - Examples .................................. SKIPPED
[INFO] HBase - Assembly .................................. SKIPPED
[INFO] ------------------------------------------------------------------------
[INFO] BUILD FAILURE
[INFO] ------------------------------------------------------------------------
[INFO] Total time: 30.422s
[INFO] Finished at: Sun Apr 14 16:08:08 UTC 2013
[INFO] Final Memory: 30M/355M
[INFO] ------------------------------------------------------------------------
[ERROR] Failed to execute goal org.apache.maven.plugins:maven-surefire-plugin:2.12-TRUNK-HBASE-2:test
(default-test) on project hbase-common: There are test failures.
[ERROR] 
[ERROR] Please refer to /x1/jenkins/jenkins-slave/workspace/hbase-0.95/0.95/hbase-common/target/surefire-reports
for the individual test results.
[ERROR] -> [Help 1]
[ERROR] 
[ERROR] To see the full stack trace of the errors, re-run Maven with the -e switch.
[ERROR] Re-run Maven using the -X switch to enable full debug logging.
[ERROR] 
[ERROR] For more information about the errors and possible solutions, please read the following
articles:
[ERROR] [Help 1] http://cwiki.apache.org/confluence/display/MAVEN/MojoFailureException
[ERROR] 
[ERROR] After correcting the problems, you can resume the build with the command
[ERROR]   mvn <goals> -rf :hbase-common
Build step 'Invoke top-level Maven targets' marked build as failure
Archiving artifacts
Recording test results
Updating HBASE-8314

Mime
View raw message