hbase-dev mailing list archives

Site index · List index
Message view « Date » · « Thread »
Top « Date » · « Thread »
From apurt...@apache.org
Subject Build failed in Jenkins: HBase-TRUNK #161
Date Thu, 18 Apr 2013 23:17:28 GMT
See <http://54.241.6.143/job/HBase-TRUNK/161/changes>

Changes:

[sershe] HBASE-8350 enable ChaosMonkey to run commands as different users

------------------------------------------
[...truncated 17667 lines...]
Downloading: http://people.apache.org/~garyh/mvn/junit/junit/4.8.2/junit-4.8.2.pom
Downloading: http://repo.maven.apache.org/maven2/junit/junit/4.8.2/junit-4.8.2.pom
Downloaded: http://repo.maven.apache.org/maven2/junit/junit/4.8.2/junit-4.8.2.pom (2 KB at
65.8 KB/sec)
Downloading: http://people.apache.org/~garyh/mvn/org/apache/maven/maven-jxr/2.3/maven-jxr-2.3.jar
Downloading: http://people.apache.org/~garyh/mvn/commons-io/commons-io/2.0.1/commons-io-2.0.1.jar
Downloading: http://people.apache.org/~garyh/mvn/junit/junit/4.8.2/junit-4.8.2.jar
Downloading: http://people.apache.org/~garyh/mvn/org/apache/maven/doxia/doxia-core/1.1.2/doxia-core-1.1.2.jar
Downloading: http://people.apache.org/~garyh/mvn/xerces/xercesImpl/2.8.1/xercesImpl-2.8.1.jar
Downloading: http://repo.maven.apache.org/maven2/org/apache/maven/maven-jxr/2.3/maven-jxr-2.3.jar
Downloading: http://repo.maven.apache.org/maven2/junit/junit/4.8.2/junit-4.8.2.jar
Downloading: http://repo.maven.apache.org/maven2/commons-io/commons-io/2.0.1/commons-io-2.0.1.jar
Downloading: http://repo.maven.apache.org/maven2/org/apache/maven/doxia/doxia-core/1.1.2/doxia-core-1.1.2.jar
Downloading: http://repo.maven.apache.org/maven2/xerces/xercesImpl/2.8.1/xercesImpl-2.8.1.jar
Downloaded: http://repo.maven.apache.org/maven2/org/apache/maven/maven-jxr/2.3/maven-jxr-2.3.jar
(46 KB at 2503.5 KB/sec)
Downloaded: http://repo.maven.apache.org/maven2/commons-io/commons-io/2.0.1/commons-io-2.0.1.jar
(156 KB at 5024.9 KB/sec)
Downloaded: http://repo.maven.apache.org/maven2/org/apache/maven/doxia/doxia-core/1.1.2/doxia-core-1.1.2.jar
(155 KB at 4986.7 KB/sec)
Downloaded: http://repo.maven.apache.org/maven2/junit/junit/4.8.2/junit-4.8.2.jar (232 KB
at 6817.1 KB/sec)
Downloaded: http://repo.maven.apache.org/maven2/xerces/xercesImpl/2.8.1/xercesImpl-2.8.1.jar
(1185 KB at 17947.5 KB/sec)
[INFO] Parent project loaded from repository: org.apache:apache:pom:12
Downloading: http://repository-netty.forge.cloudbees.com/snapshot/org/apache/apache/12/apache-12-site_en.xml
Downloading: https://repository.apache.org/content/repositories/releases/org/apache/apache/12/apache-12-site_en.xml
Downloading: http://download.java.net/maven/2/org/apache/apache/12/apache-12-site_en.xml
Downloading: http://repository.codehaus.org/org/apache/apache/12/apache-12-site_en.xml
Downloading: http://repository.jboss.org/nexus/content/groups/public-jboss/org/apache/apache/12/apache-12-site_en.xml
Downloading: http://people.apache.org/~garyh/mvn/org/apache/apache/12/apache-12-site_en.xml
Downloading: http://repo.maven.apache.org/maven2/org/apache/apache/12/apache-12-site_en.xml
[FINDBUGS] No report found for mojo site
[INFO] ------------------------------------------------------------------------
[INFO] Reactor Summary:
[INFO] 
[INFO] HBase ............................................. FAILURE [54.790s]
[INFO] HBase - Common .................................... SUCCESS [1:01.752s]
[INFO] HBase - Protocol .................................. SUCCESS [18.897s]
[INFO] HBase - Client .................................... SUCCESS [12.257s]
[INFO] HBase - Prefix Tree ............................... SUCCESS [4.805s]
[INFO] HBase - Hadoop Compatibility ...................... SUCCESS [1.273s]
[INFO] HBase - Hadoop One Compatibility .................. SUCCESS [9.641s]
[INFO] HBase - Server .................................... SUCCESS [51:52.295s]
[INFO] HBase - Integration Tests ......................... SUCCESS [54:22.668s]
[INFO] HBase - Examples .................................. SUCCESS [4.908s]
[INFO] HBase - Assembly .................................. SUCCESS [0.139s]
[INFO] ------------------------------------------------------------------------
[INFO] BUILD FAILURE
[INFO] ------------------------------------------------------------------------
[INFO] Total time: 1:54:36.052s
[INFO] Finished at: Thu Apr 18 23:16:09 UTC 2013
[INFO] Final Memory: 76M/1442M
[INFO] ------------------------------------------------------------------------
[JENKINS] Archiving <http://54.241.6.143/job/HBase-TRUNK/ws/hbase-common/pom.xml> to
/var/lib/jenkins/jobs/HBase-TRUNK/modules/org.apache.hbase$hbase-common/builds/2013-04-18_21-21-26/archive/org.apache.hbase/hbase-common/0.97.0-SNAPSHOT/hbase-common-0.97.0-SNAPSHOT.pom
[JENKINS] Archiving <http://54.241.6.143/job/HBase-TRUNK/ws/hbase-common/target/hbase-common-0.97.0-SNAPSHOT.jar>
to /var/lib/jenkins/jobs/HBase-TRUNK/modules/org.apache.hbase$hbase-common/builds/2013-04-18_21-21-26/archive/org.apache.hbase/hbase-common/0.97.0-SNAPSHOT/hbase-common-0.97.0-SNAPSHOT.jar
[JENKINS] Archiving <http://54.241.6.143/job/HBase-TRUNK/ws/hbase-common/target/hbase-common-0.97.0-SNAPSHOT-sources.jar>
to /var/lib/jenkins/jobs/HBase-TRUNK/modules/org.apache.hbase$hbase-common/builds/2013-04-18_21-21-26/archive/org.apache.hbase/hbase-common/0.97.0-SNAPSHOT/hbase-common-0.97.0-SNAPSHOT-sources.jar
[JENKINS] Archiving <http://54.241.6.143/job/HBase-TRUNK/ws/hbase-common/target/hbase-common-0.97.0-SNAPSHOT-tests.jar>
to /var/lib/jenkins/jobs/HBase-TRUNK/modules/org.apache.hbase$hbase-common/builds/2013-04-18_21-21-26/archive/org.apache.hbase/hbase-common/0.97.0-SNAPSHOT/hbase-common-0.97.0-SNAPSHOT-tests.jar
[JENKINS] Archiving <http://54.241.6.143/job/HBase-TRUNK/ws/hbase-hadoop-compat/pom.xml>
to /var/lib/jenkins/jobs/HBase-TRUNK/modules/org.apache.hbase$hbase-hadoop-compat/builds/2013-04-18_21-21-26/archive/org.apache.hbase/hbase-hadoop-compat/0.97.0-SNAPSHOT/hbase-hadoop-compat-0.97.0-SNAPSHOT.pom
[JENKINS] Archiving <http://54.241.6.143/job/HBase-TRUNK/ws/hbase-hadoop-compat/target/hbase-hadoop-compat-0.97.0-SNAPSHOT.jar>
to /var/lib/jenkins/jobs/HBase-TRUNK/modules/org.apache.hbase$hbase-hadoop-compat/builds/2013-04-18_21-21-26/archive/org.apache.hbase/hbase-hadoop-compat/0.97.0-SNAPSHOT/hbase-hadoop-compat-0.97.0-SNAPSHOT.jar
[JENKINS] Archiving <http://54.241.6.143/job/HBase-TRUNK/ws/hbase-hadoop-compat/target/hbase-hadoop-compat-0.97.0-SNAPSHOT-sources.jar>
to /var/lib/jenkins/jobs/HBase-TRUNK/modules/org.apache.hbase$hbase-hadoop-compat/builds/2013-04-18_21-21-26/archive/org.apache.hbase/hbase-hadoop-compat/0.97.0-SNAPSHOT/hbase-hadoop-compat-0.97.0-SNAPSHOT-sources.jar
[JENKINS] Archiving <http://54.241.6.143/job/HBase-TRUNK/ws/hbase-hadoop-compat/target/hbase-hadoop-compat-0.97.0-SNAPSHOT-tests.jar>
to /var/lib/jenkins/jobs/HBase-TRUNK/modules/org.apache.hbase$hbase-hadoop-compat/builds/2013-04-18_21-21-26/archive/org.apache.hbase/hbase-hadoop-compat/0.97.0-SNAPSHOT/hbase-hadoop-compat-0.97.0-SNAPSHOT-tests.jar
[JENKINS] Archiving <http://54.241.6.143/job/HBase-TRUNK/ws/hbase-examples/pom.xml>
to /var/lib/jenkins/jobs/HBase-TRUNK/modules/org.apache.hbase$hbase-examples/builds/2013-04-18_21-21-26/archive/org.apache.hbase/hbase-examples/0.97.0-SNAPSHOT/hbase-examples-0.97.0-SNAPSHOT.pom
[JENKINS] Archiving <http://54.241.6.143/job/HBase-TRUNK/ws/hbase-examples/target/hbase-examples-0.97.0-SNAPSHOT.jar>
to /var/lib/jenkins/jobs/HBase-TRUNK/modules/org.apache.hbase$hbase-examples/builds/2013-04-18_21-21-26/archive/org.apache.hbase/hbase-examples/0.97.0-SNAPSHOT/hbase-examples-0.97.0-SNAPSHOT.jar
[JENKINS] Archiving <http://54.241.6.143/job/HBase-TRUNK/ws/hbase-examples/target/hbase-examples-0.97.0-SNAPSHOT-sources.jar>
to /var/lib/jenkins/jobs/HBase-TRUNK/modules/org.apache.hbase$hbase-examples/builds/2013-04-18_21-21-26/archive/org.apache.hbase/hbase-examples/0.97.0-SNAPSHOT/hbase-examples-0.97.0-SNAPSHOT-sources.jar
[JENKINS] Archiving <http://54.241.6.143/job/HBase-TRUNK/ws/hbase-examples/target/hbase-examples-0.97.0-SNAPSHOT-tests.jar>
to /var/lib/jenkins/jobs/HBase-TRUNK/modules/org.apache.hbase$hbase-examples/builds/2013-04-18_21-21-26/archive/org.apache.hbase/hbase-examples/0.97.0-SNAPSHOT/hbase-examples-0.97.0-SNAPSHOT-tests.jar
[JENKINS] Archiving <http://54.241.6.143/job/HBase-TRUNK/ws/hbase-it/pom.xml> to /var/lib/jenkins/jobs/HBase-TRUNK/modules/org.apache.hbase$hbase-it/builds/2013-04-18_21-21-26/archive/org.apache.hbase/hbase-it/0.97.0-SNAPSHOT/hbase-it-0.97.0-SNAPSHOT.pom
[JENKINS] Archiving <http://54.241.6.143/job/HBase-TRUNK/ws/hbase-it/target/hbase-it-0.97.0-SNAPSHOT.jar>
to /var/lib/jenkins/jobs/HBase-TRUNK/modules/org.apache.hbase$hbase-it/builds/2013-04-18_21-21-26/archive/org.apache.hbase/hbase-it/0.97.0-SNAPSHOT/hbase-it-0.97.0-SNAPSHOT.jar
[JENKINS] Archiving <http://54.241.6.143/job/HBase-TRUNK/ws/hbase-it/target/hbase-it-0.97.0-SNAPSHOT-tests.jar>
to /var/lib/jenkins/jobs/HBase-TRUNK/modules/org.apache.hbase$hbase-it/builds/2013-04-18_21-21-26/archive/org.apache.hbase/hbase-it/0.97.0-SNAPSHOT/hbase-it-0.97.0-SNAPSHOT-tests.jar
[JENKINS] Archiving <http://54.241.6.143/job/HBase-TRUNK/ws/pom.xml> to /var/lib/jenkins/jobs/HBase-TRUNK/modules/org.apache.hbase$hbase/builds/2013-04-18_21-21-25/archive/org.apache.hbase/hbase/0.97.0-SNAPSHOT/hbase-0.97.0-SNAPSHOT.pom
[JENKINS] Archiving <http://54.241.6.143/job/HBase-TRUNK/ws/target/hbase-0.97.0-SNAPSHOT-site.xml>
to /var/lib/jenkins/jobs/HBase-TRUNK/modules/org.apache.hbase$hbase/builds/2013-04-18_21-21-25/archive/org.apache.hbase/hbase/0.97.0-SNAPSHOT/hbase-0.97.0-SNAPSHOT-site.xml
[JENKINS] Archiving <http://54.241.6.143/job/HBase-TRUNK/ws/hbase-assembly/pom.xml>
to /var/lib/jenkins/jobs/HBase-TRUNK/modules/org.apache.hbase$hbase-assembly/builds/2013-04-18_21-21-26/archive/org.apache.hbase/hbase-assembly/0.97.0-SNAPSHOT/hbase-assembly-0.97.0-SNAPSHOT.pom
[JENKINS] Archiving <http://54.241.6.143/job/HBase-TRUNK/ws/hbase-client/pom.xml> to
/var/lib/jenkins/jobs/HBase-TRUNK/modules/org.apache.hbase$hbase-client/builds/2013-04-18_21-21-26/archive/org.apache.hbase/hbase-client/0.97.0-SNAPSHOT/hbase-client-0.97.0-SNAPSHOT.pom
[JENKINS] Archiving <http://54.241.6.143/job/HBase-TRUNK/ws/hbase-client/target/hbase-client-0.97.0-SNAPSHOT.jar>
to /var/lib/jenkins/jobs/HBase-TRUNK/modules/org.apache.hbase$hbase-client/builds/2013-04-18_21-21-26/archive/org.apache.hbase/hbase-client/0.97.0-SNAPSHOT/hbase-client-0.97.0-SNAPSHOT.jar
[JENKINS] Archiving <http://54.241.6.143/job/HBase-TRUNK/ws/hbase-client/target/hbase-client-0.97.0-SNAPSHOT-sources.jar>
to /var/lib/jenkins/jobs/HBase-TRUNK/modules/org.apache.hbase$hbase-client/builds/2013-04-18_21-21-26/archive/org.apache.hbase/hbase-client/0.97.0-SNAPSHOT/hbase-client-0.97.0-SNAPSHOT-sources.jar
[JENKINS] Archiving <http://54.241.6.143/job/HBase-TRUNK/ws/hbase-client/target/hbase-client-0.97.0-SNAPSHOT-tests.jar>
to /var/lib/jenkins/jobs/HBase-TRUNK/modules/org.apache.hbase$hbase-client/builds/2013-04-18_21-21-26/archive/org.apache.hbase/hbase-client/0.97.0-SNAPSHOT/hbase-client-0.97.0-SNAPSHOT-tests.jar
[JENKINS] Archiving <http://54.241.6.143/job/HBase-TRUNK/ws/hbase-prefix-tree/pom.xml>
to /var/lib/jenkins/jobs/HBase-TRUNK/modules/org.apache.hbase$hbase-prefix-tree/builds/2013-04-18_21-21-26/archive/org.apache.hbase/hbase-prefix-tree/0.97.0-SNAPSHOT/hbase-prefix-tree-0.97.0-SNAPSHOT.pom
[JENKINS] Archiving <http://54.241.6.143/job/HBase-TRUNK/ws/hbase-prefix-tree/target/hbase-prefix-tree-0.97.0-SNAPSHOT.jar>
to /var/lib/jenkins/jobs/HBase-TRUNK/modules/org.apache.hbase$hbase-prefix-tree/builds/2013-04-18_21-21-26/archive/org.apache.hbase/hbase-prefix-tree/0.97.0-SNAPSHOT/hbase-prefix-tree-0.97.0-SNAPSHOT.jar
[JENKINS] Archiving <http://54.241.6.143/job/HBase-TRUNK/ws/hbase-prefix-tree/target/hbase-prefix-tree-0.97.0-SNAPSHOT-sources.jar>
to /var/lib/jenkins/jobs/HBase-TRUNK/modules/org.apache.hbase$hbase-prefix-tree/builds/2013-04-18_21-21-26/archive/org.apache.hbase/hbase-prefix-tree/0.97.0-SNAPSHOT/hbase-prefix-tree-0.97.0-SNAPSHOT-sources.jar
[JENKINS] Archiving <http://54.241.6.143/job/HBase-TRUNK/ws/hbase-prefix-tree/target/hbase-prefix-tree-0.97.0-SNAPSHOT-tests.jar>
to /var/lib/jenkins/jobs/HBase-TRUNK/modules/org.apache.hbase$hbase-prefix-tree/builds/2013-04-18_21-21-26/archive/org.apache.hbase/hbase-prefix-tree/0.97.0-SNAPSHOT/hbase-prefix-tree-0.97.0-SNAPSHOT-tests.jar
[JENKINS] Archiving <http://54.241.6.143/job/HBase-TRUNK/ws/hbase-protocol/pom.xml>
to /var/lib/jenkins/jobs/HBase-TRUNK/modules/org.apache.hbase$hbase-protocol/builds/2013-04-18_21-21-25/archive/org.apache.hbase/hbase-protocol/0.97.0-SNAPSHOT/hbase-protocol-0.97.0-SNAPSHOT.pom
[JENKINS] Archiving <http://54.241.6.143/job/HBase-TRUNK/ws/hbase-protocol/target/hbase-protocol-0.97.0-SNAPSHOT.jar>
to /var/lib/jenkins/jobs/HBase-TRUNK/modules/org.apache.hbase$hbase-protocol/builds/2013-04-18_21-21-25/archive/org.apache.hbase/hbase-protocol/0.97.0-SNAPSHOT/hbase-protocol-0.97.0-SNAPSHOT.jar
[JENKINS] Archiving <http://54.241.6.143/job/HBase-TRUNK/ws/hbase-protocol/target/hbase-protocol-0.97.0-SNAPSHOT-sources.jar>
to /var/lib/jenkins/jobs/HBase-TRUNK/modules/org.apache.hbase$hbase-protocol/builds/2013-04-18_21-21-25/archive/org.apache.hbase/hbase-protocol/0.97.0-SNAPSHOT/hbase-protocol-0.97.0-SNAPSHOT-sources.jar
[JENKINS] Archiving <http://54.241.6.143/job/HBase-TRUNK/ws/hbase-protocol/target/hbase-protocol-0.97.0-SNAPSHOT-tests.jar>
to /var/lib/jenkins/jobs/HBase-TRUNK/modules/org.apache.hbase$hbase-protocol/builds/2013-04-18_21-21-25/archive/org.apache.hbase/hbase-protocol/0.97.0-SNAPSHOT/hbase-protocol-0.97.0-SNAPSHOT-tests.jar
[JENKINS] Archiving <http://54.241.6.143/job/HBase-TRUNK/ws/hbase-hadoop1-compat/pom.xml>
to /var/lib/jenkins/jobs/HBase-TRUNK/modules/org.apache.hbase$hbase-hadoop1-compat/builds/2013-04-18_21-21-26/archive/org.apache.hbase/hbase-hadoop1-compat/0.97.0-SNAPSHOT/hbase-hadoop1-compat-0.97.0-SNAPSHOT.pom
[JENKINS] Archiving <http://54.241.6.143/job/HBase-TRUNK/ws/hbase-hadoop1-compat/target/hbase-hadoop1-compat-0.97.0-SNAPSHOT.jar>
to /var/lib/jenkins/jobs/HBase-TRUNK/modules/org.apache.hbase$hbase-hadoop1-compat/builds/2013-04-18_21-21-26/archive/org.apache.hbase/hbase-hadoop1-compat/0.97.0-SNAPSHOT/hbase-hadoop1-compat-0.97.0-SNAPSHOT.jar
[JENKINS] Archiving <http://54.241.6.143/job/HBase-TRUNK/ws/hbase-hadoop1-compat/target/hbase-hadoop1-compat-0.97.0-SNAPSHOT-sources.jar>
to /var/lib/jenkins/jobs/HBase-TRUNK/modules/org.apache.hbase$hbase-hadoop1-compat/builds/2013-04-18_21-21-26/archive/org.apache.hbase/hbase-hadoop1-compat/0.97.0-SNAPSHOT/hbase-hadoop1-compat-0.97.0-SNAPSHOT-sources.jar
[JENKINS] Archiving <http://54.241.6.143/job/HBase-TRUNK/ws/hbase-hadoop1-compat/target/hbase-hadoop1-compat-0.97.0-SNAPSHOT-tests.jar>
to /var/lib/jenkins/jobs/HBase-TRUNK/modules/org.apache.hbase$hbase-hadoop1-compat/builds/2013-04-18_21-21-26/archive/org.apache.hbase/hbase-hadoop1-compat/0.97.0-SNAPSHOT/hbase-hadoop1-compat-0.97.0-SNAPSHOT-tests.jar
[JENKINS] Archiving <http://54.241.6.143/job/HBase-TRUNK/ws/hbase-server/pom.xml> to
/var/lib/jenkins/jobs/HBase-TRUNK/modules/org.apache.hbase$hbase-server/builds/2013-04-18_21-21-25/archive/org.apache.hbase/hbase-server/0.97.0-SNAPSHOT/hbase-server-0.97.0-SNAPSHOT.pom
[JENKINS] Archiving <http://54.241.6.143/job/HBase-TRUNK/ws/hbase-server/target/hbase-server-0.97.0-SNAPSHOT.jar>
to /var/lib/jenkins/jobs/HBase-TRUNK/modules/org.apache.hbase$hbase-server/builds/2013-04-18_21-21-25/archive/org.apache.hbase/hbase-server/0.97.0-SNAPSHOT/hbase-server-0.97.0-SNAPSHOT.jar
[JENKINS] Archiving <http://54.241.6.143/job/HBase-TRUNK/ws/hbase-server/target/hbase-server-0.97.0-SNAPSHOT-tests.jar>
to /var/lib/jenkins/jobs/HBase-TRUNK/modules/org.apache.hbase$hbase-server/builds/2013-04-18_21-21-25/archive/org.apache.hbase/hbase-server/0.97.0-SNAPSHOT/hbase-server-0.97.0-SNAPSHOT-tests.jar
[JENKINS] Archiving <http://54.241.6.143/job/HBase-TRUNK/ws/hbase-server/target/hbase-server-0.97.0-SNAPSHOT-sources.jar>
to /var/lib/jenkins/jobs/HBase-TRUNK/modules/org.apache.hbase$hbase-server/builds/2013-04-18_21-21-25/archive/org.apache.hbase/hbase-server/0.97.0-SNAPSHOT/hbase-server-0.97.0-SNAPSHOT-sources.jar
Waiting for Jenkins to finish collecting data
mavenExecutionResult exceptions not empty
message : Failed to execute goal org.apache.maven.plugins:maven-site-plugin:3.2:site (default-site)
on project hbase: SiteToolException: The site descriptor cannot be resolved from the repository:
ArtifactResolutionException: Unable to locate site descriptor: Could not transfer artifact
org.apache:apache:xml:site_en:12 from/to repository.jboss.org (http://repository.jboss.org/nexus/content/groups/public-jboss/):
Failed to transfer file: http://repository.jboss.org/nexus/content/groups/public-jboss/org/apache/apache/12/apache-12-site_en.xml.
Return code is: 503, ReasonPhrase:Service Temporarily Unavailable.
  org.apache:apache:xml:12

from the specified remote repositories:
  cloudbees netty (http://repository-netty.forge.cloudbees.com/snapshot/, releases=true, snapshots=true),
  apache release (https://repository.apache.org/content/repositories/releases/, releases=true,
snapshots=true),
  java.net (http://download.java.net/maven/2/, releases=true, snapshots=false),
  codehaus (http://repository.codehaus.org/, releases=true, snapshots=false),
  repository.jboss.org (http://repository.jboss.org/nexus/content/groups/public-jboss/, releases=true,
snapshots=false),
  ghelmling.testing (http://people.apache.org/~garyh/mvn/, releases=true, snapshots=true),
  apache.snapshots (http://repository.apache.org/snapshots, releases=false, snapshots=true),
  central (http://repo.maven.apache.org/maven2, releases=true, snapshots=false)

cause : SiteToolException: The site descriptor cannot be resolved from the repository: ArtifactResolutionException:
Unable to locate site descriptor: Could not transfer artifact org.apache:apache:xml:site_en:12
from/to repository.jboss.org (http://repository.jboss.org/nexus/content/groups/public-jboss/):
Failed to transfer file: http://repository.jboss.org/nexus/content/groups/public-jboss/org/apache/apache/12/apache-12-site_en.xml.
Return code is: 503, ReasonPhrase:Service Temporarily Unavailable.
  org.apache:apache:xml:12

from the specified remote repositories:
  cloudbees netty (http://repository-netty.forge.cloudbees.com/snapshot/, releases=true, snapshots=true),
  apache release (https://repository.apache.org/content/repositories/releases/, releases=true,
snapshots=true),
  java.net (http://download.java.net/maven/2/, releases=true, snapshots=false),
  codehaus (http://repository.codehaus.org/, releases=true, snapshots=false),
  repository.jboss.org (http://repository.jboss.org/nexus/content/groups/public-jboss/, releases=true,
snapshots=false),
  ghelmling.testing (http://people.apache.org/~garyh/mvn/, releases=true, snapshots=true),
  apache.snapshots (http://repository.apache.org/snapshots, releases=false, snapshots=true),
  central (http://repo.maven.apache.org/maven2, releases=true, snapshots=false)

Stack trace : 
org.apache.maven.lifecycle.LifecycleExecutionException: Failed to execute goal org.apache.maven.plugins:maven-site-plugin:3.2:site
(default-site) on project hbase: SiteToolException: The site descriptor cannot be resolved
from the repository: ArtifactResolutionException: Unable to locate site descriptor: Could
not transfer artifact org.apache:apache:xml:site_en:12 from/to repository.jboss.org (http://repository.jboss.org/nexus/content/groups/public-jboss/):
Failed to transfer file: http://repository.jboss.org/nexus/content/groups/public-jboss/org/apache/apache/12/apache-12-site_en.xml.
Return code is: 503, ReasonPhrase:Service Temporarily Unavailable.
  org.apache:apache:xml:12

from the specified remote repositories:
  cloudbees netty (http://repository-netty.forge.cloudbees.com/snapshot/, releases=true, snapshots=true),
  apache release (https://repository.apache.org/content/repositories/releases/, releases=true,
snapshots=true),
  java.net (http://download.java.net/maven/2/, releases=true, snapshots=false),
  codehaus (http://repository.codehaus.org/, releases=true, snapshots=false),
  repository.jboss.org (http://repository.jboss.org/nexus/content/groups/public-jboss/, releases=true,
snapshots=false),
  ghelmling.testing (http://people.apache.org/~garyh/mvn/, releases=true, snapshots=true),
  apache.snapshots (http://repository.apache.org/snapshots, releases=false, snapshots=true),
  central (http://repo.maven.apache.org/maven2, releases=true, snapshots=false)

	at org.apache.maven.lifecycle.internal.MojoExecutor.execute(MojoExecutor.java:217)
	at org.apache.maven.lifecycle.internal.MojoExecutor.execute(MojoExecutor.java:153)
	at org.apache.maven.lifecycle.internal.MojoExecutor.execute(MojoExecutor.java:145)
	at org.apache.maven.lifecycle.internal.LifecycleModuleBuilder.buildProject(LifecycleModuleBuilder.java:84)
	at org.apache.maven.lifecycle.internal.LifecycleModuleBuilder.buildProject(LifecycleModuleBuilder.java:59)
	at org.apache.maven.lifecycle.internal.LifecycleStarter.singleThreadedBuild(LifecycleStarter.java:183)
	at org.apache.maven.lifecycle.internal.LifecycleStarter.execute(LifecycleStarter.java:161)
	at org.apache.maven.DefaultMaven.doExecute(DefaultMaven.java:320)
	at org.apache.maven.DefaultMaven.execute(DefaultMaven.java:156)
	at org.jvnet.hudson.maven3.launcher.Maven3Launcher.main(Maven3Launcher.java:79)
	at sun.reflect.NativeMethodAccessorImpl.invoke0(Native Method)
	at sun.reflect.NativeMethodAccessorImpl.invoke(NativeMethodAccessorImpl.java:39)
	at sun.reflect.DelegatingMethodAccessorImpl.invoke(DelegatingMethodAccessorImpl.java:25)
	at java.lang.reflect.Method.invoke(Method.java:597)
	at org.codehaus.plexus.classworlds.launcher.Launcher.launchStandard(Launcher.java:329)
	at org.codehaus.plexus.classworlds.launcher.Launcher.launch(Launcher.java:239)
	at org.jvnet.hudson.maven3.agent.Maven3Main.launch(Maven3Main.java:158)
	at hudson.maven.Maven3Builder.call(Maven3Builder.java:100)
	at hudson.maven.Maven3Builder.call(Maven3Builder.java:66)
	at hudson.remoting.UserRequest.perform(UserRequest.java:118)
	at hudson.remoting.UserRequest.perform(UserRequest.java:48)
	at hudson.remoting.Request$2.run(Request.java:326)
	at hudson.remoting.InterceptingExecutorService$1.call(InterceptingExecutorService.java:72)
	at java.util.concurrent.FutureTask$Sync.innerRun(FutureTask.java:303)
	at java.util.concurrent.FutureTask.run(FutureTask.java:138)
	at java.util.concurrent.ThreadPoolExecutor$Worker.runTask(ThreadPoolExecutor.java:895)
	at java.util.concurrent.ThreadPoolExecutor$Worker.run(ThreadPoolExecutor.java:918)
	at java.lang.Thread.run(Thread.java:662)
Caused by: org.apache.maven.plugin.MojoExecutionException: SiteToolException: The site descriptor
cannot be resolved from the repository: ArtifactResolutionException: Unable to locate site
descriptor: Could not transfer artifact org.apache:apache:xml:site_en:12 from/to repository.jboss.org
(http://repository.jboss.org/nexus/content/groups/public-jboss/): Failed to transfer file:
http://repository.jboss.org/nexus/content/groups/public-jboss/org/apache/apache/12/apache-12-site_en.xml.
Return code is: 503, ReasonPhrase:Service Temporarily Unavailable.
  org.apache:apache:xml:12

from the specified remote repositories:
  cloudbees netty (http://repository-netty.forge.cloudbees.com/snapshot/, releases=true, snapshots=true),
  apache release (https://repository.apache.org/content/repositories/releases/, releases=true,
snapshots=true),
  java.net (http://download.java.net/maven/2/, releases=true, snapshots=false),
  codehaus (http://repository.codehaus.org/, releases=true, snapshots=false),
  repository.jboss.org (http://repository.jboss.org/nexus/content/groups/public-jboss/, releases=true,
snapshots=false),
  ghelmling.testing (http://people.apache.org/~garyh/mvn/, releases=true, snapshots=true),
  apache.snapshots (http://repository.apache.org/snapshots, releases=false, snapshots=true),
  central (http://repo.maven.apache.org/maven2, releases=true, snapshots=false)

	at org.apache.maven.plugins.site.AbstractSiteRenderingMojo.createSiteRenderingContext(AbstractSiteRenderingMojo.java:288)
	at org.apache.maven.plugins.site.SiteMojo.renderLocale(SiteMojo.java:154)
	at org.apache.maven.plugins.site.SiteMojo.execute(SiteMojo.java:138)
	at org.apache.maven.plugin.DefaultBuildPluginManager.executeMojo(DefaultBuildPluginManager.java:101)
	at org.apache.maven.lifecycle.internal.MojoExecutor.execute(MojoExecutor.java:209)
	... 27 more
Caused by: org.apache.maven.doxia.tools.SiteToolException: The site descriptor cannot be resolved
from the repository: ArtifactResolutionException: Unable to locate site descriptor: Could
not transfer artifact org.apache:apache:xml:site_en:12 from/to repository.jboss.org (http://repository.jboss.org/nexus/content/groups/public-jboss/):
Failed to transfer file: http://repository.jboss.org/nexus/content/groups/public-jboss/org/apache/apache/12/apache-12-site_en.xml.
Return code is: 503, ReasonPhrase:Service Temporarily Unavailable.
  org.apache:apache:xml:12

from the specified remote repositories:
  cloudbees netty (http://repository-netty.forge.cloudbees.com/snapshot/, releases=true, snapshots=true),
  apache release (https://repository.apache.org/content/repositories/releases/, releases=true,
snapshots=true),
  java.net (http://download.java.net/maven/2/, releases=true, snapshots=false),
  codehaus (http://repository.codehaus.org/, releases=true, snapshots=false),
  repository.jboss.org (http://repository.jboss.org/nexus/content/groups/public-jboss/, releases=true,
snapshots=false),
  ghelmling.testing (http://people.apache.org/~garyh/mvn/, releases=true, snapshots=true),
  apache.snapshots (http://repository.apache.org/snapshots, releases=false, snapshots=true),
  central (http://repo.maven.apache.org/maven2, releases=true, snapshots=false)

	at org.apache.maven.doxia.tools.DefaultSiteTool.getDecorationModel(DefaultSiteTool.java:1150)
	at org.apache.maven.doxia.tools.DefaultSiteTool.getDecorationModel(DefaultSiteTool.java:1192)
	at org.apache.maven.doxia.tools.DefaultSiteTool.getDecorationModel(DefaultSiteTool.java:454)
	at org.apache.maven.plugins.site.AbstractSiteRenderingMojo.createSiteRenderingContext(AbstractSiteRenderingMojo.java:281)
	... 31 more
Caused by: org.apache.maven.doxia.tools.SiteToolException: ArtifactResolutionException: Unable
to locate site descriptor: Could not transfer artifact org.apache:apache:xml:site_en:12 from/to
repository.jboss.org (http://repository.jboss.org/nexus/content/groups/public-jboss/): Failed
to transfer file: http://repository.jboss.org/nexus/content/groups/public-jboss/org/apache/apache/12/apache-12-site_en.xml.
Return code is: 503, ReasonPhrase:Service Temporarily Unavailable.
  org.apache:apache:xml:12

from the specified remote repositories:
  cloudbees netty (http://repository-netty.forge.cloudbees.com/snapshot/, releases=true, snapshots=true),
  apache release (https://repository.apache.org/content/repositories/releases/, releases=true,
snapshots=true),
  java.net (http://download.java.net/maven/2/, releases=true, snapshots=false),
  codehaus (http://repository.codehaus.org/, releases=true, snapshots=false),
  repository.jboss.org (http://repository.jboss.org/nexus/content/groups/public-jboss/, releases=true,
snapshots=false),
  ghelmling.testing (http://people.apache.org/~garyh/mvn/, releases=true, snapshots=true),
  apache.snapshots (http://repository.apache.org/snapshots, releases=false, snapshots=true),
  central (http://repo.maven.apache.org/maven2, releases=true, snapshots=false)

	at org.apache.maven.doxia.tools.DefaultSiteTool.getSiteDescriptorFromRepository(DefaultSiteTool.java:403)
	at org.apache.maven.doxia.tools.DefaultSiteTool.getDecorationModel(DefaultSiteTool.java:1146)
	... 34 more
Caused by: org.apache.maven.artifact.resolver.ArtifactResolutionException: Could not transfer
artifact org.apache:apache:xml:site_en:12 from/to repository.jboss.org (http://repository.jboss.org/nexus/content/groups/public-jboss/):
Failed to transfer file: http://repository.jboss.org/nexus/content/groups/public-jboss/org/apache/apache/12/apache-12-site_en.xml.
Return code is: 503, ReasonPhrase:Service Temporarily Unavailable.
  org.apache:apache:xml:12

from the specified remote repositories:
  cloudbees netty (http://repository-netty.forge.cloudbees.com/snapshot/, releases=true, snapshots=true),
  apache release (https://repository.apache.org/content/repositories/releases/, releases=true,
snapshots=true),
  java.net (http://download.java.net/maven/2/, releases=true, snapshots=false),
  codehaus (http://repository.codehaus.org/, releases=true, snapshots=false),
  repository.jboss.org (http://repository.jboss.org/nexus/content/groups/public-jboss/, releases=true,
snapshots=false),
  ghelmling.testing (http://people.apache.org/~garyh/mvn/, releases=true, snapshots=true),
  apache.snapshots (http://repository.apache.org/snapshots, releases=false, snapshots=true),
  central (http://repo.maven.apache.org/maven2, releases=true, snapshots=false)

	at org.apache.maven.artifact.resolver.DefaultArtifactResolver.resolve(DefaultArtifactResolver.java:223)
	at org.apache.maven.artifact.resolver.DefaultArtifactResolver.resolve(DefaultArtifactResolver.java:157)
	at org.apache.maven.artifact.resolver.DefaultArtifactResolver.resolve(DefaultArtifactResolver.java:525)
	at org.apache.maven.doxia.tools.DefaultSiteTool.resolveSiteDescriptor(DefaultSiteTool.java:1062)
	at org.apache.maven.doxia.tools.DefaultSiteTool.getSiteDescriptorFromRepository(DefaultSiteTool.java:394)
	... 35 more
Caused by: org.sonatype.aether.resolution.ArtifactResolutionException: Could not transfer
artifact org.apache:apache:xml:site_en:12 from/to repository.jboss.org (http://repository.jboss.org/nexus/content/groups/public-jboss/):
Failed to transfer file: http://repository.jboss.org/nexus/content/groups/public-jboss/org/apache/apache/12/apache-12-site_en.xml.
Return code is: 503, ReasonPhrase:Service Temporarily Unavailable.
	at org.sonatype.aether.impl.internal.DefaultArtifactResolver.resolve(DefaultArtifactResolver.java:538)
	at org.sonatype.aether.impl.internal.DefaultArtifactResolver.resolveArtifacts(DefaultArtifactResolver.java:216)
	at org.sonatype.aether.impl.internal.DefaultArtifactResolver.resolveArtifact(DefaultArtifactResolver.java:193)
	at org.sonatype.aether.impl.internal.DefaultRepositorySystem.resolveArtifact(DefaultRepositorySystem.java:286)
	at org.apache.maven.artifact.resolver.DefaultArtifactResolver.resolve(DefaultArtifactResolver.java:213)
	... 39 more
Caused by: org.sonatype.aether.transfer.ArtifactTransferException: Could not transfer artifact
org.apache:apache:xml:site_en:12 from/to repository.jboss.org (http://repository.jboss.org/nexus/content/groups/public-jboss/):
Failed to transfer file: http://repository.jboss.org/nexus/content/groups/public-jboss/org/apache/apache/12/apache-12-site_en.xml.
Return code is: 503, ReasonPhrase:Service Temporarily Unavailable.
	at org.sonatype.aether.connector.wagon.WagonRepositoryConnector$4.wrap(WagonRepositoryConnector.java:951)
	at org.sonatype.aether.connector.wagon.WagonRepositoryConnector$4.wrap(WagonRepositoryConnector.java:941)
	at org.sonatype.aether.connector.wagon.WagonRepositoryConnector$GetTask.run(WagonRepositoryConnector.java:669)
	at org.sonatype.aether.util.concurrency.RunnableErrorForwarder$1.run(RunnableErrorForwarder.java:60)
	... 3 more
Caused by: org.apache.maven.wagon.TransferFailedException: Failed to transfer file: http://repository.jboss.org/nexus/content/groups/public-jboss/org/apache/apache/12/apache-12-site_en.xml.
Return code is: 503, ReasonPhrase:Service Temporarily Unavailable.
	at org.apache.maven.wagon.shared.http4.AbstractHttpClientWagon.fillInputData(AbstractHttpClientWagon.java:852)
	at org.apache.maven.wagon.StreamWagon.getInputStream(StreamWagon.java:116)
	at org.apache.maven.wagon.StreamWagon.getIfNewer(StreamWagon.java:88)
	at org.apache.maven.wagon.StreamWagon.get(StreamWagon.java:61)
	at org.sonatype.aether.connector.wagon.WagonRepositoryConnector$GetTask.run(WagonRepositoryConnector.java:601)
	... 4 more
channel stopped

Mime
View raw message