hbase-dev mailing list archives

Site index · List index
Message view « Date » · « Thread »
Top « Date » · « Thread »
From apurt...@apache.org
Subject Build failed in Jenkins: HBase-0.94 #107
Date Fri, 19 Apr 2013 07:16:14 GMT
See <http://54.241.6.143/job/HBase-0.94/107/>

------------------------------------------
[...truncated 6664 lines...]
Running org.apache.hadoop.hbase.regionserver.TestEndToEndSplitTransaction
Tests run: 2, Failures: 0, Errors: 0, Skipped: 0, Time elapsed: 69.088 sec
Running org.apache.hadoop.hbase.regionserver.wal.TestDurability
Tests run: 1, Failures: 0, Errors: 0, Skipped: 0, Time elapsed: 6.651 sec
Running org.apache.hadoop.hbase.regionserver.wal.TestHLogBench
Tests run: 1, Failures: 0, Errors: 0, Skipped: 0, Time elapsed: 2.358 sec
Running org.apache.hadoop.hbase.regionserver.TestCompactionWithCoprocessor
Tests run: 17, Failures: 0, Errors: 0, Skipped: 0, Time elapsed: 65.864 sec
Running org.apache.hadoop.hbase.regionserver.TestMultiColumnScanner
Tests run: 12, Failures: 0, Errors: 0, Skipped: 0, Time elapsed: 45.763 sec
Running org.apache.hadoop.hbase.regionserver.wal.TestLogRollingNoCluster
Tests run: 1, Failures: 0, Errors: 0, Skipped: 0, Time elapsed: 3.125 sec
Running org.apache.hadoop.hbase.regionserver.wal.TestWALReplayCompressed
Tests run: 7, Failures: 0, Errors: 0, Skipped: 0, Time elapsed: 37.403 sec
Running org.apache.hadoop.hbase.regionserver.wal.TestLogRollAbort
Tests run: 1, Failures: 0, Errors: 0, Skipped: 0, Time elapsed: 163.432 sec
Running org.apache.hadoop.hbase.regionserver.wal.TestWALReplay
Tests run: 7, Failures: 0, Errors: 0, Skipped: 0, Time elapsed: 34.446 sec
Running org.apache.hadoop.hbase.regionserver.wal.TestHLog
Tests run: 10, Failures: 0, Errors: 0, Skipped: 0, Time elapsed: 61.485 sec
Running org.apache.hadoop.hbase.regionserver.wal.TestHLogSplitCompressed
Tests run: 30, Failures: 0, Errors: 0, Skipped: 1, Time elapsed: 246.247 sec
Running org.apache.hadoop.hbase.regionserver.wal.TestLogRolling
Tests run: 2, Failures: 0, Errors: 0, Skipped: 0, Time elapsed: 275.168 sec
Running org.apache.hadoop.hbase.regionserver.TestAtomicOperation
Tests run: 5, Failures: 0, Errors: 0, Skipped: 0, Time elapsed: 26.791 sec
Running org.apache.hadoop.hbase.regionserver.TestBlocksRead
Tests run: 4, Failures: 0, Errors: 0, Skipped: 0, Time elapsed: 1.69 sec
Running org.apache.hadoop.hbase.regionserver.metrics.TestSchemaMetrics
Tests run: 6, Failures: 0, Errors: 0, Skipped: 0, Time elapsed: 19.049 sec
Running org.apache.hadoop.hbase.regionserver.TestHRegionOnCluster
Tests run: 1, Failures: 0, Errors: 0, Skipped: 0, Time elapsed: 17.671 sec
Running org.apache.hadoop.hbase.regionserver.TestMXBean
Tests run: 1, Failures: 0, Errors: 0, Skipped: 0, Time elapsed: 13.001 sec
Running org.apache.hadoop.hbase.regionserver.TestStoreFileBlockCacheSummary
Tests run: 1, Failures: 0, Errors: 0, Skipped: 0, Time elapsed: 18.461 sec
Running org.apache.hadoop.hbase.regionserver.TestHRegionServerBulkLoad
Tests run: 1, Failures: 0, Errors: 0, Skipped: 0, Time elapsed: 53.21 sec
Running org.apache.hadoop.hbase.TestLocalHBaseCluster
Tests run: 1, Failures: 0, Errors: 0, Skipped: 0, Time elapsed: 9.801 sec
Running org.apache.hadoop.hbase.ipc.TestPBOnWritableRpc
Tests run: 1, Failures: 0, Errors: 0, Skipped: 0, Time elapsed: 1.5 sec
Running org.apache.hadoop.hbase.ipc.TestDelayedRpc
Tests run: 4, Failures: 0, Errors: 0, Skipped: 0, Time elapsed: 3.523 sec
Running org.apache.hadoop.hbase.replication.TestReplicationZookeeper
Tests run: 1, Failures: 0, Errors: 0, Skipped: 0, Time elapsed: 0.958 sec
Running org.apache.hadoop.hbase.TestHBaseTestingUtility
Tests run: 7, Failures: 0, Errors: 0, Skipped: 0, Time elapsed: 69.822 sec
Running org.apache.hadoop.hbase.regionserver.TestCompactionState
Tests run: 5, Failures: 0, Errors: 0, Skipped: 0, Time elapsed: 100.063 sec
Running org.apache.hadoop.hbase.replication.TestReplicationSource
Tests run: 1, Failures: 0, Errors: 0, Skipped: 0, Time elapsed: 4.075 sec
Running org.apache.hadoop.hbase.replication.regionserver.TestReplicationSink
Tests run: 5, Failures: 0, Errors: 0, Skipped: 0, Time elapsed: 17.728 sec
Running org.apache.hadoop.hbase.replication.regionserver.TestReplicationSourceManager
Tests run: 3, Failures: 0, Errors: 0, Skipped: 0, Time elapsed: 2.051 sec
Running org.apache.hadoop.hbase.regionserver.wal.TestHLogSplit
Tests run: 30, Failures: 0, Errors: 0, Skipped: 1, Time elapsed: 247.577 sec
Running org.apache.hadoop.hbase.replication.TestReplicationDisableInactivePeer
Tests run: 1, Failures: 0, Errors: 0, Skipped: 0, Time elapsed: 86.285 sec
Running org.apache.hadoop.hbase.replication.TestReplicationQueueFailover
Tests run: 1, Failures: 0, Errors: 0, Skipped: 0, Time elapsed: 72.5 sec
Running org.apache.hadoop.hbase.replication.TestMultiSlaveReplication
Tests run: 1, Failures: 0, Errors: 0, Skipped: 0, Time elapsed: 46.936 sec
Running org.apache.hadoop.hbase.filter.TestColumnRangeFilter
Tests run: 1, Failures: 0, Errors: 0, Skipped: 0, Time elapsed: 21.441 sec
Running org.apache.hadoop.hbase.replication.TestMasterReplication
Tests run: 2, Failures: 0, Errors: 0, Skipped: 0, Time elapsed: 69.722 sec
Running org.apache.hadoop.hbase.zookeeper.TestZooKeeperNodeTracker
Tests run: 2, Failures: 0, Errors: 0, Skipped: 0, Time elapsed: 1.266 sec
Running org.apache.hadoop.hbase.zookeeper.TestZooKeeperACL
Tests run: 5, Failures: 0, Errors: 0, Skipped: 0, Time elapsed: 8.747 sec
Running org.apache.hadoop.hbase.zookeeper.TestZKMulti
Tests run: 6, Failures: 0, Errors: 0, Skipped: 0, Time elapsed: 1.114 sec
Running org.apache.hadoop.hbase.replication.TestReplicationQueueFailoverCompressed
Tests run: 1, Failures: 0, Errors: 0, Skipped: 0, Time elapsed: 68.942 sec
Running org.apache.hadoop.hbase.TestZooKeeper
Tests run: 8, Failures: 0, Errors: 0, Skipped: 0, Time elapsed: 26.898 sec
Running org.apache.hadoop.hbase.zookeeper.TestZKLeaderManager
Tests run: 1, Failures: 0, Errors: 0, Skipped: 0, Time elapsed: 1.447 sec
Running org.apache.hadoop.hbase.zookeeper.TestRecoverableZooKeeper
Tests run: 1, Failures: 0, Errors: 0, Skipped: 0, Time elapsed: 2.993 sec
Running org.apache.hadoop.hbase.zookeeper.TestZKTableReadOnly
Tests run: 2, Failures: 0, Errors: 0, Skipped: 0, Time elapsed: 1.533 sec
Running org.apache.hadoop.hbase.metrics.TestMetricsMBeanBase
Tests run: 3, Failures: 0, Errors: 0, Skipped: 0, Time elapsed: 1.637 sec
Running org.apache.hadoop.hbase.zookeeper.TestZKTable
Tests run: 5, Failures: 0, Errors: 0, Skipped: 0, Time elapsed: 2.055 sec
Running org.apache.hadoop.hbase.catalog.TestMetaReaderEditorNoCluster
Tests run: 1, Failures: 0, Errors: 0, Skipped: 0, Time elapsed: 5.408 sec
Running org.apache.hadoop.hbase.catalog.TestCatalogTracker
Tests run: 10, Failures: 0, Errors: 0, Skipped: 1, Time elapsed: 10.15 sec
Running org.apache.hadoop.hbase.catalog.TestMetaReaderEditor
Tests run: 5, Failures: 0, Errors: 0, Skipped: 0, Time elapsed: 27.231 sec
Running org.apache.hadoop.hbase.coprocessor.TestRegionServerCoprocessorExceptionWithAbort
Tests run: 1, Failures: 0, Errors: 0, Skipped: 0, Time elapsed: 17.562 sec
Running org.apache.hadoop.hbase.constraint.TestConstraint
Tests run: 5, Failures: 0, Errors: 0, Skipped: 0, Time elapsed: 28.974 sec
Running org.apache.hadoop.hbase.coprocessor.TestWALObserver
Tests run: 3, Failures: 0, Errors: 0, Skipped: 0, Time elapsed: 17.455 sec
Running org.apache.hadoop.hbase.replication.TestReplicationSmallTests
Tests run: 8, Failures: 0, Errors: 0, Skipped: 0, Time elapsed: 275.023 sec
Running org.apache.hadoop.hbase.coprocessor.TestClassLoading
Tests run: 7, Failures: 0, Errors: 0, Skipped: 0, Time elapsed: 29.026 sec
Running org.apache.hadoop.hbase.coprocessor.TestCoprocessorEndpoint
Tests run: 4, Failures: 0, Errors: 0, Skipped: 1, Time elapsed: 30.906 sec
Running org.apache.hadoop.hbase.coprocessor.example.TestZooKeeperScanPolicyObserver
Tests run: 1, Failures: 0, Errors: 0, Skipped: 0, Time elapsed: 14.101 sec
Running org.apache.hadoop.hbase.coprocessor.TestAggregateProtocol
Tests run: 45, Failures: 0, Errors: 0, Skipped: 0, Time elapsed: 18.608 sec
Running org.apache.hadoop.hbase.coprocessor.TestRegionObserverBypass
Tests run: 2, Failures: 0, Errors: 0, Skipped: 0, Time elapsed: 15.82 sec
Running org.apache.hadoop.hbase.coprocessor.example.TestBulkDeleteProtocol
Tests run: 8, Failures: 0, Errors: 0, Skipped: 0, Time elapsed: 30.652 sec
Running org.apache.hadoop.hbase.coprocessor.TestMasterCoprocessorExceptionWithRemove
Tests run: 1, Failures: 0, Errors: 0, Skipped: 0, Time elapsed: 17.587 sec
Running org.apache.hadoop.hbase.coprocessor.TestRegionServerCoprocessorExceptionWithRemove
Tests run: 1, Failures: 0, Errors: 0, Skipped: 0, Time elapsed: 20.411 sec
Running org.apache.hadoop.hbase.coprocessor.TestMasterObserver
Tests run: 4, Failures: 0, Errors: 0, Skipped: 0, Time elapsed: 45.242 sec
Running org.apache.hadoop.hbase.coprocessor.TestRegionObserverInterface
Tests run: 7, Failures: 0, Errors: 0, Skipped: 0, Time elapsed: 36.782 sec
Running org.apache.hadoop.hbase.coprocessor.TestBigDecimalColumnInterpreter
Tests run: 38, Failures: 0, Errors: 0, Skipped: 0, Time elapsed: 16.547 sec
Running org.apache.hadoop.hbase.coprocessor.TestMasterCoprocessorExceptionWithAbort
Tests run: 1, Failures: 0, Errors: 0, Skipped: 0, Time elapsed: 28.866 sec
Running org.apache.hadoop.hbase.thrift2.TestThriftHBaseServiceHandler
Tests run: 12, Failures: 0, Errors: 0, Skipped: 0, Time elapsed: 14.377 sec
Running org.apache.hadoop.hbase.TestGlobalMemStoreSize
Tests run: 1, Failures: 0, Errors: 0, Skipped: 0, Time elapsed: 17.428 sec
Running org.apache.hadoop.hbase.util.TestCoprocessorScanPolicy
Tests run: 2, Failures: 0, Errors: 0, Skipped: 0, Time elapsed: 15.93 sec
Running org.apache.hadoop.hbase.util.TestFSUtils
Tests run: 4, Failures: 0, Errors: 0, Skipped: 0, Time elapsed: 24.961 sec
Running org.apache.hadoop.hbase.TestRegionRebalancing
Tests run: 1, Failures: 0, Errors: 0, Skipped: 0, Time elapsed: 25.295 sec
Running org.apache.hadoop.hbase.util.TestRegionSplitter
Tests run: 5, Failures: 0, Errors: 0, Skipped: 0, Time elapsed: 18.994 sec
Running org.apache.hadoop.hbase.util.TestFSVisitor
Tests run: 3, Failures: 0, Errors: 0, Skipped: 0, Time elapsed: 2.527 sec
Running org.apache.hadoop.hbase.util.hbck.TestOfflineMetaRebuildHole
Tests run: 1, Failures: 0, Errors: 0, Skipped: 0, Time elapsed: 34.297 sec
Running org.apache.hadoop.hbase.util.TestPoolMap$TestRoundRobinPoolType
Tests run: 3, Failures: 0, Errors: 0, Skipped: 0, Time elapsed: 0.015 sec
Running org.apache.hadoop.hbase.util.TestPoolMap$TestThreadLocalPoolType
Tests run: 3, Failures: 0, Errors: 0, Skipped: 0, Time elapsed: 0.013 sec
Running org.apache.hadoop.hbase.util.TestPoolMap$TestReusablePoolType
Tests run: 3, Failures: 0, Errors: 0, Skipped: 0, Time elapsed: 0.06 sec
Running org.apache.hadoop.hbase.util.hbck.TestOfflineMetaRebuildBase
Tests run: 1, Failures: 0, Errors: 0, Skipped: 0, Time elapsed: 29.957 sec
Running org.apache.hadoop.hbase.util.TestEnvironmentEdgeManager
Tests run: 2, Failures: 0, Errors: 0, Skipped: 0, Time elapsed: 0.84 sec
Running org.apache.hadoop.hbase.util.hbck.TestOfflineMetaRebuildOverlap
Tests run: 1, Failures: 0, Errors: 0, Skipped: 0, Time elapsed: 34.947 sec
Running org.apache.hadoop.hbase.util.TestIdLock
Tests run: 1, Failures: 0, Errors: 0, Skipped: 0, Time elapsed: 16.435 sec
Running org.apache.hadoop.hbase.util.TestMiniClusterLoadParallel
Tests run: 4, Failures: 0, Errors: 0, Skipped: 0, Time elapsed: 166.608 sec
Running org.apache.hadoop.hbase.util.TestSizeBasedThrottler
Tests run: 3, Failures: 0, Errors: 0, Skipped: 0, Time elapsed: 157.464 sec
Running org.apache.hadoop.hbase.util.TestMergeTable
Tests run: 1, Failures: 0, Errors: 0, Skipped: 0, Time elapsed: 28.537 sec
Running org.apache.hadoop.hbase.util.TestHBaseFsck
Tests run: 34, Failures: 0, Errors: 0, Skipped: 0, Time elapsed: 275.599 sec
Running org.apache.hadoop.hbase.util.TestDefaultEnvironmentEdge
Tests run: 1, Failures: 0, Errors: 0, Skipped: 0, Time elapsed: 0.629 sec
Running org.apache.hadoop.hbase.util.TestFSTableDescriptors
Tests run: 11, Failures: 0, Errors: 0, Skipped: 0, Time elapsed: 3.846 sec
Running org.apache.hadoop.hbase.util.TestMiniClusterLoadEncoded
Tests run: 4, Failures: 0, Errors: 0, Skipped: 0, Time elapsed: 88.911 sec
Running org.apache.hadoop.hbase.util.TestMergeTool
Tests run: 1, Failures: 0, Errors: 0, Skipped: 0, Time elapsed: 293.935 sec
Running org.apache.hadoop.hbase.TestHBaseFileSystem
Tests run: 1, Failures: 0, Errors: 0, Skipped: 0, Time elapsed: 21.714 sec
Running org.apache.hadoop.hbase.TestClusterBootOrder
Tests run: 2, Failures: 0, Errors: 0, Skipped: 0, Time elapsed: 33.919 sec
Running org.apache.hadoop.hbase.avro.TestAvroServer
Tests run: 3, Failures: 0, Errors: 0, Skipped: 0, Time elapsed: 26.959 sec
Running org.apache.hadoop.hbase.util.TestMiniClusterLoadSequential
Tests run: 4, Failures: 0, Errors: 0, Skipped: 0, Time elapsed: 155.404 sec

Results :

Failed tests:   testTaskResigned(org.apache.hadoop.hbase.master.TestSplitLogManager)

Tests run: 1341, Failures: 1, Errors: 0, Skipped: 13

[JENKINS] Recording test results
[INFO] ------------------------------------------------------------------------
[INFO] BUILD FAILURE
[INFO] ------------------------------------------------------------------------
[INFO] Total time: 1:04:29.266s
[INFO] Finished at: Fri Apr 19 07:16:01 UTC 2013
[INFO] Final Memory: 53M/685M
[INFO] ------------------------------------------------------------------------
[JENKINS] Archiving <http://54.241.6.143/job/HBase-0.94/ws/pom.xml> to /var/lib/jenkins/jobs/HBase-0.94/modules/org.apache.hbase$hbase/builds/2013-04-19_06-11-26/archive/org.apache.hbase/hbase/0.94.7/hbase-0.94.7.pom
Waiting for Jenkins to finish collecting data
mavenExecutionResult exceptions not empty
message : Failed to execute goal org.apache.maven.plugins:maven-surefire-plugin:2.12-TRUNK-HBASE-2:test
(secondPartTestsExecution) on project hbase: There are test failures.

Please refer to <http://54.241.6.143/job/HBase-0.94/ws/target/surefire-reports> for
the individual test results.
cause : There are test failures.

Please refer to <http://54.241.6.143/job/HBase-0.94/ws/target/surefire-reports> for
the individual test results.
Stack trace : 
org.apache.maven.lifecycle.LifecycleExecutionException: Failed to execute goal org.apache.maven.plugins:maven-surefire-plugin:2.12-TRUNK-HBASE-2:test
(secondPartTestsExecution) on project hbase: There are test failures.

Please refer to <http://54.241.6.143/job/HBase-0.94/ws/target/surefire-reports> for
the individual test results.
	at org.apache.maven.lifecycle.internal.MojoExecutor.execute(MojoExecutor.java:213)
	at org.apache.maven.lifecycle.internal.MojoExecutor.execute(MojoExecutor.java:153)
	at org.apache.maven.lifecycle.internal.MojoExecutor.execute(MojoExecutor.java:145)
	at org.apache.maven.lifecycle.internal.LifecycleModuleBuilder.buildProject(LifecycleModuleBuilder.java:84)
	at org.apache.maven.lifecycle.internal.LifecycleModuleBuilder.buildProject(LifecycleModuleBuilder.java:59)
	at org.apache.maven.lifecycle.internal.LifecycleStarter.singleThreadedBuild(LifecycleStarter.java:183)
	at org.apache.maven.lifecycle.internal.LifecycleStarter.execute(LifecycleStarter.java:161)
	at org.apache.maven.DefaultMaven.doExecute(DefaultMaven.java:320)
	at org.apache.maven.DefaultMaven.execute(DefaultMaven.java:156)
	at org.jvnet.hudson.maven3.launcher.Maven3Launcher.main(Maven3Launcher.java:79)
	at sun.reflect.NativeMethodAccessorImpl.invoke0(Native Method)
	at sun.reflect.NativeMethodAccessorImpl.invoke(NativeMethodAccessorImpl.java:39)
	at sun.reflect.DelegatingMethodAccessorImpl.invoke(DelegatingMethodAccessorImpl.java:25)
	at java.lang.reflect.Method.invoke(Method.java:597)
	at org.codehaus.plexus.classworlds.launcher.Launcher.launchStandard(Launcher.java:329)
	at org.codehaus.plexus.classworlds.launcher.Launcher.launch(Launcher.java:239)
	at org.jvnet.hudson.maven3.agent.Maven3Main.launch(Maven3Main.java:158)
	at hudson.maven.Maven3Builder.call(Maven3Builder.java:100)
	at hudson.maven.Maven3Builder.call(Maven3Builder.java:66)
	at hudson.remoting.UserRequest.perform(UserRequest.java:118)
	at hudson.remoting.UserRequest.perform(UserRequest.java:48)
	at hudson.remoting.Request$2.run(Request.java:326)
	at hudson.remoting.InterceptingExecutorService$1.call(InterceptingExecutorService.java:72)
	at java.util.concurrent.FutureTask$Sync.innerRun(FutureTask.java:303)
	at java.util.concurrent.FutureTask.run(FutureTask.java:138)
	at java.util.concurrent.ThreadPoolExecutor$Worker.runTask(ThreadPoolExecutor.java:895)
	at java.util.concurrent.ThreadPoolExecutor$Worker.run(ThreadPoolExecutor.java:918)
	at java.lang.Thread.run(Thread.java:662)
Caused by: org.apache.maven.plugin.MojoFailureException: There are test failures.

Please refer to <http://54.241.6.143/job/HBase-0.94/ws/target/surefire-reports> for
the individual test results.
	at org.apache.maven.plugin.surefire.SurefireHelper.reportExecution(SurefireHelper.java:87)
	at org.apache.maven.plugin.surefire.SurefirePlugin.writeSummary(SurefirePlugin.java:651)
	at org.apache.maven.plugin.surefire.SurefirePlugin.handleSummary(SurefirePlugin.java:625)
	at org.apache.maven.plugin.surefire.AbstractSurefireMojo.executeAfterPreconditionsChecked(AbstractSurefireMojo.java:137)
	at org.apache.maven.plugin.surefire.AbstractSurefireMojo.execute(AbstractSurefireMojo.java:98)
	at org.apache.maven.plugin.DefaultBuildPluginManager.executeMojo(DefaultBuildPluginManager.java:101)
	at org.apache.maven.lifecycle.internal.MojoExecutor.execute(MojoExecutor.java:209)
	... 27 more
channel stopped
Archiving artifacts

Mime
View raw message