hbase-dev mailing list archives

Site index · List index
Message view « Date » · « Thread »
Top « Date » · « Thread »
From Apache Jenkins Server <jenk...@builds.apache.org>
Subject Build failed in Jenkins: hbase-0.95-on-hadoop2 #51
Date Mon, 01 Apr 2013 23:19:35 GMT
See <https://builds.apache.org/job/hbase-0.95-on-hadoop2/51/>

------------------------------------------
[...truncated 24186 lines...]
Running org.apache.hadoop.hbase.rest.TestGzipFilter
Tests run: 2, Failures: 0, Errors: 0, Skipped: 0, Time elapsed: 8.081 sec
Forking command line: /bin/sh -c cd /x1/jenkins/jenkins-slave/workspace/hbase-0.95-on-hadoop2/0.95-on-hadoop2/hbase-server && /x1/jenkins/tools/java/jdk1.6.0_32-32/jre/bin/java -enableassertions -Xmx1900m -Djava.security.egd=file:/dev/./urandom -Djava.net.preferIPv4Stack=true -jar /x1/jenkins/jenkins-slave/workspace/hbase-0.95-on-hadoop2/0.95-on-hadoop2/hbase-server/target/surefire/surefirebooter8761043789599319908.jar /x1/jenkins/jenkins-slave/workspace/hbase-0.95-on-hadoop2/0.95-on-hadoop2/hbase-server/target/surefire/surefire1943261235092613271tmp /x1/jenkins/jenkins-slave/workspace/hbase-0.95-on-hadoop2/0.95-on-hadoop2/hbase-server/target/surefire/surefire_1861311630324222558226tmp
Running org.apache.hadoop.hbase.rest.TestTableResource
Tests run: 8, Failures: 0, Errors: 0, Skipped: 0, Time elapsed: 17.405 sec
Forking command line: /bin/sh -c cd /x1/jenkins/jenkins-slave/workspace/hbase-0.95-on-hadoop2/0.95-on-hadoop2/hbase-server && /x1/jenkins/tools/java/jdk1.6.0_32-32/jre/bin/java -enableassertions -Xmx1900m -Djava.security.egd=file:/dev/./urandom -Djava.net.preferIPv4Stack=true -jar /x1/jenkins/jenkins-slave/workspace/hbase-0.95-on-hadoop2/0.95-on-hadoop2/hbase-server/target/surefire/surefirebooter6763782210792393601.jar /x1/jenkins/jenkins-slave/workspace/hbase-0.95-on-hadoop2/0.95-on-hadoop2/hbase-server/target/surefire/surefire206129040419207932tmp /x1/jenkins/jenkins-slave/workspace/hbase-0.95-on-hadoop2/0.95-on-hadoop2/hbase-server/target/surefire/surefire_187839641347424814055tmp
Running org.apache.hadoop.hbase.rest.TestRowResource
Tests run: 12, Failures: 0, Errors: 0, Skipped: 0, Time elapsed: 10.26 sec
Forking command line: /bin/sh -c cd /x1/jenkins/jenkins-slave/workspace/hbase-0.95-on-hadoop2/0.95-on-hadoop2/hbase-server && /x1/jenkins/tools/java/jdk1.6.0_32-32/jre/bin/java -enableassertions -Xmx1900m -Djava.security.egd=file:/dev/./urandom -Djava.net.preferIPv4Stack=true -jar /x1/jenkins/jenkins-slave/workspace/hbase-0.95-on-hadoop2/0.95-on-hadoop2/hbase-server/target/surefire/surefirebooter3333243894171699954.jar /x1/jenkins/jenkins-slave/workspace/hbase-0.95-on-hadoop2/0.95-on-hadoop2/hbase-server/target/surefire/surefire5710012536652764360tmp /x1/jenkins/jenkins-slave/workspace/hbase-0.95-on-hadoop2/0.95-on-hadoop2/hbase-server/target/surefire/surefire_1882359415018647727599tmp
Running org.apache.hadoop.hbase.rest.TestVersionResource
Tests run: 7, Failures: 0, Errors: 0, Skipped: 0, Time elapsed: 6.694 sec
Forking command line: /bin/sh -c cd /x1/jenkins/jenkins-slave/workspace/hbase-0.95-on-hadoop2/0.95-on-hadoop2/hbase-server && /x1/jenkins/tools/java/jdk1.6.0_32-32/jre/bin/java -enableassertions -Xmx1900m -Djava.security.egd=file:/dev/./urandom -Djava.net.preferIPv4Stack=true -jar /x1/jenkins/jenkins-slave/workspace/hbase-0.95-on-hadoop2/0.95-on-hadoop2/hbase-server/target/surefire/surefirebooter5874554398462582246.jar /x1/jenkins/jenkins-slave/workspace/hbase-0.95-on-hadoop2/0.95-on-hadoop2/hbase-server/target/surefire/surefire4206781943174221070tmp /x1/jenkins/jenkins-slave/workspace/hbase-0.95-on-hadoop2/0.95-on-hadoop2/hbase-server/target/surefire/surefire_1897788275334794283868tmp
Running org.apache.hadoop.hbase.rest.TestStatusResource
Tests run: 2, Failures: 0, Errors: 0, Skipped: 0, Time elapsed: 7.212 sec
Forking command line: /bin/sh -c cd /x1/jenkins/jenkins-slave/workspace/hbase-0.95-on-hadoop2/0.95-on-hadoop2/hbase-server && /x1/jenkins/tools/java/jdk1.6.0_32-32/jre/bin/java -enableassertions -Xmx1900m -Djava.security.egd=file:/dev/./urandom -Djava.net.preferIPv4Stack=true -jar /x1/jenkins/jenkins-slave/workspace/hbase-0.95-on-hadoop2/0.95-on-hadoop2/hbase-server/target/surefire/surefirebooter3530386872870346157.jar /x1/jenkins/jenkins-slave/workspace/hbase-0.95-on-hadoop2/0.95-on-hadoop2/hbase-server/target/surefire/surefire1936307771098659018tmp /x1/jenkins/jenkins-slave/workspace/hbase-0.95-on-hadoop2/0.95-on-hadoop2/hbase-server/target/surefire/surefire_1905011322220896327463tmp
Running org.apache.hadoop.hbase.rest.TestScannerResource
Tests run: 5, Failures: 0, Errors: 0, Skipped: 0, Time elapsed: 18.183 sec
Forking command line: /bin/sh -c cd /x1/jenkins/jenkins-slave/workspace/hbase-0.95-on-hadoop2/0.95-on-hadoop2/hbase-server && /x1/jenkins/tools/java/jdk1.6.0_32-32/jre/bin/java -enableassertions -Xmx1900m -Djava.security.egd=file:/dev/./urandom -Djava.net.preferIPv4Stack=true -jar /x1/jenkins/jenkins-slave/workspace/hbase-0.95-on-hadoop2/0.95-on-hadoop2/hbase-server/target/surefire/surefirebooter6658300579332624763.jar /x1/jenkins/jenkins-slave/workspace/hbase-0.95-on-hadoop2/0.95-on-hadoop2/hbase-server/target/surefire/surefire4140005978599416218tmp /x1/jenkins/jenkins-slave/workspace/hbase-0.95-on-hadoop2/0.95-on-hadoop2/hbase-server/target/surefire/surefire_1916213712647455199651tmp
Running org.apache.hadoop.hbase.trace.TestHTraceHooks
Tests run: 1, Failures: 0, Errors: 0, Skipped: 0, Time elapsed: 7.411 sec
Forking command line: /bin/sh -c cd /x1/jenkins/jenkins-slave/workspace/hbase-0.95-on-hadoop2/0.95-on-hadoop2/hbase-server && /x1/jenkins/tools/java/jdk1.6.0_32-32/jre/bin/java -enableassertions -Xmx1900m -Djava.security.egd=file:/dev/./urandom -Djava.net.preferIPv4Stack=true -jar /x1/jenkins/jenkins-slave/workspace/hbase-0.95-on-hadoop2/0.95-on-hadoop2/hbase-server/target/surefire/surefirebooter5948674377899531118.jar /x1/jenkins/jenkins-slave/workspace/hbase-0.95-on-hadoop2/0.95-on-hadoop2/hbase-server/target/surefire/surefire242706258150279737tmp /x1/jenkins/jenkins-slave/workspace/hbase-0.95-on-hadoop2/0.95-on-hadoop2/hbase-server/target/surefire/surefire_1924435047656350827142tmp
Running org.apache.hadoop.hbase.rest.TestScannersWithFilters
Tests run: 10, Failures: 0, Errors: 0, Skipped: 0, Time elapsed: 11.396 sec
Forking command line: /bin/sh -c cd /x1/jenkins/jenkins-slave/workspace/hbase-0.95-on-hadoop2/0.95-on-hadoop2/hbase-server && /x1/jenkins/tools/java/jdk1.6.0_32-32/jre/bin/java -enableassertions -Xmx1900m -Djava.security.egd=file:/dev/./urandom -Djava.net.preferIPv4Stack=true -jar /x1/jenkins/jenkins-slave/workspace/hbase-0.95-on-hadoop2/0.95-on-hadoop2/hbase-server/target/surefire/surefirebooter6310353968997175838.jar /x1/jenkins/jenkins-slave/workspace/hbase-0.95-on-hadoop2/0.95-on-hadoop2/hbase-server/target/surefire/surefire8442749745928813504tmp /x1/jenkins/jenkins-slave/workspace/hbase-0.95-on-hadoop2/0.95-on-hadoop2/hbase-server/target/surefire/surefire_1932475583056912134261tmp
Running org.apache.hadoop.hbase.io.hfile.TestHFileBlockIndex
Tests run: 10, Failures: 0, Errors: 0, Skipped: 0, Time elapsed: 7.734 sec
Forking command line: /bin/sh -c cd /x1/jenkins/jenkins-slave/workspace/hbase-0.95-on-hadoop2/0.95-on-hadoop2/hbase-server && /x1/jenkins/tools/java/jdk1.6.0_32-32/jre/bin/java -enableassertions -Xmx1900m -Djava.security.egd=file:/dev/./urandom -Djava.net.preferIPv4Stack=true -jar /x1/jenkins/jenkins-slave/workspace/hbase-0.95-on-hadoop2/0.95-on-hadoop2/hbase-server/target/surefire/surefirebooter4374372920405239460.jar /x1/jenkins/jenkins-slave/workspace/hbase-0.95-on-hadoop2/0.95-on-hadoop2/hbase-server/target/surefire/surefire7033945200267675978tmp /x1/jenkins/jenkins-slave/workspace/hbase-0.95-on-hadoop2/0.95-on-hadoop2/hbase-server/target/surefire/surefire_19486212758810276510tmp
Running org.apache.hadoop.hbase.io.hfile.TestHFileSeek
Tests run: 1, Failures: 0, Errors: 0, Skipped: 0, Time elapsed: 4.724 sec
Forking command line: /bin/sh -c cd /x1/jenkins/jenkins-slave/workspace/hbase-0.95-on-hadoop2/0.95-on-hadoop2/hbase-server && /x1/jenkins/tools/java/jdk1.6.0_32-32/jre/bin/java -enableassertions -Xmx1900m -Djava.security.egd=file:/dev/./urandom -Djava.net.preferIPv4Stack=true -jar /x1/jenkins/jenkins-slave/workspace/hbase-0.95-on-hadoop2/0.95-on-hadoop2/hbase-server/target/surefire/surefirebooter2130359030477196345.jar /x1/jenkins/jenkins-slave/workspace/hbase-0.95-on-hadoop2/0.95-on-hadoop2/hbase-server/target/surefire/surefire4101586168512274169tmp /x1/jenkins/jenkins-slave/workspace/hbase-0.95-on-hadoop2/0.95-on-hadoop2/hbase-server/target/surefire/surefire_1957757509241962878492tmp
Running org.apache.hadoop.hbase.io.hfile.TestHFilePerformance
Tests run: 1, Failures: 0, Errors: 0, Skipped: 0, Time elapsed: 5.219 sec
Forking command line: /bin/sh -c cd /x1/jenkins/jenkins-slave/workspace/hbase-0.95-on-hadoop2/0.95-on-hadoop2/hbase-server && /x1/jenkins/tools/java/jdk1.6.0_32-32/jre/bin/java -enableassertions -Xmx1900m -Djava.security.egd=file:/dev/./urandom -Djava.net.preferIPv4Stack=true -jar /x1/jenkins/jenkins-slave/workspace/hbase-0.95-on-hadoop2/0.95-on-hadoop2/hbase-server/target/surefire/surefirebooter2682626847621611255.jar /x1/jenkins/jenkins-slave/workspace/hbase-0.95-on-hadoop2/0.95-on-hadoop2/hbase-server/target/surefire/surefire3874262883135520412tmp /x1/jenkins/jenkins-slave/workspace/hbase-0.95-on-hadoop2/0.95-on-hadoop2/hbase-server/target/surefire/surefire_1966173746974822673885tmp
Running org.apache.hadoop.hbase.io.hfile.TestForceCacheImportantBlocks
Tests run: 2, Failures: 0, Errors: 0, Skipped: 0, Time elapsed: 19.734 sec
Forking command line: /bin/sh -c cd /x1/jenkins/jenkins-slave/workspace/hbase-0.95-on-hadoop2/0.95-on-hadoop2/hbase-server && /x1/jenkins/tools/java/jdk1.6.0_32-32/jre/bin/java -enableassertions -Xmx1900m -Djava.security.egd=file:/dev/./urandom -Djava.net.preferIPv4Stack=true -jar /x1/jenkins/jenkins-slave/workspace/hbase-0.95-on-hadoop2/0.95-on-hadoop2/hbase-server/target/surefire/surefirebooter1231445019810016413.jar /x1/jenkins/jenkins-slave/workspace/hbase-0.95-on-hadoop2/0.95-on-hadoop2/hbase-server/target/surefire/surefire2568636145301277619tmp /x1/jenkins/jenkins-slave/workspace/hbase-0.95-on-hadoop2/0.95-on-hadoop2/hbase-server/target/surefire/surefire_1977682240023005174148tmp
Running org.apache.hadoop.hbase.io.hfile.TestCacheOnWrite
Tests run: 36, Failures: 0, Errors: 0, Skipped: 0, Time elapsed: 30.636 sec
Forking command line: /bin/sh -c cd /x1/jenkins/jenkins-slave/workspace/hbase-0.95-on-hadoop2/0.95-on-hadoop2/hbase-server && /x1/jenkins/tools/java/jdk1.6.0_32-32/jre/bin/java -enableassertions -Xmx1900m -Djava.security.egd=file:/dev/./urandom -Djava.net.preferIPv4Stack=true -jar /x1/jenkins/jenkins-slave/workspace/hbase-0.95-on-hadoop2/0.95-on-hadoop2/hbase-server/target/surefire/surefirebooter3987047022345996230.jar /x1/jenkins/jenkins-slave/workspace/hbase-0.95-on-hadoop2/0.95-on-hadoop2/hbase-server/target/surefire/surefire1534300453050936586tmp /x1/jenkins/jenkins-slave/workspace/hbase-0.95-on-hadoop2/0.95-on-hadoop2/hbase-server/target/surefire/surefire_1986469153078897858488tmp
Running org.apache.hadoop.hbase.io.hfile.slab.TestSlabCache
Tests run: 7, Failures: 0, Errors: 0, Skipped: 0, Time elapsed: 17.571 sec
Forking command line: /bin/sh -c cd /x1/jenkins/jenkins-slave/workspace/hbase-0.95-on-hadoop2/0.95-on-hadoop2/hbase-server && /x1/jenkins/tools/java/jdk1.6.0_32-32/jre/bin/java -enableassertions -Xmx1900m -Djava.security.egd=file:/dev/./urandom -Djava.net.preferIPv4Stack=true -jar /x1/jenkins/jenkins-slave/workspace/hbase-0.95-on-hadoop2/0.95-on-hadoop2/hbase-server/target/surefire/surefirebooter3170299475203504941.jar /x1/jenkins/jenkins-slave/workspace/hbase-0.95-on-hadoop2/0.95-on-hadoop2/hbase-server/target/surefire/surefire43686972218748022tmp /x1/jenkins/jenkins-slave/workspace/hbase-0.95-on-hadoop2/0.95-on-hadoop2/hbase-server/target/surefire/surefire_1991734824405769088470tmp
Running org.apache.hadoop.hbase.io.hfile.TestHFileBlock
Tests run: 14, Failures: 0, Errors: 0, Skipped: 0, Time elapsed: 48.837 sec
Forking command line: /bin/sh -c cd /x1/jenkins/jenkins-slave/workspace/hbase-0.95-on-hadoop2/0.95-on-hadoop2/hbase-server && /x1/jenkins/tools/java/jdk1.6.0_32-32/jre/bin/java -enableassertions -Xmx1900m -Djava.security.egd=file:/dev/./urandom -Djava.net.preferIPv4Stack=true -jar /x1/jenkins/jenkins-slave/workspace/hbase-0.95-on-hadoop2/0.95-on-hadoop2/hbase-server/target/surefire/surefirebooter4912254790869326821.jar /x1/jenkins/jenkins-slave/workspace/hbase-0.95-on-hadoop2/0.95-on-hadoop2/hbase-server/target/surefire/surefire8812299339169125881tmp /x1/jenkins/jenkins-slave/workspace/hbase-0.95-on-hadoop2/0.95-on-hadoop2/hbase-server/target/surefire/surefire_2006113300517436069219tmp
Running org.apache.hadoop.hbase.security.access.TestAccessController
Tests run: 37, Failures: 0, Errors: 0, Skipped: 0, Time elapsed: 157.161 sec
Forking command line: /bin/sh -c cd /x1/jenkins/jenkins-slave/workspace/hbase-0.95-on-hadoop2/0.95-on-hadoop2/hbase-server && /x1/jenkins/tools/java/jdk1.6.0_32-32/jre/bin/java -enableassertions -Xmx1900m -Djava.security.egd=file:/dev/./urandom -Djava.net.preferIPv4Stack=true -jar /x1/jenkins/jenkins-slave/workspace/hbase-0.95-on-hadoop2/0.95-on-hadoop2/hbase-server/target/surefire/surefirebooter8004137243375901864.jar /x1/jenkins/jenkins-slave/workspace/hbase-0.95-on-hadoop2/0.95-on-hadoop2/hbase-server/target/surefire/surefire6372899736419951911tmp /x1/jenkins/jenkins-slave/workspace/hbase-0.95-on-hadoop2/0.95-on-hadoop2/hbase-server/target/surefire/surefire_2013620058617403560390tmp
Running org.apache.hadoop.hbase.io.hfile.TestScannerSelectionUsingTTL
Tests run: 6, Failures: 0, Errors: 0, Skipped: 0, Time elapsed: 62.479 sec
Forking command line: /bin/sh -c cd /x1/jenkins/jenkins-slave/workspace/hbase-0.95-on-hadoop2/0.95-on-hadoop2/hbase-server && /x1/jenkins/tools/java/jdk1.6.0_32-32/jre/bin/java -enableassertions -Xmx1900m -Djava.security.egd=file:/dev/./urandom -Djava.net.preferIPv4Stack=true -jar /x1/jenkins/jenkins-slave/workspace/hbase-0.95-on-hadoop2/0.95-on-hadoop2/hbase-server/target/surefire/surefirebooter2134770042011088922.jar /x1/jenkins/jenkins-slave/workspace/hbase-0.95-on-hadoop2/0.95-on-hadoop2/hbase-server/target/surefire/surefire8606954094218165914tmp /x1/jenkins/jenkins-slave/workspace/hbase-0.95-on-hadoop2/0.95-on-hadoop2/hbase-server/target/surefire/surefire_2022531476765784296474tmp
Running org.apache.hadoop.hbase.io.hfile.slab.TestSingleSizeCache
Tests run: 5, Failures: 0, Errors: 0, Skipped: 0, Time elapsed: 27.551 sec
Forking command line: /bin/sh -c cd /x1/jenkins/jenkins-slave/workspace/hbase-0.95-on-hadoop2/0.95-on-hadoop2/hbase-server && /x1/jenkins/tools/java/jdk1.6.0_32-32/jre/bin/java -enableassertions -Xmx1900m -Djava.security.egd=file:/dev/./urandom -Djava.net.preferIPv4Stack=true -jar /x1/jenkins/jenkins-slave/workspace/hbase-0.95-on-hadoop2/0.95-on-hadoop2/hbase-server/target/surefire/surefirebooter1739966201042810455.jar /x1/jenkins/jenkins-slave/workspace/hbase-0.95-on-hadoop2/0.95-on-hadoop2/hbase-server/target/surefire/surefire1693840070279750689tmp /x1/jenkins/jenkins-slave/workspace/hbase-0.95-on-hadoop2/0.95-on-hadoop2/hbase-server/target/surefire/surefire_2034797160708707352737tmp
Running org.apache.hadoop.hbase.io.TestFileLink
Tests run: 3, Failures: 0, Errors: 0, Skipped: 0, Time elapsed: 12.825 sec
Forking command line: /bin/sh -c cd /x1/jenkins/jenkins-slave/workspace/hbase-0.95-on-hadoop2/0.95-on-hadoop2/hbase-server && /x1/jenkins/tools/java/jdk1.6.0_32-32/jre/bin/java -enableassertions -Xmx1900m -Djava.security.egd=file:/dev/./urandom -Djava.net.preferIPv4Stack=true -jar /x1/jenkins/jenkins-slave/workspace/hbase-0.95-on-hadoop2/0.95-on-hadoop2/hbase-server/target/surefire/surefirebooter5914413578661671459.jar /x1/jenkins/jenkins-slave/workspace/hbase-0.95-on-hadoop2/0.95-on-hadoop2/hbase-server/target/surefire/surefire8783378768516025962tmp /x1/jenkins/jenkins-slave/workspace/hbase-0.95-on-hadoop2/0.95-on-hadoop2/hbase-server/target/surefire/surefire_2044227794767000602800tmp
Running org.apache.hadoop.hbase.io.encoding.TestBufferedDataBlockEncoder
Tests run: 1, Failures: 0, Errors: 0, Skipped: 0, Time elapsed: 18.525 sec
Forking command line: /bin/sh -c cd /x1/jenkins/jenkins-slave/workspace/hbase-0.95-on-hadoop2/0.95-on-hadoop2/hbase-server && /x1/jenkins/tools/java/jdk1.6.0_32-32/jre/bin/java -enableassertions -Xmx1900m -Djava.security.egd=file:/dev/./urandom -Djava.net.preferIPv4Stack=true -jar /x1/jenkins/jenkins-slave/workspace/hbase-0.95-on-hadoop2/0.95-on-hadoop2/hbase-server/target/surefire/surefirebooter7129772118167081701.jar /x1/jenkins/jenkins-slave/workspace/hbase-0.95-on-hadoop2/0.95-on-hadoop2/hbase-server/target/surefire/surefire8493094216217068604tmp /x1/jenkins/jenkins-slave/workspace/hbase-0.95-on-hadoop2/0.95-on-hadoop2/hbase-server/target/surefire/surefire_2051679937598706885590tmp
Running org.apache.hadoop.hbase.io.encoding.TestEncodedSeekers
Tests run: 10, Failures: 0, Errors: 0, Skipped: 0, Time elapsed: 31.238 sec
Forking command line: /bin/sh -c cd /x1/jenkins/jenkins-slave/workspace/hbase-0.95-on-hadoop2/0.95-on-hadoop2/hbase-server && /x1/jenkins/tools/java/jdk1.6.0_32-32/jre/bin/java -enableassertions -Xmx1900m -Djava.security.egd=file:/dev/./urandom -Djava.net.preferIPv4Stack=true -jar /x1/jenkins/jenkins-slave/workspace/hbase-0.95-on-hadoop2/0.95-on-hadoop2/hbase-server/target/surefire/surefirebooter8045259545137707181.jar /x1/jenkins/jenkins-slave/workspace/hbase-0.95-on-hadoop2/0.95-on-hadoop2/hbase-server/target/surefire/surefire6583587423087006300tmp /x1/jenkins/jenkins-slave/workspace/hbase-0.95-on-hadoop2/0.95-on-hadoop2/hbase-server/target/surefire/surefire_2069071518000567468918tmp
Running org.apache.hadoop.hbase.TestRegionRebalancing
Tests run: 2, Failures: 0, Errors: 0, Skipped: 0, Time elapsed: 22.87 sec
Forking command line: /bin/sh -c cd /x1/jenkins/jenkins-slave/workspace/hbase-0.95-on-hadoop2/0.95-on-hadoop2/hbase-server && /x1/jenkins/tools/java/jdk1.6.0_32-32/jre/bin/java -enableassertions -Xmx1900m -Djava.security.egd=file:/dev/./urandom -Djava.net.preferIPv4Stack=true -jar /x1/jenkins/jenkins-slave/workspace/hbase-0.95-on-hadoop2/0.95-on-hadoop2/hbase-server/target/surefire/surefirebooter7168709042765318921.jar /x1/jenkins/jenkins-slave/workspace/hbase-0.95-on-hadoop2/0.95-on-hadoop2/hbase-server/target/surefire/surefire3842280171601044744tmp /x1/jenkins/jenkins-slave/workspace/hbase-0.95-on-hadoop2/0.95-on-hadoop2/hbase-server/target/surefire/surefire_207979992712381972150tmp
Running org.apache.hadoop.hbase.io.encoding.TestLoadAndSwitchEncodeOnDisk
Tests run: 1, Failures: 0, Errors: 0, Skipped: 0, Time elapsed: 31.194 sec
Forking command line: /bin/sh -c cd /x1/jenkins/jenkins-slave/workspace/hbase-0.95-on-hadoop2/0.95-on-hadoop2/hbase-server && /x1/jenkins/tools/java/jdk1.6.0_32-32/jre/bin/java -enableassertions -Xmx1900m -Djava.security.egd=file:/dev/./urandom -Djava.net.preferIPv4Stack=true -jar /x1/jenkins/jenkins-slave/workspace/hbase-0.95-on-hadoop2/0.95-on-hadoop2/hbase-server/target/surefire/surefirebooter4840683420426851020.jar /x1/jenkins/jenkins-slave/workspace/hbase-0.95-on-hadoop2/0.95-on-hadoop2/hbase-server/target/surefire/surefire7347183825039771455tmp /x1/jenkins/jenkins-slave/workspace/hbase-0.95-on-hadoop2/0.95-on-hadoop2/hbase-server/target/surefire/surefire_2085940932789504401183tmp
Running org.apache.hadoop.hbase.mapred.TestTableInputFormat
Tests run: 10, Failures: 0, Errors: 0, Skipped: 0, Time elapsed: 18.198 sec
Forking command line: /bin/sh -c cd /x1/jenkins/jenkins-slave/workspace/hbase-0.95-on-hadoop2/0.95-on-hadoop2/hbase-server && /x1/jenkins/tools/java/jdk1.6.0_32-32/jre/bin/java -enableassertions -Xmx1900m -Djava.security.egd=file:/dev/./urandom -Djava.net.preferIPv4Stack=true -jar /x1/jenkins/jenkins-slave/workspace/hbase-0.95-on-hadoop2/0.95-on-hadoop2/hbase-server/target/surefire/surefirebooter4333450371393967025.jar /x1/jenkins/jenkins-slave/workspace/hbase-0.95-on-hadoop2/0.95-on-hadoop2/hbase-server/target/surefire/surefire1220633628874233664tmp /x1/jenkins/jenkins-slave/workspace/hbase-0.95-on-hadoop2/0.95-on-hadoop2/hbase-server/target/surefire/surefire_2094755147047907771224tmp
Running org.apache.hadoop.hbase.mapred.TestTableMapReduce
Tests run: 1, Failures: 0, Errors: 0, Skipped: 0, Time elapsed: 35.968 sec
Forking command line: /bin/sh -c cd /x1/jenkins/jenkins-slave/workspace/hbase-0.95-on-hadoop2/0.95-on-hadoop2/hbase-server && /x1/jenkins/tools/java/jdk1.6.0_32-32/jre/bin/java -enableassertions -Xmx1900m -Djava.security.egd=file:/dev/./urandom -Djava.net.preferIPv4Stack=true -jar /x1/jenkins/jenkins-slave/workspace/hbase-0.95-on-hadoop2/0.95-on-hadoop2/hbase-server/target/surefire/surefirebooter4389328735187198569.jar /x1/jenkins/jenkins-slave/workspace/hbase-0.95-on-hadoop2/0.95-on-hadoop2/hbase-server/target/surefire/surefire2980599601555168916tmp /x1/jenkins/jenkins-slave/workspace/hbase-0.95-on-hadoop2/0.95-on-hadoop2/hbase-server/target/surefire/surefire_2106280054617836114853tmp
Running org.apache.hadoop.hbase.io.encoding.TestDataBlockEncoders
Tests run: 12, Failures: 0, Errors: 0, Skipped: 0, Time elapsed: 89.509 sec
Forking command line: /bin/sh -c cd /x1/jenkins/jenkins-slave/workspace/hbase-0.95-on-hadoop2/0.95-on-hadoop2/hbase-server && /x1/jenkins/tools/java/jdk1.6.0_32-32/jre/bin/java -enableassertions -Xmx1900m -Djava.security.egd=file:/dev/./urandom -Djava.net.preferIPv4Stack=true -jar /x1/jenkins/jenkins-slave/workspace/hbase-0.95-on-hadoop2/0.95-on-hadoop2/hbase-server/target/surefire/surefirebooter1034928244457763823.jar /x1/jenkins/jenkins-slave/workspace/hbase-0.95-on-hadoop2/0.95-on-hadoop2/hbase-server/target/surefire/surefire2784052388954477896tmp /x1/jenkins/jenkins-slave/workspace/hbase-0.95-on-hadoop2/0.95-on-hadoop2/hbase-server/target/surefire/surefire_2112844067127459378563tmp
Running org.apache.hadoop.hbase.replication.TestReplicationDisableInactivePeer
Tests run: 1, Failures: 0, Errors: 0, Skipped: 0, Time elapsed: 30.559 sec
Forking command line: /bin/sh -c cd /x1/jenkins/jenkins-slave/workspace/hbase-0.95-on-hadoop2/0.95-on-hadoop2/hbase-server && /x1/jenkins/tools/java/jdk1.6.0_32-32/jre/bin/java -enableassertions -Xmx1900m -Djava.security.egd=file:/dev/./urandom -Djava.net.preferIPv4Stack=true -jar /x1/jenkins/jenkins-slave/workspace/hbase-0.95-on-hadoop2/0.95-on-hadoop2/hbase-server/target/surefire/surefirebooter8762322735054761236.jar /x1/jenkins/jenkins-slave/workspace/hbase-0.95-on-hadoop2/0.95-on-hadoop2/hbase-server/target/surefire/surefire5221378022017292665tmp /x1/jenkins/jenkins-slave/workspace/hbase-0.95-on-hadoop2/0.95-on-hadoop2/hbase-server/target/surefire/surefire_2124100412711475786816tmp
Running org.apache.hadoop.hbase.replication.TestReplicationZookeeper
Tests run: 4, Failures: 0, Errors: 0, Skipped: 0, Time elapsed: 0.891 sec
Forking command line: /bin/sh -c cd /x1/jenkins/jenkins-slave/workspace/hbase-0.95-on-hadoop2/0.95-on-hadoop2/hbase-server && /x1/jenkins/tools/java/jdk1.6.0_32-32/jre/bin/java -enableassertions -Xmx1900m -Djava.security.egd=file:/dev/./urandom -Djava.net.preferIPv4Stack=true -jar /x1/jenkins/jenkins-slave/workspace/hbase-0.95-on-hadoop2/0.95-on-hadoop2/hbase-server/target/surefire/surefirebooter5814429833586049402.jar /x1/jenkins/jenkins-slave/workspace/hbase-0.95-on-hadoop2/0.95-on-hadoop2/hbase-server/target/surefire/surefire4786109595078777839tmp /x1/jenkins/jenkins-slave/workspace/hbase-0.95-on-hadoop2/0.95-on-hadoop2/hbase-server/target/surefire/surefire_2131874518153103798771tmp
Running org.apache.hadoop.hbase.replication.regionserver.TestReplicationSink
Tests run: 5, Failures: 0, Errors: 0, Skipped: 0, Time elapsed: 11.072 sec
Forking command line: /bin/sh -c cd /x1/jenkins/jenkins-slave/workspace/hbase-0.95-on-hadoop2/0.95-on-hadoop2/hbase-server && /x1/jenkins/tools/java/jdk1.6.0_32-32/jre/bin/java -enableassertions -Xmx1900m -Djava.security.egd=file:/dev/./urandom -Djava.net.preferIPv4Stack=true -jar /x1/jenkins/jenkins-slave/workspace/hbase-0.95-on-hadoop2/0.95-on-hadoop2/hbase-server/target/surefire/surefirebooter2383768751101228901.jar /x1/jenkins/jenkins-slave/workspace/hbase-0.95-on-hadoop2/0.95-on-hadoop2/hbase-server/target/surefire/surefire5864672440161603167tmp /x1/jenkins/jenkins-slave/workspace/hbase-0.95-on-hadoop2/0.95-on-hadoop2/hbase-server/target/surefire/surefire_2145211601398984325571tmp
Running org.apache.hadoop.hbase.replication.regionserver.TestReplicationSourceManager
Tests run: 3, Failures: 0, Errors: 0, Skipped: 0, Time elapsed: 1.317 sec
Forking command line: /bin/sh -c cd /x1/jenkins/jenkins-slave/workspace/hbase-0.95-on-hadoop2/0.95-on-hadoop2/hbase-server && /x1/jenkins/tools/java/jdk1.6.0_32-32/jre/bin/java -enableassertions -Xmx1900m -Djava.security.egd=file:/dev/./urandom -Djava.net.preferIPv4Stack=true -jar /x1/jenkins/jenkins-slave/workspace/hbase-0.95-on-hadoop2/0.95-on-hadoop2/hbase-server/target/surefire/surefirebooter2586484082084718222.jar /x1/jenkins/jenkins-slave/workspace/hbase-0.95-on-hadoop2/0.95-on-hadoop2/hbase-server/target/surefire/surefire2694296434877076670tmp /x1/jenkins/jenkins-slave/workspace/hbase-0.95-on-hadoop2/0.95-on-hadoop2/hbase-server/target/surefire/surefire_2157118841388886559912tmp
Running org.apache.hadoop.hbase.replication.TestReplicationSource
Tests run: 1, Failures: 0, Errors: 0, Skipped: 0, Time elapsed: 2.772 sec
Forking command line: /bin/sh -c cd /x1/jenkins/jenkins-slave/workspace/hbase-0.95-on-hadoop2/0.95-on-hadoop2/hbase-server && /x1/jenkins/tools/java/jdk1.6.0_32-32/jre/bin/java -enableassertions -Xmx1900m -Djava.security.egd=file:/dev/./urandom -Djava.net.preferIPv4Stack=true -jar /x1/jenkins/jenkins-slave/workspace/hbase-0.95-on-hadoop2/0.95-on-hadoop2/hbase-server/target/surefire/surefirebooter8405261640497029550.jar /x1/jenkins/jenkins-slave/workspace/hbase-0.95-on-hadoop2/0.95-on-hadoop2/hbase-server/target/surefire/surefire4769725645580804034tmp /x1/jenkins/jenkins-slave/workspace/hbase-0.95-on-hadoop2/0.95-on-hadoop2/hbase-server/target/surefire/surefire_216121250570960293824tmp
Forking command line: /bin/sh -c cd /x1/jenkins/jenkins-slave/workspace/hbase-0.95-on-hadoop2/0.95-on-hadoop2/hbase-server && /x1/jenkins/tools/java/jdk1.6.0_32-32/jre/bin/java -enableassertions -Xmx1900m -Djava.security.egd=file:/dev/./urandom -Djava.net.preferIPv4Stack=true -jar /x1/jenkins/jenkins-slave/workspace/hbase-0.95-on-hadoop2/0.95-on-hadoop2/hbase-server/target/surefire/surefirebooter7993799031228398532.jar /x1/jenkins/jenkins-slave/workspace/hbase-0.95-on-hadoop2/0.95-on-hadoop2/hbase-server/target/surefire/surefire8081476004542718333tmp /x1/jenkins/jenkins-slave/workspace/hbase-0.95-on-hadoop2/0.95-on-hadoop2/hbase-server/target/surefire/surefire_2171113297744368645453tmp
Running org.apache.hadoop.hbase.replication.TestMultiSlaveReplication
Tests run: 1, Failures: 0, Errors: 0, Skipped: 0, Time elapsed: 22.608 sec
Forking command line: /bin/sh -c cd /x1/jenkins/jenkins-slave/workspace/hbase-0.95-on-hadoop2/0.95-on-hadoop2/hbase-server && /x1/jenkins/tools/java/jdk1.6.0_32-32/jre/bin/java -enableassertions -Xmx1900m -Djava.security.egd=file:/dev/./urandom -Djava.net.preferIPv4Stack=true -jar /x1/jenkins/jenkins-slave/workspace/hbase-0.95-on-hadoop2/0.95-on-hadoop2/hbase-server/target/surefire/surefirebooter1759144652077054348.jar /x1/jenkins/jenkins-slave/workspace/hbase-0.95-on-hadoop2/0.95-on-hadoop2/hbase-server/target/surefire/surefire6049564099727620733tmp /x1/jenkins/jenkins-slave/workspace/hbase-0.95-on-hadoop2/0.95-on-hadoop2/hbase-server/target/surefire/surefire_2185554210911617073014tmp
Running org.apache.hadoop.hbase.io.encoding.TestChangingEncoding
Tests run: 4, Failures: 0, Errors: 0, Skipped: 0, Time elapsed: 154.314 sec
Forking command line: /bin/sh -c cd /x1/jenkins/jenkins-slave/workspace/hbase-0.95-on-hadoop2/0.95-on-hadoop2/hbase-server && /x1/jenkins/tools/java/jdk1.6.0_32-32/jre/bin/java -enableassertions -Xmx1900m -Djava.security.egd=file:/dev/./urandom -Djava.net.preferIPv4Stack=true -jar /x1/jenkins/jenkins-slave/workspace/hbase-0.95-on-hadoop2/0.95-on-hadoop2/hbase-server/target/surefire/surefirebooter8985651079004781970.jar /x1/jenkins/jenkins-slave/workspace/hbase-0.95-on-hadoop2/0.95-on-hadoop2/hbase-server/target/surefire/surefire5895548838891665741tmp /x1/jenkins/jenkins-slave/workspace/hbase-0.95-on-hadoop2/0.95-on-hadoop2/hbase-server/target/surefire/surefire_2198158042715939823404tmp
Running org.apache.hadoop.hbase.util.TestMergeTool
Tests run: 1, Failures: 0, Errors: 0, Skipped: 0, Time elapsed: 11.681 sec
Forking command line: /bin/sh -c cd /x1/jenkins/jenkins-slave/workspace/hbase-0.95-on-hadoop2/0.95-on-hadoop2/hbase-server && /x1/jenkins/tools/java/jdk1.6.0_32-32/jre/bin/java -enableassertions -Xmx1900m -Djava.security.egd=file:/dev/./urandom -Djava.net.preferIPv4Stack=true -jar /x1/jenkins/jenkins-slave/workspace/hbase-0.95-on-hadoop2/0.95-on-hadoop2/hbase-server/target/surefire/surefirebooter148859914486100220.jar /x1/jenkins/jenkins-slave/workspace/hbase-0.95-on-hadoop2/0.95-on-hadoop2/hbase-server/target/surefire/surefire9045631289245454838tmp /x1/jenkins/jenkins-slave/workspace/hbase-0.95-on-hadoop2/0.95-on-hadoop2/hbase-server/target/surefire/surefire_2203252831110714746919tmp
Running org.apache.hadoop.hbase.util.TestFSTableDescriptors
Tests run: 12, Failures: 0, Errors: 0, Skipped: 0, Time elapsed: 1.019 sec
Forking command line: /bin/sh -c cd /x1/jenkins/jenkins-slave/workspace/hbase-0.95-on-hadoop2/0.95-on-hadoop2/hbase-server && /x1/jenkins/tools/java/jdk1.6.0_32-32/jre/bin/java -enableassertions -Xmx1900m -Djava.security.egd=file:/dev/./urandom -Djava.net.preferIPv4Stack=true -jar /x1/jenkins/jenkins-slave/workspace/hbase-0.95-on-hadoop2/0.95-on-hadoop2/hbase-server/target/surefire/surefirebooter5147015995863383366.jar /x1/jenkins/jenkins-slave/workspace/hbase-0.95-on-hadoop2/0.95-on-hadoop2/hbase-server/target/surefire/surefire7987086886529792533tmp /x1/jenkins/jenkins-slave/workspace/hbase-0.95-on-hadoop2/0.95-on-hadoop2/hbase-server/target/surefire/surefire_2213774855115023587119tmp
Running org.apache.hadoop.hbase.replication.TestMasterReplication
Tests run: 2, Failures: 0, Errors: 0, Skipped: 0, Time elapsed: 33.304 sec
Forking command line: /bin/sh -c cd /x1/jenkins/jenkins-slave/workspace/hbase-0.95-on-hadoop2/0.95-on-hadoop2/hbase-server && /x1/jenkins/tools/java/jdk1.6.0_32-32/jre/bin/java -enableassertions -Xmx1900m -Djava.security.egd=file:/dev/./urandom -Djava.net.preferIPv4Stack=true -jar /x1/jenkins/jenkins-slave/workspace/hbase-0.95-on-hadoop2/0.95-on-hadoop2/hbase-server/target/surefire/surefirebooter2184576562392581382.jar /x1/jenkins/jenkins-slave/workspace/hbase-0.95-on-hadoop2/0.95-on-hadoop2/hbase-server/target/surefire/surefire7651575311111533131tmp /x1/jenkins/jenkins-slave/workspace/hbase-0.95-on-hadoop2/0.95-on-hadoop2/hbase-server/target/surefire/surefire_2223539345598141327604tmp
Running org.apache.hadoop.hbase.util.TestIdLock
Tests run: 1, Failures: 0, Errors: 0, Skipped: 0, Time elapsed: 15.258 sec
Forking command line: /bin/sh -c cd /x1/jenkins/jenkins-slave/workspace/hbase-0.95-on-hadoop2/0.95-on-hadoop2/hbase-server && /x1/jenkins/tools/java/jdk1.6.0_32-32/jre/bin/java -enableassertions -Xmx1900m -Djava.security.egd=file:/dev/./urandom -Djava.net.preferIPv4Stack=true -jar /x1/jenkins/jenkins-slave/workspace/hbase-0.95-on-hadoop2/0.95-on-hadoop2/hbase-server/target/surefire/surefirebooter620560664704013043.jar /x1/jenkins/jenkins-slave/workspace/hbase-0.95-on-hadoop2/0.95-on-hadoop2/hbase-server/target/surefire/surefire7111259786370378113tmp /x1/jenkins/jenkins-slave/workspace/hbase-0.95-on-hadoop2/0.95-on-hadoop2/hbase-server/target/surefire/surefire_2238366170445927888672tmp
Running org.apache.hadoop.hbase.replication.TestReplicationQueueFailoverCompressed
Tests run: 1, Failures: 0, Errors: 0, Skipped: 0, Time elapsed: 88.009 sec
Forking command line: /bin/sh -c cd /x1/jenkins/jenkins-slave/workspace/hbase-0.95-on-hadoop2/0.95-on-hadoop2/hbase-server && /x1/jenkins/tools/java/jdk1.6.0_32-32/jre/bin/java -enableassertions -Xmx1900m -Djava.security.egd=file:/dev/./urandom -Djava.net.preferIPv4Stack=true -jar /x1/jenkins/jenkins-slave/workspace/hbase-0.95-on-hadoop2/0.95-on-hadoop2/hbase-server/target/surefire/surefirebooter4678378239226260194.jar /x1/jenkins/jenkins-slave/workspace/hbase-0.95-on-hadoop2/0.95-on-hadoop2/hbase-server/target/surefire/surefire3882160568154952775tmp /x1/jenkins/jenkins-slave/workspace/hbase-0.95-on-hadoop2/0.95-on-hadoop2/hbase-server/target/surefire/surefire_2243785778197851690455tmp
Running org.apache.hadoop.hbase.util.TestMergeTable
Tests run: 1, Failures: 0, Errors: 0, Skipped: 0, Time elapsed: 12.925 sec
Forking command line: /bin/sh -c cd /x1/jenkins/jenkins-slave/workspace/hbase-0.95-on-hadoop2/0.95-on-hadoop2/hbase-server && /x1/jenkins/tools/java/jdk1.6.0_32-32/jre/bin/java -enableassertions -Xmx1900m -Djava.security.egd=file:/dev/./urandom -Djava.net.preferIPv4Stack=true -jar /x1/jenkins/jenkins-slave/workspace/hbase-0.95-on-hadoop2/0.95-on-hadoop2/hbase-server/target/surefire/surefirebooter4622278486804743904.jar /x1/jenkins/jenkins-slave/workspace/hbase-0.95-on-hadoop2/0.95-on-hadoop2/hbase-server/target/surefire/surefire6655423382931642684tmp /x1/jenkins/jenkins-slave/workspace/hbase-0.95-on-hadoop2/0.95-on-hadoop2/hbase-server/target/surefire/surefire_2252466430696967583669tmp
Running org.apache.hadoop.hbase.replication.TestReplicationSmallTests
Tests run: 8, Failures: 0, Errors: 0, Skipped: 0, Time elapsed: 76.8 sec
Forking command line: /bin/sh -c cd /x1/jenkins/jenkins-slave/workspace/hbase-0.95-on-hadoop2/0.95-on-hadoop2/hbase-server && /x1/jenkins/tools/java/jdk1.6.0_32-32/jre/bin/java -enableassertions -Xmx1900m -Djava.security.egd=file:/dev/./urandom -Djava.net.preferIPv4Stack=true -jar /x1/jenkins/jenkins-slave/workspace/hbase-0.95-on-hadoop2/0.95-on-hadoop2/hbase-server/target/surefire/surefirebooter8137933321304840943.jar /x1/jenkins/jenkins-slave/workspace/hbase-0.95-on-hadoop2/0.95-on-hadoop2/hbase-server/target/surefire/surefire68518510535534740tmp /x1/jenkins/jenkins-slave/workspace/hbase-0.95-on-hadoop2/0.95-on-hadoop2/hbase-server/target/surefire/surefire_2267607848863072852757tmp
Running org.apache.hadoop.hbase.replication.TestReplicationQueueFailover
Tests run: 1, Failures: 0, Errors: 0, Skipped: 0, Time elapsed: 106.1 sec
Forking command line: /bin/sh -c cd /x1/jenkins/jenkins-slave/workspace/hbase-0.95-on-hadoop2/0.95-on-hadoop2/hbase-server && /x1/jenkins/tools/java/jdk1.6.0_32-32/jre/bin/java -enableassertions -Xmx1900m -Djava.security.egd=file:/dev/./urandom -Djava.net.preferIPv4Stack=true -jar /x1/jenkins/jenkins-slave/workspace/hbase-0.95-on-hadoop2/0.95-on-hadoop2/hbase-server/target/surefire/surefirebooter7586026827269448945.jar /x1/jenkins/jenkins-slave/workspace/hbase-0.95-on-hadoop2/0.95-on-hadoop2/hbase-server/target/surefire/surefire3877818765192000486tmp /x1/jenkins/jenkins-slave/workspace/hbase-0.95-on-hadoop2/0.95-on-hadoop2/hbase-server/target/surefire/surefire_2274725962588525217472tmp
Running org.apache.hadoop.hbase.util.TestFSUtils
Tests run: 6, Failures: 0, Errors: 0, Skipped: 0, Time elapsed: 7.203 sec
Forking command line: /bin/sh -c cd /x1/jenkins/jenkins-slave/workspace/hbase-0.95-on-hadoop2/0.95-on-hadoop2/hbase-server && /x1/jenkins/tools/java/jdk1.6.0_32-32/jre/bin/java -enableassertions -Xmx1900m -Djava.security.egd=file:/dev/./urandom -Djava.net.preferIPv4Stack=true -jar /x1/jenkins/jenkins-slave/workspace/hbase-0.95-on-hadoop2/0.95-on-hadoop2/hbase-server/target/surefire/surefirebooter3293932553939914235.jar /x1/jenkins/jenkins-slave/workspace/hbase-0.95-on-hadoop2/0.95-on-hadoop2/hbase-server/target/surefire/surefire1488065639886820843tmp /x1/jenkins/jenkins-slave/workspace/hbase-0.95-on-hadoop2/0.95-on-hadoop2/hbase-server/target/surefire/surefire_2283618029005157163068tmp
Running org.apache.hadoop.hbase.util.TestProcessBasedCluster
Tests run: 1, Failures: 0, Errors: 0, Skipped: 0, Time elapsed: 0.332 sec
Forking command line: /bin/sh -c cd /x1/jenkins/jenkins-slave/workspace/hbase-0.95-on-hadoop2/0.95-on-hadoop2/hbase-server && /x1/jenkins/tools/java/jdk1.6.0_32-32/jre/bin/java -enableassertions -Xmx1900m -Djava.security.egd=file:/dev/./urandom -Djava.net.preferIPv4Stack=true -jar /x1/jenkins/jenkins-slave/workspace/hbase-0.95-on-hadoop2/0.95-on-hadoop2/hbase-server/target/surefire/surefirebooter764300807105288968.jar /x1/jenkins/jenkins-slave/workspace/hbase-0.95-on-hadoop2/0.95-on-hadoop2/hbase-server/target/surefire/surefire816978265335293344tmp /x1/jenkins/jenkins-slave/workspace/hbase-0.95-on-hadoop2/0.95-on-hadoop2/hbase-server/target/surefire/surefire_2297682667663365896014tmp
Running org.apache.hadoop.hbase.util.TestRegionSplitter
Tests run: 5, Failures: 0, Errors: 0, Skipped: 0, Time elapsed: 8.855 sec
Forking command line: /bin/sh -c cd /x1/jenkins/jenkins-slave/workspace/hbase-0.95-on-hadoop2/0.95-on-hadoop2/hbase-server && /x1/jenkins/tools/java/jdk1.6.0_32-32/jre/bin/java -enableassertions -Xmx1900m -Djava.security.egd=file:/dev/./urandom -Djava.net.preferIPv4Stack=true -jar /x1/jenkins/jenkins-slave/workspace/hbase-0.95-on-hadoop2/0.95-on-hadoop2/hbase-server/target/surefire/surefirebooter3364386951629631188.jar /x1/jenkins/jenkins-slave/workspace/hbase-0.95-on-hadoop2/0.95-on-hadoop2/hbase-server/target/surefire/surefire7113299365552027598tmp /x1/jenkins/jenkins-slave/workspace/hbase-0.95-on-hadoop2/0.95-on-hadoop2/hbase-server/target/surefire/surefire_2304090005938878133883tmp
Running org.apache.hadoop.hbase.util.TestCoprocessorScanPolicy
Tests run: 4, Failures: 0, Errors: 0, Skipped: 0, Time elapsed: 14.823 sec
Forking command line: /bin/sh -c cd /x1/jenkins/jenkins-slave/workspace/hbase-0.95-on-hadoop2/0.95-on-hadoop2/hbase-server && /x1/jenkins/tools/java/jdk1.6.0_32-32/jre/bin/java -enableassertions -Xmx1900m -Djava.security.egd=file:/dev/./urandom -Djava.net.preferIPv4Stack=true -jar /x1/jenkins/jenkins-slave/workspace/hbase-0.95-on-hadoop2/0.95-on-hadoop2/hbase-server/target/surefire/surefirebooter1675730701917597397.jar /x1/jenkins/jenkins-slave/workspace/hbase-0.95-on-hadoop2/0.95-on-hadoop2/hbase-server/target/surefire/surefire4199679994155859359tmp /x1/jenkins/jenkins-slave/workspace/hbase-0.95-on-hadoop2/0.95-on-hadoop2/hbase-server/target/surefire/surefire_231289410250678737535tmp
Running org.apache.hadoop.hbase.util.TestFSVisitor
Tests run: 3, Failures: 0, Errors: 0, Skipped: 0, Time elapsed: 2.704 sec
Forking command line: /bin/sh -c cd /x1/jenkins/jenkins-slave/workspace/hbase-0.95-on-hadoop2/0.95-on-hadoop2/hbase-server && /x1/jenkins/tools/java/jdk1.6.0_32-32/jre/bin/java -enableassertions -Xmx1900m -Djava.security.egd=file:/dev/./urandom -Djava.net.preferIPv4Stack=true -jar /x1/jenkins/jenkins-slave/workspace/hbase-0.95-on-hadoop2/0.95-on-hadoop2/hbase-server/target/surefire/surefirebooter8786829684590331468.jar /x1/jenkins/jenkins-slave/workspace/hbase-0.95-on-hadoop2/0.95-on-hadoop2/hbase-server/target/surefire/surefire1876408988996836206tmp /x1/jenkins/jenkins-slave/workspace/hbase-0.95-on-hadoop2/0.95-on-hadoop2/hbase-server/target/surefire/surefire_232119125913223881087tmp
Running org.apache.hadoop.hbase.util.hbck.TestOfflineMetaRebuildBase
Tests run: 1, Failures: 0, Errors: 0, Skipped: 0, Time elapsed: 16.125 sec
Forking command line: /bin/sh -c cd /x1/jenkins/jenkins-slave/workspace/hbase-0.95-on-hadoop2/0.95-on-hadoop2/hbase-server && /x1/jenkins/tools/java/jdk1.6.0_32-32/jre/bin/java -enableassertions -Xmx1900m -Djava.security.egd=file:/dev/./urandom -Djava.net.preferIPv4Stack=true -jar /x1/jenkins/jenkins-slave/workspace/hbase-0.95-on-hadoop2/0.95-on-hadoop2/hbase-server/target/surefire/surefirebooter8126230270533027948.jar /x1/jenkins/jenkins-slave/workspace/hbase-0.95-on-hadoop2/0.95-on-hadoop2/hbase-server/target/surefire/surefire8900660970455072111tmp /x1/jenkins/jenkins-slave/workspace/hbase-0.95-on-hadoop2/0.95-on-hadoop2/hbase-server/target/surefire/surefire_2337514243772758854948tmp
Running org.apache.hadoop.hbase.util.hbck.TestOfflineMetaRebuildOverlap
Tests run: 1, Failures: 0, Errors: 0, Skipped: 0, Time elapsed: 16.786 sec
Forking command line: /bin/sh -c cd /x1/jenkins/jenkins-slave/workspace/hbase-0.95-on-hadoop2/0.95-on-hadoop2/hbase-server && /x1/jenkins/tools/java/jdk1.6.0_32-32/jre/bin/java -enableassertions -Xmx1900m -Djava.security.egd=file:/dev/./urandom -Djava.net.preferIPv4Stack=true -jar /x1/jenkins/jenkins-slave/workspace/hbase-0.95-on-hadoop2/0.95-on-hadoop2/hbase-server/target/surefire/surefirebooter4429981347390608639.jar /x1/jenkins/jenkins-slave/workspace/hbase-0.95-on-hadoop2/0.95-on-hadoop2/hbase-server/target/surefire/surefire7113380656538552320tmp /x1/jenkins/jenkins-slave/workspace/hbase-0.95-on-hadoop2/0.95-on-hadoop2/hbase-server/target/surefire/surefire_2347496979227015078944tmp
Running org.apache.hadoop.hbase.util.hbck.TestOfflineMetaRebuildHole
Tests run: 1, Failures: 0, Errors: 0, Skipped: 0, Time elapsed: 16 sec
Forking command line: /bin/sh -c cd /x1/jenkins/jenkins-slave/workspace/hbase-0.95-on-hadoop2/0.95-on-hadoop2/hbase-server && /x1/jenkins/tools/java/jdk1.6.0_32-32/jre/bin/java -enableassertions -Xmx1900m -Djava.security.egd=file:/dev/./urandom -Djava.net.preferIPv4Stack=true -jar /x1/jenkins/jenkins-slave/workspace/hbase-0.95-on-hadoop2/0.95-on-hadoop2/hbase-server/target/surefire/surefirebooter3400030452761981664.jar /x1/jenkins/jenkins-slave/workspace/hbase-0.95-on-hadoop2/0.95-on-hadoop2/hbase-server/target/surefire/surefire2452632515029299287tmp /x1/jenkins/jenkins-slave/workspace/hbase-0.95-on-hadoop2/0.95-on-hadoop2/hbase-server/target/surefire/surefire_2358324776232954179443tmp
Running org.apache.hadoop.hbase.util.TestDefaultEnvironmentEdge
Tests run: 1, Failures: 0, Errors: 0, Skipped: 0, Time elapsed: 0.179 sec
Forking command line: /bin/sh -c cd /x1/jenkins/jenkins-slave/workspace/hbase-0.95-on-hadoop2/0.95-on-hadoop2/hbase-server && /x1/jenkins/tools/java/jdk1.6.0_32-32/jre/bin/java -enableassertions -Xmx1900m -Djava.security.egd=file:/dev/./urandom -Djava.net.preferIPv4Stack=true -jar /x1/jenkins/jenkins-slave/workspace/hbase-0.95-on-hadoop2/0.95-on-hadoop2/hbase-server/target/surefire/surefirebooter544439523087129487.jar /x1/jenkins/jenkins-slave/workspace/hbase-0.95-on-hadoop2/0.95-on-hadoop2/hbase-server/target/surefire/surefire7864214939734352671tmp /x1/jenkins/jenkins-slave/workspace/hbase-0.95-on-hadoop2/0.95-on-hadoop2/hbase-server/target/surefire/surefire_2369187974720847490419tmp
Running org.apache.hadoop.hbase.TestInfoServers
Tests run: 3, Failures: 0, Errors: 0, Skipped: 0, Time elapsed: 9.276 sec
Running org.apache.hadoop.hbase.util.TestMiniClusterLoadEncoded
Tests run: 5, Failures: 0, Errors: 0, Skipped: 0, Time elapsed: 86.351 sec
Running org.apache.hadoop.hbase.util.TestHBaseFsck
Tests run: 35, Failures: 0, Errors: 0, Skipped: 1, Time elapsed: 208.982 sec
Running org.apache.hadoop.hbase.util.TestMiniClusterLoadParallel
Tests run: 4, Failures: 0, Errors: 2, Skipped: 0, Time elapsed: 449.993 sec <<< FAILURE!
Running org.apache.hadoop.hbase.util.TestMiniClusterLoadSequential
Tests run: 4, Failures: 0, Errors: 2, Skipped: 0, Time elapsed: 470.964 sec <<< FAILURE!

Results :

Failed tests:   testMetaExport(org.apache.hadoop.hbase.mapreduce.TestImportExport)
  testBulkOutputWithoutAnExistingTable(org.apache.hadoop.hbase.mapreduce.TestImportTsv): expected:<0> but was:<1>
  testMRIncrementalLoadWithSplit(org.apache.hadoop.hbase.mapreduce.TestHFileOutputFormat)
  testThreeRSAbort(org.apache.hadoop.hbase.master.TestDistributedLogSplitting): Timedout

Tests in error: 
  testExportScannerBatching(org.apache.hadoop.hbase.mapreduce.TestImportExport)
  testWithFilter(org.apache.hadoop.hbase.mapreduce.TestImportExport)
  testRecoveredEdits(org.apache.hadoop.hbase.master.TestDistributedLogSplitting): test timed out after 300000 milliseconds
  testAppendClose(org.apache.hadoop.hbase.regionserver.wal.TestHLog): Failed to open hdfs://localhost:53181/user/jenkins/hbase/TestHLog/hlogdirtrue/hlog.1364856858088 for append
  testJoinedScanners(org.apache.hadoop.hbase.regionserver.TestJoinedScanners): Failed 4 actions: ConnectException: 4 times, 
  testCorrectnessWhenMasterFailOver(org.apache.hadoop.hbase.regionserver.TestRSKilledWhenMasterInitializing): test timed out after 120000 milliseconds
  loadTest[0](org.apache.hadoop.hbase.util.TestMiniClusterLoadParallel): test timed out after 180000 milliseconds
  loadTest[1](org.apache.hadoop.hbase.util.TestMiniClusterLoadParallel): test timed out after 180000 milliseconds
  loadTest[0](org.apache.hadoop.hbase.util.TestMiniClusterLoadSequential): test timed out after 180000 milliseconds
  loadTest[1](org.apache.hadoop.hbase.util.TestMiniClusterLoadSequential): test timed out after 180000 milliseconds

Tests run: 1444, Failures: 4, Errors: 10, Skipped: 13

[INFO]                                                                         
[INFO] ------------------------------------------------------------------------
[INFO] Skipping HBase
[INFO] This project has been banned from the build due to previous failures.
[INFO] ------------------------------------------------------------------------
[INFO] ------------------------------------------------------------------------
[INFO] Reactor Summary:
[INFO] 
[INFO] HBase ............................................. SUCCESS [5.379s]
[INFO] HBase - Common .................................... SUCCESS [17.621s]
[INFO] HBase - Protocol .................................. SUCCESS [12.352s]
[INFO] HBase - Client .................................... SUCCESS [7.868s]
[INFO] HBase - Prefix Tree ............................... SUCCESS [2.619s]
[INFO] HBase - Hadoop Compatibility ...................... SUCCESS [0.482s]
[INFO] HBase - Hadoop Two Compatibility .................. SUCCESS [2.278s]
[INFO] HBase - Server .................................... FAILURE [43:05.546s]
[INFO] HBase - Integration Tests ......................... SKIPPED
[INFO] HBase - Examples .................................. SKIPPED
[INFO] HBase - Assembly .................................. SKIPPED
[INFO] ------------------------------------------------------------------------
[INFO] BUILD FAILURE
[INFO] ------------------------------------------------------------------------
[INFO] Total time: 43:57.035s
[INFO] Finished at: Mon Apr 01 23:19:10 UTC 2013
[INFO] Final Memory: 113M/1113M
[INFO] ------------------------------------------------------------------------
[ERROR] Failed to execute goal org.apache.maven.plugins:maven-surefire-plugin:2.12-TRUNK-HBASE-2:test (secondPartTestsExecution) on project hbase-server: Failure or timeout -> [Help 1]
org.apache.maven.lifecycle.LifecycleExecutionException: Failed to execute goal org.apache.maven.plugins:maven-surefire-plugin:2.12-TRUNK-HBASE-2:test (secondPartTestsExecution) on project hbase-server: Failure or timeout
	at org.apache.maven.lifecycle.internal.MojoExecutor.execute(MojoExecutor.java:217)
	at org.apache.maven.lifecycle.internal.MojoExecutor.execute(MojoExecutor.java:153)
	at org.apache.maven.lifecycle.internal.MojoExecutor.execute(MojoExecutor.java:145)
	at org.apache.maven.lifecycle.internal.LifecycleModuleBuilder.buildProject(LifecycleModuleBuilder.java:84)
	at org.apache.maven.lifecycle.internal.LifecycleModuleBuilder.buildProject(LifecycleModuleBuilder.java:59)
	at org.apache.maven.lifecycle.internal.LifecycleStarter.singleThreadedBuild(LifecycleStarter.java:183)
	at org.apache.maven.lifecycle.internal.LifecycleStarter.execute(LifecycleStarter.java:161)
	at org.apache.maven.DefaultMaven.doExecute(DefaultMaven.java:320)
	at org.apache.maven.DefaultMaven.execute(DefaultMaven.java:156)
	at org.apache.maven.cli.MavenCli.execute(MavenCli.java:537)
	at org.apache.maven.cli.MavenCli.doMain(MavenCli.java:196)
	at org.apache.maven.cli.MavenCli.main(MavenCli.java:141)
	at sun.reflect.NativeMethodAccessorImpl.invoke0(Native Method)
	at sun.reflect.NativeMethodAccessorImpl.invoke(NativeMethodAccessorImpl.java:39)
	at sun.reflect.DelegatingMethodAccessorImpl.invoke(DelegatingMethodAccessorImpl.java:25)
	at java.lang.reflect.Method.invoke(Method.java:597)
	at org.codehaus.plexus.classworlds.launcher.Launcher.launchEnhanced(Launcher.java:290)
	at org.codehaus.plexus.classworlds.launcher.Launcher.launch(Launcher.java:230)
	at org.codehaus.plexus.classworlds.launcher.Launcher.mainWithExitCode(Launcher.java:409)
	at org.codehaus.plexus.classworlds.launcher.Launcher.main(Launcher.java:352)
Caused by: org.apache.maven.plugin.MojoExecutionException: Failure or timeout
	at org.apache.maven.plugin.surefire.SurefirePlugin.assertNoFailureOrTimeout(SurefirePlugin.java:643)
	at org.apache.maven.plugin.surefire.SurefirePlugin.handleSummary(SurefirePlugin.java:624)
	at org.apache.maven.plugin.surefire.AbstractSurefireMojo.executeAfterPreconditionsChecked(AbstractSurefireMojo.java:137)
	at org.apache.maven.plugin.surefire.AbstractSurefireMojo.execute(AbstractSurefireMojo.java:98)
	at org.apache.maven.plugin.DefaultBuildPluginManager.executeMojo(DefaultBuildPluginManager.java:101)
	at org.apache.maven.lifecycle.internal.MojoExecutor.execute(MojoExecutor.java:209)
	... 19 more
[ERROR] 
[ERROR] 
[ERROR] For more information about the errors and possible solutions, please read the following articles:
[ERROR] [Help 1] http://cwiki.apache.org/confluence/display/MAVEN/MojoExecutionException
[ERROR] 
[ERROR] After correcting the problems, you can resume the build with the command
[ERROR]   mvn <goals> -rf :hbase-server
Build step 'Invoke top-level Maven targets' marked build as failure
Archiving artifacts
Recording test results

Mime
View raw message