hbase-dev mailing list archives

Site index · List index
Message view « Date » · « Thread »
Top « Date » · « Thread »
From Apache Jenkins Server <jenk...@builds.apache.org>
Subject Build failed in Jenkins: HBase-TRUNK-on-Hadoop-2.0.0 #511
Date Fri, 26 Apr 2013 13:22:14 GMT
See <https://builds.apache.org/job/HBase-TRUNK-on-Hadoop-2.0.0/511/changes>

Changes:

[stack] HBASE-8271 Book updates for changes to GC options in shell scripts

[stack] HBASE-8444 Acknowledge that 0.95+ requires 1.0.3 hadoop at least

[jxiang] HBASE-8345 Add all available resources in RootResource and VersionResource to rest
RemoteAdmin (Aleksandr Shulman)

[tedyu] HBASE-8393 Testcase TestHeapSize#testMutations is wrong (Jeffrey)

[eclark] HBASE-8392 TestMetricMBeanBase#testGetAttribute is flakey under hadoop2 profile

[stack] HBASE-8428 Tighten up IntegrationTestsDriver filter

[ddas] HBASE-5930. Removed a configuration that was causing unnecessary flushes in tests.

[stack] HBASE-8422 Master won't go down. Stuck waiting on .META. to come on line

[eclark] HBASE-5930 Limits the amount of time an edit can live in the memstore.

[eclark] HBASE-8299 ExploringCompactionPolicy can get stuck in rare cases.

[enis] HBASE-8415 DisabledRegionSplitPolicy

[ddas] HBASE-5930. Limits the amount of time an edit can live in the memstore.

[sershe] HBASE-8024 Make Store flush algorithm pluggable

[anoopsamjohn] Changing organization name

------------------------------------------
[...truncated 3766 lines...]
Tests run: 8, Failures: 0, Errors: 0, Skipped: 0, Time elapsed: 161.255 sec
Running org.apache.hadoop.hbase.regionserver.TestAtomicOperation
Tests run: 6, Failures: 0, Errors: 0, Skipped: 0, Time elapsed: 28.674 sec
Running org.apache.hadoop.hbase.regionserver.TestHRegionBusyWait
Tests run: 63, Failures: 0, Errors: 0, Skipped: 0, Time elapsed: 48.844 sec
Running org.apache.hadoop.hbase.regionserver.TestRegionServerNoMaster
Tests run: 7, Failures: 0, Errors: 0, Skipped: 0, Time elapsed: 23.518 sec
Running org.apache.hadoop.hbase.regionserver.TestFSErrorsExposed
Tests run: 3, Failures: 0, Errors: 0, Skipped: 1, Time elapsed: 0.959 sec
Running org.apache.hadoop.hbase.regionserver.TestHRegionOnCluster
Tests run: 1, Failures: 0, Errors: 0, Skipped: 0, Time elapsed: 22.027 sec
Running org.apache.hadoop.hbase.regionserver.TestServerCustomProtocol
Tests run: 7, Failures: 0, Errors: 0, Skipped: 0, Time elapsed: 33.623 sec
Running org.apache.hadoop.hbase.regionserver.TestParallelPut
Tests run: 2, Failures: 0, Errors: 0, Skipped: 0, Time elapsed: 3.603 sec
Running org.apache.hadoop.hbase.regionserver.TestCompoundBloomFilter
Tests run: 3, Failures: 0, Errors: 0, Skipped: 0, Time elapsed: 19.418 sec
Running org.apache.hadoop.hbase.regionserver.TestPriorityRpc
Tests run: 3, Failures: 0, Errors: 0, Skipped: 0, Time elapsed: 1.349 sec
Running org.apache.hadoop.hbase.regionserver.TestSeekOptimizations
Tests run: 6, Failures: 0, Errors: 0, Skipped: 0, Time elapsed: 3.345 sec
Running org.apache.hadoop.hbase.regionserver.handler.TestCloseRegionHandler
Tests run: 3, Failures: 0, Errors: 0, Skipped: 0, Time elapsed: 1.543 sec
Running org.apache.hadoop.hbase.regionserver.handler.TestOpenRegionHandler
Tests run: 5, Failures: 0, Errors: 0, Skipped: 0, Time elapsed: 1.7 sec
Running org.apache.hadoop.hbase.regionserver.TestBlocksRead
Tests run: 4, Failures: 0, Errors: 0, Skipped: 0, Time elapsed: 1.78 sec
Running org.apache.hadoop.hbase.regionserver.TestSplitLogWorker
Tests run: 5, Failures: 0, Errors: 0, Skipped: 0, Time elapsed: 2.982 sec
Running org.apache.hadoop.hbase.regionserver.TestStoreScanner
Tests run: 16, Failures: 0, Errors: 0, Skipped: 0, Time elapsed: 0.696 sec
Running org.apache.hadoop.hbase.regionserver.TestCompaction
Tests run: 17, Failures: 0, Errors: 0, Skipped: 0, Time elapsed: 36.2 sec
Running org.apache.hadoop.hbase.regionserver.TestStoreFileBlockCacheSummary
Tests run: 1, Failures: 0, Errors: 0, Skipped: 0, Time elapsed: 9.33 sec
Running org.apache.hadoop.hbase.regionserver.TestHRegionServerBulkLoad
Tests run: 1, Failures: 0, Errors: 0, Skipped: 0, Time elapsed: 38.187 sec
Running org.apache.hadoop.hbase.regionserver.TestClusterId
Tests run: 1, Failures: 0, Errors: 0, Skipped: 0, Time elapsed: 24.374 sec
Running org.apache.hadoop.hbase.regionserver.TestRegionMergeTransactionOnCluster
Tests run: 2, Failures: 0, Errors: 0, Skipped: 0, Time elapsed: 25.162 sec
Running org.apache.hadoop.hbase.regionserver.TestEndToEndSplitTransaction
Tests run: 2, Failures: 0, Errors: 0, Skipped: 0, Time elapsed: 26.074 sec
Running org.apache.hadoop.hbase.regionserver.TestMultiColumnScanner
Tests run: 12, Failures: 0, Errors: 0, Skipped: 0, Time elapsed: 41.001 sec
Running org.apache.hadoop.hbase.regionserver.TestMasterAddressManager
Tests run: 1, Failures: 0, Errors: 0, Skipped: 0, Time elapsed: 0.732 sec
Running org.apache.hadoop.hbase.backup.TestHFileArchiving
Tests run: 5, Failures: 0, Errors: 2, Skipped: 0, Time elapsed: 174.47 sec <<< FAILURE!
Running org.apache.hadoop.hbase.backup.example.TestZooKeeperTableArchiveClient
Tests run: 3, Failures: 0, Errors: 0, Skipped: 0, Time elapsed: 5.753 sec
Running org.apache.hadoop.hbase.TestLocalHBaseCluster
Tests run: 1, Failures: 0, Errors: 0, Skipped: 0, Time elapsed: 6.588 sec
Running org.apache.hadoop.hbase.security.token.TestTokenAuthentication
Tests run: 2, Failures: 0, Errors: 0, Skipped: 0, Time elapsed: 1.447 sec
Running org.apache.hadoop.hbase.security.token.TestZKSecretWatcher
Tests run: 1, Failures: 0, Errors: 0, Skipped: 0, Time elapsed: 15.434 sec
Running org.apache.hadoop.hbase.security.access.TestAccessControlFilter
Tests run: 1, Failures: 0, Errors: 0, Skipped: 0, Time elapsed: 9.916 sec
Running org.apache.hadoop.hbase.security.access.TestZKPermissionsWatcher
Tests run: 1, Failures: 0, Errors: 0, Skipped: 0, Time elapsed: 7.428 sec
Running org.apache.hadoop.hbase.security.access.TestTablePermissions
Tests run: 7, Failures: 0, Errors: 0, Skipped: 0, Time elapsed: 23.32 sec
Running org.apache.hadoop.hbase.security.access.TestAccessController
Tests run: 37, Failures: 0, Errors: 0, Skipped: 0, Time elapsed: 147.082 sec
Running org.apache.hadoop.hbase.ipc.TestDelayedRpc
Tests run: 4, Failures: 0, Errors: 0, Skipped: 0, Time elapsed: 3.026 sec
Running org.apache.hadoop.hbase.ipc.TestHBaseClient
Tests run: 1, Failures: 0, Errors: 0, Skipped: 0, Time elapsed: 0.291 sec
Running org.apache.hadoop.hbase.TestFullLogReconstruction
Tests run: 1, Failures: 0, Errors: 0, Skipped: 0, Time elapsed: 26.562 sec
Running org.apache.hadoop.hbase.ipc.TestProtoBufRpc
Tests run: 1, Failures: 0, Errors: 0, Skipped: 0, Time elapsed: 1.25 sec
Running org.apache.hadoop.hbase.TestGlobalMemStoreSize
Tests run: 1, Failures: 0, Errors: 0, Skipped: 0, Time elapsed: 9.471 sec
Running org.apache.hadoop.hbase.constraint.TestConstraint
Tests run: 5, Failures: 0, Errors: 0, Skipped: 0, Time elapsed: 22.861 sec
Running org.apache.hadoop.hbase.rest.TestSchemaResource
Tests run: 2, Failures: 0, Errors: 0, Skipped: 0, Time elapsed: 14.866 sec
Running org.apache.hadoop.hbase.rest.client.TestRemoteTable
Tests run: 4, Failures: 0, Errors: 0, Skipped: 0, Time elapsed: 10.335 sec
Running org.apache.hadoop.hbase.rest.client.TestRemoteAdmin
Tests run: 5, Failures: 0, Errors: 0, Skipped: 0, Time elapsed: 12.839 sec
Running org.apache.hadoop.hbase.rest.TestMultiRowResource
Tests run: 3, Failures: 0, Errors: 0, Skipped: 0, Time elapsed: 10.27 sec
Running org.apache.hadoop.hbase.rest.TestTableResource
Tests run: 8, Failures: 0, Errors: 0, Skipped: 0, Time elapsed: 19.759 sec
Running org.apache.hadoop.hbase.rest.TestGzipFilter
Tests run: 2, Failures: 0, Errors: 0, Skipped: 0, Time elapsed: 9.594 sec
Running org.apache.hadoop.hbase.rest.TestRowResource
Tests run: 12, Failures: 0, Errors: 0, Skipped: 0, Time elapsed: 11.893 sec
Running org.apache.hadoop.hbase.rest.TestVersionResource
Tests run: 7, Failures: 0, Errors: 0, Skipped: 0, Time elapsed: 8.874 sec
Running org.apache.hadoop.hbase.rest.TestScannerResource
Tests run: 5, Failures: 0, Errors: 0, Skipped: 0, Time elapsed: 22.433 sec
Running org.apache.hadoop.hbase.rest.TestStatusResource
Tests run: 2, Failures: 0, Errors: 0, Skipped: 0, Time elapsed: 8.688 sec
Running org.apache.hadoop.hbase.rest.TestScannersWithFilters
Tests run: 10, Failures: 0, Errors: 0, Skipped: 0, Time elapsed: 13.154 sec
Running org.apache.hadoop.hbase.trace.TestHTraceHooks
Tests run: 1, Failures: 0, Errors: 0, Skipped: 0, Time elapsed: 9.072 sec
Running org.apache.hadoop.hbase.io.hfile.TestHFileSeek
Tests run: 1, Failures: 0, Errors: 0, Skipped: 0, Time elapsed: 5.108 sec
Running org.apache.hadoop.hbase.io.hfile.TestHFileBlockIndex
Tests run: 10, Failures: 0, Errors: 0, Skipped: 0, Time elapsed: 8.182 sec
Running org.apache.hadoop.hbase.io.hfile.TestHFilePerformance
Tests run: 1, Failures: 0, Errors: 0, Skipped: 0, Time elapsed: 4.555 sec
Running org.apache.hadoop.hbase.io.hfile.TestForceCacheImportantBlocks
Tests run: 2, Failures: 0, Errors: 0, Skipped: 0, Time elapsed: 19.108 sec
Running org.apache.hadoop.hbase.io.hfile.TestCacheOnWrite
Tests run: 36, Failures: 0, Errors: 0, Skipped: 0, Time elapsed: 27.82 sec
Running org.apache.hadoop.hbase.io.hfile.TestScannerSelectionUsingTTL
Tests run: 6, Failures: 0, Errors: 0, Skipped: 0, Time elapsed: 62.403 sec
Running org.apache.hadoop.hbase.io.hfile.TestHFileBlock
Tests run: 14, Failures: 0, Errors: 0, Skipped: 0, Time elapsed: 49.199 sec
Running org.apache.hadoop.hbase.io.hfile.slab.TestSlabCache
Tests run: 7, Failures: 0, Errors: 0, Skipped: 0, Time elapsed: 24.201 sec
Running org.apache.hadoop.hbase.io.hfile.slab.TestSingleSizeCache
Tests run: 5, Failures: 0, Errors: 0, Skipped: 0, Time elapsed: 25.801 sec
Running org.apache.hadoop.hbase.io.TestFileLink
Tests run: 3, Failures: 0, Errors: 0, Skipped: 0, Time elapsed: 12.799 sec
Running org.apache.hadoop.hbase.io.encoding.TestEncodedSeekers
Tests run: 10, Failures: 0, Errors: 0, Skipped: 0, Time elapsed: 32.423 sec
Running org.apache.hadoop.hbase.io.encoding.TestDataBlockEncoders
Tests run: 12, Failures: 0, Errors: 0, Skipped: 0, Time elapsed: 85.421 sec
Running org.apache.hadoop.hbase.io.encoding.TestBufferedDataBlockEncoder
Tests run: 1, Failures: 0, Errors: 0, Skipped: 0, Time elapsed: 18.555 sec
Running org.apache.hadoop.hbase.io.encoding.TestChangingEncoding
Tests run: 4, Failures: 0, Errors: 0, Skipped: 0, Time elapsed: 154.921 sec
Running org.apache.hadoop.hbase.io.encoding.TestLoadAndSwitchEncodeOnDisk
Tests run: 1, Failures: 0, Errors: 0, Skipped: 0, Time elapsed: 32.747 sec
Running org.apache.hadoop.hbase.mapred.TestTableInputFormat
Tests run: 10, Failures: 0, Errors: 0, Skipped: 0, Time elapsed: 17.979 sec
Running org.apache.hadoop.hbase.TestRegionRebalancing
Tests run: 2, Failures: 0, Errors: 0, Skipped: 0, Time elapsed: 24.014 sec
Running org.apache.hadoop.hbase.replication.TestReplicationDisableInactivePeer
Tests run: 1, Failures: 0, Errors: 0, Skipped: 0, Time elapsed: 32.09 sec
Running org.apache.hadoop.hbase.mapred.TestTableMapReduce
Tests run: 1, Failures: 0, Errors: 0, Skipped: 0, Time elapsed: 40.468 sec
Running org.apache.hadoop.hbase.replication.TestReplicationQueueFailoverCompressed
Tests run: 1, Failures: 0, Errors: 0, Skipped: 0, Time elapsed: 91.166 sec
Running org.apache.hadoop.hbase.replication.TestReplicationZookeeper
Tests run: 4, Failures: 0, Errors: 0, Skipped: 0, Time elapsed: 0.825 sec
Running org.apache.hadoop.hbase.replication.regionserver.TestReplicationSink
Tests run: 5, Failures: 0, Errors: 0, Skipped: 0, Time elapsed: 10.284 sec
Running org.apache.hadoop.hbase.replication.regionserver.TestReplicationSourceManager
Tests run: 3, Failures: 0, Errors: 0, Skipped: 0, Time elapsed: 1.523 sec
Running org.apache.hadoop.hbase.replication.TestReplicationSource
Tests run: 1, Failures: 0, Errors: 0, Skipped: 0, Time elapsed: 2.914 sec
Running org.apache.hadoop.hbase.replication.TestReplicationQueueFailover
Tests run: 1, Failures: 0, Errors: 0, Skipped: 0, Time elapsed: 106.555 sec
Running org.apache.hadoop.hbase.replication.TestReplicationStateZKImpl
Tests run: 2, Failures: 0, Errors: 0, Skipped: 0, Time elapsed: 1.088 sec
Running org.apache.hadoop.hbase.replication.TestMultiSlaveReplication
Tests run: 1, Failures: 0, Errors: 0, Skipped: 0, Time elapsed: 23.696 sec
Running org.apache.hadoop.hbase.replication.TestMasterReplication
Tests run: 2, Failures: 0, Errors: 0, Skipped: 0, Time elapsed: 37.172 sec
Running org.apache.hadoop.hbase.util.TestMergeTool
Tests run: 1, Failures: 0, Errors: 0, Skipped: 0, Time elapsed: 12.572 sec
Running org.apache.hadoop.hbase.util.TestFSTableDescriptors
Tests run: 12, Failures: 0, Errors: 0, Skipped: 0, Time elapsed: 1.378 sec
Running org.apache.hadoop.hbase.replication.TestReplicationSmallTests
Tests run: 8, Failures: 0, Errors: 0, Skipped: 0, Time elapsed: 76.163 sec
Running org.apache.hadoop.hbase.util.TestIdLock
Tests run: 1, Failures: 0, Errors: 0, Skipped: 0, Time elapsed: 15.33 sec
Running org.apache.hadoop.hbase.util.TestMergeTable
Tests run: 1, Failures: 0, Errors: 0, Skipped: 0, Time elapsed: 12.809 sec
Running org.apache.hadoop.hbase.util.TestMiniClusterLoadSequential
Tests run: 4, Failures: 0, Errors: 0, Skipped: 0, Time elapsed: 104.475 sec
Running org.apache.hadoop.hbase.util.TestMiniClusterLoadParallel
Tests run: 4, Failures: 0, Errors: 0, Skipped: 0, Time elapsed: 92.915 sec
Running org.apache.hadoop.hbase.util.TestFSUtils
Tests run: 6, Failures: 0, Errors: 0, Skipped: 0, Time elapsed: 7.38 sec
Running org.apache.hadoop.hbase.util.TestRegionSplitter
Tests run: 5, Failures: 0, Errors: 0, Skipped: 0, Time elapsed: 8.106 sec
Running org.apache.hadoop.hbase.util.TestProcessBasedCluster
Tests run: 1, Failures: 0, Errors: 0, Skipped: 0, Time elapsed: 0.371 sec
Running org.apache.hadoop.hbase.util.TestMiniClusterLoadEncoded
Tests run: 5, Failures: 0, Errors: 0, Skipped: 0, Time elapsed: 53.046 sec
Running org.apache.hadoop.hbase.util.TestCoprocessorScanPolicy
Tests run: 4, Failures: 0, Errors: 0, Skipped: 0, Time elapsed: 15.056 sec
Running org.apache.hadoop.hbase.util.TestFSVisitor
Tests run: 3, Failures: 0, Errors: 0, Skipped: 0, Time elapsed: 3.02 sec
Running org.apache.hadoop.hbase.util.hbck.TestOfflineMetaRebuildBase
Tests run: 1, Failures: 0, Errors: 0, Skipped: 0, Time elapsed: 18.682 sec
Running org.apache.hadoop.hbase.util.hbck.TestOfflineMetaRebuildOverlap
Tests run: 1, Failures: 0, Errors: 0, Skipped: 0, Time elapsed: 17.999 sec
Running org.apache.hadoop.hbase.util.hbck.TestOfflineMetaRebuildHole
Tests run: 1, Failures: 0, Errors: 0, Skipped: 0, Time elapsed: 17.122 sec
Running org.apache.hadoop.hbase.util.TestDefaultEnvironmentEdge
Tests run: 1, Failures: 0, Errors: 0, Skipped: 0, Time elapsed: 0.247 sec
Running org.apache.hadoop.hbase.TestInfoServers
Tests run: 3, Failures: 0, Errors: 0, Skipped: 0, Time elapsed: 9.085 sec
Running org.apache.hadoop.hbase.util.TestHBaseFsck
Tests run: 36, Failures: 0, Errors: 0, Skipped: 1, Time elapsed: 211.844 sec

Results :

Tests in error: 
  testRemovesRegionDirOnArchive(org.apache.hadoop.hbase.backup.TestHFileArchiving): region
is flushing
  testArchiveOnTableFamilyDelete(org.apache.hadoop.hbase.backup.TestHFileArchiving): region
is flushing

Tests run: 1432, Failures: 0, Errors: 2, Skipped: 14

[INFO] ------------------------------------------------------------------------
[INFO] Reactor Summary:
[INFO] 
[INFO] HBase ............................................. SUCCESS [2.458s]
[INFO] HBase - Common .................................... SUCCESS [19.552s]
[INFO] HBase - Protocol .................................. SUCCESS [12.511s]
[INFO] HBase - Client .................................... SUCCESS [7.767s]
[INFO] HBase - Prefix Tree ............................... SUCCESS [3.005s]
[INFO] HBase - Hadoop Compatibility ...................... SUCCESS [0.799s]
[INFO] HBase - Hadoop Two Compatibility .................. SUCCESS [2.976s]
[INFO] HBase - Server .................................... FAILURE [1:32:52.099s]
[INFO] HBase - Integration Tests ......................... SKIPPED
[INFO] HBase - Examples .................................. SKIPPED
[INFO] HBase - Assembly .................................. SKIPPED
[INFO] ------------------------------------------------------------------------
[INFO] BUILD FAILURE
[INFO] ------------------------------------------------------------------------
[INFO] Total time: 1:33:41.694s
[INFO] Finished at: Fri Apr 26 13:21:45 UTC 2013
[INFO] Final Memory: 97M/914M
[INFO] ------------------------------------------------------------------------
[ERROR] Failed to execute goal org.apache.maven.plugins:maven-surefire-plugin:2.12-TRUNK-HBASE-2:test
(secondPartTestsExecution) on project hbase-server: Failure or timeout -> [Help 1]
[ERROR] 
[ERROR] To see the full stack trace of the errors, re-run Maven with the -e switch.
[ERROR] Re-run Maven using the -X switch to enable full debug logging.
[ERROR] 
[ERROR] For more information about the errors and possible solutions, please read the following
articles:
[ERROR] [Help 1] http://cwiki.apache.org/confluence/display/MAVEN/MojoExecutionException
[ERROR] 
[ERROR] After correcting the problems, you can resume the build with the command
[ERROR]   mvn <goals> -rf :hbase-server
Build step 'Invoke top-level Maven targets' marked build as failure
Archiving artifacts
Recording test results
Updating HBASE-8024
Updating HBASE-8392
Updating HBASE-8393
Updating HBASE-8444
Updating HBASE-8422
Updating HBASE-8345
Updating HBASE-8415
Updating HBASE-8299
Updating HBASE-8428
Updating HBASE-5930
Updating HBASE-8271

Mime
View raw message