hbase-dev mailing list archives

Site index · List index
Message view « Date » · « Thread »
Top « Date » · « Thread »
From apurt...@apache.org
Subject Build failed in Jenkins: HBase-0.95 #200
Date Mon, 29 Apr 2013 20:14:56 GMT
See <http://54.241.6.143/job/HBase-0.95/200/changes>

Changes:

[eclark] HBASE-8407 Remove Async HBase

[eclark] HBASE-8426 Opening a region failed on Metrics source RegionServer,sub=Regions already
exists

------------------------------------------
[...truncated 6913 lines...]
Running org.apache.hadoop.hbase.rest.TestSchemaResource
Tests run: 2, Failures: 0, Errors: 0, Skipped: 0, Time elapsed: 26.561 sec
Running org.apache.hadoop.hbase.rest.TestScannersWithFilters
Tests run: 10, Failures: 0, Errors: 0, Skipped: 0, Time elapsed: 26.443 sec
Running org.apache.hadoop.hbase.rest.TestTableResource
Tests run: 8, Failures: 0, Errors: 0, Skipped: 0, Time elapsed: 37.505 sec
Running org.apache.hadoop.hbase.rest.TestStatusResource
Tests run: 2, Failures: 0, Errors: 0, Skipped: 0, Time elapsed: 16.352 sec
Running org.apache.hadoop.hbase.rest.TestMultiRowResource
Tests run: 3, Failures: 0, Errors: 0, Skipped: 0, Time elapsed: 19.079 sec
Running org.apache.hadoop.hbase.zookeeper.TestZKMulti
Tests run: 6, Failures: 0, Errors: 0, Skipped: 0, Time elapsed: 1.756 sec
Running org.apache.hadoop.hbase.zookeeper.TestRecoverableZooKeeper
Tests run: 1, Failures: 0, Errors: 0, Skipped: 0, Time elapsed: 3.454 sec
Running org.apache.hadoop.hbase.trace.TestHTraceHooks
Tests run: 1, Failures: 0, Errors: 0, Skipped: 0, Time elapsed: 15.341 sec
Running org.apache.hadoop.hbase.zookeeper.TestHQuorumPeer
Tests run: 3, Failures: 0, Errors: 0, Skipped: 0, Time elapsed: 0.981 sec
Running org.apache.hadoop.hbase.zookeeper.TestZooKeeperACL
Tests run: 5, Failures: 0, Errors: 0, Skipped: 0, Time elapsed: 7.566 sec
Running org.apache.hadoop.hbase.zookeeper.TestZKTable
Tests run: 1, Failures: 0, Errors: 0, Skipped: 0, Time elapsed: 1.072 sec
Running org.apache.hadoop.hbase.zookeeper.TestZooKeeperNodeTracker
Tests run: 3, Failures: 0, Errors: 0, Skipped: 0, Time elapsed: 1.548 sec
Running org.apache.hadoop.hbase.TestClusterBootOrder
Tests run: 2, Failures: 0, Errors: 0, Skipped: 0, Time elapsed: 28.849 sec
Running org.apache.hadoop.hbase.TestZooKeeper
Tests run: 9, Failures: 0, Errors: 0, Skipped: 0, Time elapsed: 26.88 sec
Running org.apache.hadoop.hbase.zookeeper.TestZKLeaderManager
Tests run: 1, Failures: 1, Errors: 0, Skipped: 0, Time elapsed: 11.621 sec <<< FAILURE!
Running org.apache.hadoop.hbase.zookeeper.lock.TestZKInterProcessReadWriteLock
Tests run: 6, Failures: 0, Errors: 0, Skipped: 0, Time elapsed: 26.253 sec
Running org.apache.hadoop.hbase.TestHBaseTestingUtility
Tests run: 7, Failures: 0, Errors: 0, Skipped: 0, Time elapsed: 53.488 sec
Running org.apache.hadoop.hbase.master.TestOpenedRegionHandler
Tests run: 2, Failures: 0, Errors: 0, Skipped: 0, Time elapsed: 12.903 sec
Running org.apache.hadoop.hbase.master.TestMasterFailover
Tests run: 4, Failures: 0, Errors: 0, Skipped: 0, Time elapsed: 57.202 sec
Running org.apache.hadoop.hbase.master.TestAssignmentManager
Tests run: 15, Failures: 0, Errors: 0, Skipped: 0, Time elapsed: 4.005 sec
Running org.apache.hadoop.hbase.master.handler.TestCreateTableHandler
Tests run: 2, Failures: 0, Errors: 0, Skipped: 0, Time elapsed: 23.528 sec
Running org.apache.hadoop.hbase.master.TestDistributedLogSplitting
Running org.apache.hadoop.hbase.TestAcidGuarantees
Tests run: 3, Failures: 0, Errors: 0, Skipped: 0, Time elapsed: 92.321 sec
Tests run: 4, Failures: 0, Errors: 0, Skipped: 0, Time elapsed: 84.543 sec
Running org.apache.hadoop.hbase.master.balancer.TestBaseLoadBalancer
Tests run: 3, Failures: 0, Errors: 0, Skipped: 0, Time elapsed: 1.052 sec
Running org.apache.hadoop.hbase.master.balancer.TestDefaultLoadBalancer
Tests run: 1, Failures: 0, Errors: 0, Skipped: 0, Time elapsed: 2.779 sec
Running org.apache.hadoop.hbase.master.snapshot.TestSnapshotFileCache
Tests run: 4, Failures: 0, Errors: 0, Skipped: 0, Time elapsed: 3.714 sec
Running org.apache.hadoop.hbase.master.handler.TestTableDeleteFamilyHandler
Tests run: 1, Failures: 0, Errors: 0, Skipped: 0, Time elapsed: 39.23 sec
Running org.apache.hadoop.hbase.master.handler.TestTableDescriptorModification
Tests run: 3, Failures: 0, Errors: 0, Skipped: 0, Time elapsed: 22.158 sec
Running org.apache.hadoop.hbase.master.TestSplitLogManager
Tests run: 13, Failures: 0, Errors: 0, Skipped: 0, Time elapsed: 84.644 sec
Running org.apache.hadoop.hbase.master.cleaner.TestHFileCleaner
Tests run: 3, Failures: 0, Errors: 0, Skipped: 0, Time elapsed: 4.895 sec
Running org.apache.hadoop.hbase.master.cleaner.TestLogsCleaner
Tests run: 1, Failures: 0, Errors: 0, Skipped: 0, Time elapsed: 11.926 sec
Running org.apache.hadoop.hbase.master.balancer.TestStochasticLoadBalancer
Tests run: 9, Failures: 0, Errors: 0, Skipped: 1, Time elapsed: 47.857 sec
Running org.apache.hadoop.hbase.master.TestRollingRestart
Tests run: 1, Failures: 0, Errors: 0, Skipped: 0, Time elapsed: 38.294 sec
Running org.apache.hadoop.hbase.master.cleaner.TestSnapshotFromMaster
Tests run: 4, Failures: 0, Errors: 0, Skipped: 0, Time elapsed: 33.284 sec
Running org.apache.hadoop.hbase.master.TestMasterMetricsWrapper
Tests run: 1, Failures: 0, Errors: 0, Skipped: 0, Time elapsed: 15.602 sec
Running org.apache.hadoop.hbase.master.TestMasterTransitions
Tests run: 3, Failures: 0, Errors: 0, Skipped: 3, Time elapsed: 17.618 sec
Running org.apache.hadoop.hbase.master.TestClusterStatusPublisher
Tests run: 3, Failures: 0, Errors: 0, Skipped: 0, Time elapsed: 0.416 sec
Running org.apache.hadoop.hbase.master.TestMasterFileSystem
Tests run: 1, Failures: 0, Errors: 0, Skipped: 0, Time elapsed: 10.806 sec
Running org.apache.hadoop.hbase.master.TestHMasterRPCException
Tests run: 1, Failures: 0, Errors: 0, Skipped: 0, Time elapsed: 2.344 sec
Running org.apache.hadoop.hbase.master.TestMasterRestartAfterDisablingTable
Tests run: 1, Failures: 0, Errors: 0, Skipped: 0, Time elapsed: 17.356 sec
Running org.apache.hadoop.hbase.master.TestDeadServer
Tests run: 3, Failures: 0, Errors: 0, Skipped: 0, Time elapsed: 0.754 sec
Running org.apache.hadoop.hbase.master.TestMasterStatusServlet
Tests run: 4, Failures: 0, Errors: 0, Skipped: 0, Time elapsed: 2.396 sec
Running org.apache.hadoop.hbase.master.TestActiveMasterManager
Tests run: 2, Failures: 0, Errors: 0, Skipped: 0, Time elapsed: 2.378 sec
Running org.apache.hadoop.hbase.master.TestMasterFailoverBalancerPersistence
Tests run: 1, Failures: 0, Errors: 0, Skipped: 0, Time elapsed: 14.667 sec
Running org.apache.hadoop.hbase.master.TestMasterMetrics
Tests run: 2, Failures: 0, Errors: 0, Skipped: 0, Time elapsed: 24.655 sec
Running org.apache.hadoop.hbase.master.TestAssignmentManagerOnCluster
Tests run: 7, Failures: 0, Errors: 0, Skipped: 0, Time elapsed: 38.74 sec
Running org.apache.hadoop.hbase.master.TestMaster
Tests run: 4, Failures: 0, Errors: 0, Skipped: 0, Time elapsed: 23.087 sec
Running org.apache.hadoop.hbase.master.TestRestartCluster
Tests run: 2, Failures: 0, Errors: 0, Skipped: 0, Time elapsed: 35.198 sec
Running org.apache.hadoop.hbase.master.TestMasterNoCluster
Tests run: 3, Failures: 0, Errors: 0, Skipped: 0, Time elapsed: 6.39 sec
Running org.apache.hadoop.hbase.master.TestZKBasedOpenCloseRegion
Tests run: 4, Failures: 0, Errors: 0, Skipped: 0, Time elapsed: 18.676 sec
Running org.apache.hadoop.hbase.master.TestMasterShutdown
Tests run: 2, Failures: 0, Errors: 0, Skipped: 0, Time elapsed: 25.38 sec
Running org.apache.hadoop.hbase.TestLocalHBaseCluster
Tests run: 1, Failures: 0, Errors: 0, Skipped: 0, Time elapsed: 17.155 sec
Running org.apache.hadoop.hbase.backup.example.TestZooKeeperTableArchiveClient
Tests run: 3, Failures: 0, Errors: 0, Skipped: 0, Time elapsed: 6.87 sec
Running org.apache.hadoop.hbase.security.token.TestZKSecretWatcher
Tests run: 1, Failures: 0, Errors: 0, Skipped: 0, Time elapsed: 16.185 sec
Running org.apache.hadoop.hbase.security.token.TestTokenAuthentication
Tests run: 2, Failures: 0, Errors: 0, Skipped: 0, Time elapsed: 2.022 sec
Running org.apache.hadoop.hbase.security.access.TestZKPermissionsWatcher
Tests run: 1, Failures: 0, Errors: 0, Skipped: 0, Time elapsed: 9.757 sec
Running org.apache.hadoop.hbase.thrift.TestThriftServerCmdLine
Tests run: 32, Failures: 0, Errors: 0, Skipped: 0, Time elapsed: 65.823 sec
Running org.apache.hadoop.hbase.security.access.TestTablePermissions
Tests run: 7, Failures: 0, Errors: 0, Skipped: 0, Time elapsed: 25.717 sec
Running org.apache.hadoop.hbase.security.access.TestAccessControlFilter
Tests run: 1, Failures: 0, Errors: 0, Skipped: 0, Time elapsed: 15.024 sec
Running org.apache.hadoop.hbase.thrift.TestThriftServer
Tests run: 1, Failures: 0, Errors: 0, Skipped: 0, Time elapsed: 87.587 sec
Running org.apache.hadoop.hbase.master.TestTableLockManager
Tests run: 5, Failures: 0, Errors: 0, Skipped: 0, Time elapsed: 111.248 sec
Running org.apache.hadoop.hbase.TestMultiVersions
Tests run: 3, Failures: 0, Errors: 0, Skipped: 0, Time elapsed: 17.78 sec
Running org.apache.hadoop.hbase.backup.TestHFileArchiving
Tests run: 5, Failures: 0, Errors: 0, Skipped: 0, Time elapsed: 166.438 sec
Running org.apache.hadoop.hbase.security.access.TestAccessController
Tests run: 37, Failures: 0, Errors: 0, Skipped: 0, Time elapsed: 155.44 sec

Results :

Failed tests:   testLeaderSelection(org.apache.hadoop.hbase.zookeeper.TestZKLeaderManager):
New leader should exist

Tests run: 1506, Failures: 1, Errors: 0, Skipped: 14

[JENKINS] Recording test results
[INFO]                                                                         
[INFO] ------------------------------------------------------------------------
[INFO] Skipping HBase
[INFO] This project has been banned from the build due to previous failures.
[INFO] ------------------------------------------------------------------------
[INFO]                                                                         
[INFO] ------------------------------------------------------------------------
[INFO] Skipping HBase
[INFO] This project has been banned from the build due to previous failures.
[INFO] ------------------------------------------------------------------------
[INFO] ------------------------------------------------------------------------
[INFO] Reactor Summary:
[INFO] 
[INFO] HBase ............................................. SUCCESS [40.661s]
[INFO] HBase - Common .................................... SUCCESS [1:05.768s]
[INFO] HBase - Protocol .................................. SUCCESS [18.855s]
[INFO] HBase - Client .................................... SUCCESS [12.923s]
[INFO] HBase - Prefix Tree ............................... SUCCESS [4.764s]
[INFO] HBase - Hadoop Compatibility ...................... SUCCESS [1.331s]
[INFO] HBase - Hadoop One Compatibility .................. SUCCESS [11.646s]
[INFO] HBase - Server .................................... FAILURE [50:50.101s]
[INFO] HBase - Integration Tests ......................... SKIPPED
[INFO] HBase - Examples .................................. SKIPPED
[INFO] HBase - Assembly .................................. SKIPPED
[INFO] ------------------------------------------------------------------------
[INFO] BUILD FAILURE
[INFO] ------------------------------------------------------------------------
[INFO] Total time: 53:56.277s
[INFO] Finished at: Mon Apr 29 20:14:40 UTC 2013
[INFO] Final Memory: 54M/1146M
[INFO] ------------------------------------------------------------------------
[JENKINS] Archiving <http://54.241.6.143/job/HBase-0.95/ws/hbase-common/pom.xml> to
/var/lib/jenkins/jobs/HBase-0.95/modules/org.apache.hbase$hbase-common/builds/2013-04-29_19-20-35/archive/org.apache.hbase/hbase-common/0.97.0-SNAPSHOT/hbase-common-0.97.0-SNAPSHOT.pom
[JENKINS] Archiving <http://54.241.6.143/job/HBase-0.95/ws/hbase-common/target/hbase-common-0.97.0-SNAPSHOT.jar>
to /var/lib/jenkins/jobs/HBase-0.95/modules/org.apache.hbase$hbase-common/builds/2013-04-29_19-20-35/archive/org.apache.hbase/hbase-common/0.97.0-SNAPSHOT/hbase-common-0.97.0-SNAPSHOT.jar
[JENKINS] Archiving <http://54.241.6.143/job/HBase-0.95/ws/hbase-common/target/hbase-common-0.97.0-SNAPSHOT-sources.jar>
to /var/lib/jenkins/jobs/HBase-0.95/modules/org.apache.hbase$hbase-common/builds/2013-04-29_19-20-35/archive/org.apache.hbase/hbase-common/0.97.0-SNAPSHOT/hbase-common-0.97.0-SNAPSHOT-sources.jar
[JENKINS] Archiving <http://54.241.6.143/job/HBase-0.95/ws/hbase-common/target/hbase-common-0.97.0-SNAPSHOT-tests.jar>
to /var/lib/jenkins/jobs/HBase-0.95/modules/org.apache.hbase$hbase-common/builds/2013-04-29_19-20-35/archive/org.apache.hbase/hbase-common/0.97.0-SNAPSHOT/hbase-common-0.97.0-SNAPSHOT-tests.jar
[JENKINS] Archiving <http://54.241.6.143/job/HBase-0.95/ws/hbase-hadoop-compat/pom.xml>
to /var/lib/jenkins/jobs/HBase-0.95/modules/org.apache.hbase$hbase-hadoop-compat/builds/2013-04-29_19-20-35/archive/org.apache.hbase/hbase-hadoop-compat/0.97.0-SNAPSHOT/hbase-hadoop-compat-0.97.0-SNAPSHOT.pom
[JENKINS] Archiving <http://54.241.6.143/job/HBase-0.95/ws/hbase-hadoop-compat/target/hbase-hadoop-compat-0.97.0-SNAPSHOT.jar>
to /var/lib/jenkins/jobs/HBase-0.95/modules/org.apache.hbase$hbase-hadoop-compat/builds/2013-04-29_19-20-35/archive/org.apache.hbase/hbase-hadoop-compat/0.97.0-SNAPSHOT/hbase-hadoop-compat-0.97.0-SNAPSHOT.jar
[JENKINS] Archiving <http://54.241.6.143/job/HBase-0.95/ws/hbase-hadoop-compat/target/hbase-hadoop-compat-0.97.0-SNAPSHOT-sources.jar>
to /var/lib/jenkins/jobs/HBase-0.95/modules/org.apache.hbase$hbase-hadoop-compat/builds/2013-04-29_19-20-35/archive/org.apache.hbase/hbase-hadoop-compat/0.97.0-SNAPSHOT/hbase-hadoop-compat-0.97.0-SNAPSHOT-sources.jar
[JENKINS] Archiving <http://54.241.6.143/job/HBase-0.95/ws/hbase-hadoop-compat/target/hbase-hadoop-compat-0.97.0-SNAPSHOT-tests.jar>
to /var/lib/jenkins/jobs/HBase-0.95/modules/org.apache.hbase$hbase-hadoop-compat/builds/2013-04-29_19-20-35/archive/org.apache.hbase/hbase-hadoop-compat/0.97.0-SNAPSHOT/hbase-hadoop-compat-0.97.0-SNAPSHOT-tests.jar
[JENKINS] Archiving <http://54.241.6.143/job/HBase-0.95/ws/hbase-examples/pom.xml> to
/var/lib/jenkins/jobs/HBase-0.95/modules/org.apache.hbase$hbase-examples/builds/2013-04-29_19-20-35/archive/org.apache.hbase/hbase-examples/0.97.0-SNAPSHOT/hbase-examples-0.97.0-SNAPSHOT.pom
[JENKINS] Archiving <http://54.241.6.143/job/HBase-0.95/ws/hbase-it/pom.xml> to /var/lib/jenkins/jobs/HBase-0.95/modules/org.apache.hbase$hbase-it/builds/2013-04-29_19-20-35/archive/org.apache.hbase/hbase-it/0.97.0-SNAPSHOT/hbase-it-0.97.0-SNAPSHOT.pom
[JENKINS] Archiving <http://54.241.6.143/job/HBase-0.95/ws/pom.xml> to /var/lib/jenkins/jobs/HBase-0.95/modules/org.apache.hbase$hbase/builds/2013-04-29_19-20-35/archive/org.apache.hbase/hbase/0.97.0-SNAPSHOT/hbase-0.97.0-SNAPSHOT.pom
[JENKINS] Archiving <http://54.241.6.143/job/HBase-0.95/ws/target/hbase-0.97.0-SNAPSHOT-site.xml>
to /var/lib/jenkins/jobs/HBase-0.95/modules/org.apache.hbase$hbase/builds/2013-04-29_19-20-35/archive/org.apache.hbase/hbase/0.97.0-SNAPSHOT/hbase-0.97.0-SNAPSHOT-site.xml
[JENKINS] Archiving <http://54.241.6.143/job/HBase-0.95/ws/hbase-assembly/pom.xml> to
/var/lib/jenkins/jobs/HBase-0.95/modules/org.apache.hbase$hbase-assembly/builds/2013-04-29_19-20-35/archive/org.apache.hbase/hbase-assembly/0.97.0-SNAPSHOT/hbase-assembly-0.97.0-SNAPSHOT.pom
[JENKINS] Archiving <http://54.241.6.143/job/HBase-0.95/ws/hbase-client/pom.xml> to
/var/lib/jenkins/jobs/HBase-0.95/modules/org.apache.hbase$hbase-client/builds/2013-04-29_19-20-35/archive/org.apache.hbase/hbase-client/0.97.0-SNAPSHOT/hbase-client-0.97.0-SNAPSHOT.pom
[JENKINS] Archiving <http://54.241.6.143/job/HBase-0.95/ws/hbase-client/target/hbase-client-0.97.0-SNAPSHOT.jar>
to /var/lib/jenkins/jobs/HBase-0.95/modules/org.apache.hbase$hbase-client/builds/2013-04-29_19-20-35/archive/org.apache.hbase/hbase-client/0.97.0-SNAPSHOT/hbase-client-0.97.0-SNAPSHOT.jar
[JENKINS] Archiving <http://54.241.6.143/job/HBase-0.95/ws/hbase-client/target/hbase-client-0.97.0-SNAPSHOT-sources.jar>
to /var/lib/jenkins/jobs/HBase-0.95/modules/org.apache.hbase$hbase-client/builds/2013-04-29_19-20-35/archive/org.apache.hbase/hbase-client/0.97.0-SNAPSHOT/hbase-client-0.97.0-SNAPSHOT-sources.jar
[JENKINS] Archiving <http://54.241.6.143/job/HBase-0.95/ws/hbase-client/target/hbase-client-0.97.0-SNAPSHOT-tests.jar>
to /var/lib/jenkins/jobs/HBase-0.95/modules/org.apache.hbase$hbase-client/builds/2013-04-29_19-20-35/archive/org.apache.hbase/hbase-client/0.97.0-SNAPSHOT/hbase-client-0.97.0-SNAPSHOT-tests.jar
[JENKINS] Archiving <http://54.241.6.143/job/HBase-0.95/ws/hbase-prefix-tree/pom.xml>
to /var/lib/jenkins/jobs/HBase-0.95/modules/org.apache.hbase$hbase-prefix-tree/builds/2013-04-29_19-20-35/archive/org.apache.hbase/hbase-prefix-tree/0.97.0-SNAPSHOT/hbase-prefix-tree-0.97.0-SNAPSHOT.pom
[JENKINS] Archiving <http://54.241.6.143/job/HBase-0.95/ws/hbase-prefix-tree/target/hbase-prefix-tree-0.97.0-SNAPSHOT.jar>
to /var/lib/jenkins/jobs/HBase-0.95/modules/org.apache.hbase$hbase-prefix-tree/builds/2013-04-29_19-20-35/archive/org.apache.hbase/hbase-prefix-tree/0.97.0-SNAPSHOT/hbase-prefix-tree-0.97.0-SNAPSHOT.jar
[JENKINS] Archiving <http://54.241.6.143/job/HBase-0.95/ws/hbase-prefix-tree/target/hbase-prefix-tree-0.97.0-SNAPSHOT-sources.jar>
to /var/lib/jenkins/jobs/HBase-0.95/modules/org.apache.hbase$hbase-prefix-tree/builds/2013-04-29_19-20-35/archive/org.apache.hbase/hbase-prefix-tree/0.97.0-SNAPSHOT/hbase-prefix-tree-0.97.0-SNAPSHOT-sources.jar
[JENKINS] Archiving <http://54.241.6.143/job/HBase-0.95/ws/hbase-prefix-tree/target/hbase-prefix-tree-0.97.0-SNAPSHOT-tests.jar>
to /var/lib/jenkins/jobs/HBase-0.95/modules/org.apache.hbase$hbase-prefix-tree/builds/2013-04-29_19-20-35/archive/org.apache.hbase/hbase-prefix-tree/0.97.0-SNAPSHOT/hbase-prefix-tree-0.97.0-SNAPSHOT-tests.jar
[JENKINS] Archiving <http://54.241.6.143/job/HBase-0.95/ws/hbase-protocol/pom.xml> to
/var/lib/jenkins/jobs/HBase-0.95/modules/org.apache.hbase$hbase-protocol/builds/2013-04-29_19-20-35/archive/org.apache.hbase/hbase-protocol/0.97.0-SNAPSHOT/hbase-protocol-0.97.0-SNAPSHOT.pom
[JENKINS] Archiving <http://54.241.6.143/job/HBase-0.95/ws/hbase-protocol/target/hbase-protocol-0.97.0-SNAPSHOT.jar>
to /var/lib/jenkins/jobs/HBase-0.95/modules/org.apache.hbase$hbase-protocol/builds/2013-04-29_19-20-35/archive/org.apache.hbase/hbase-protocol/0.97.0-SNAPSHOT/hbase-protocol-0.97.0-SNAPSHOT.jar
[JENKINS] Archiving <http://54.241.6.143/job/HBase-0.95/ws/hbase-protocol/target/hbase-protocol-0.97.0-SNAPSHOT-sources.jar>
to /var/lib/jenkins/jobs/HBase-0.95/modules/org.apache.hbase$hbase-protocol/builds/2013-04-29_19-20-35/archive/org.apache.hbase/hbase-protocol/0.97.0-SNAPSHOT/hbase-protocol-0.97.0-SNAPSHOT-sources.jar
[JENKINS] Archiving <http://54.241.6.143/job/HBase-0.95/ws/hbase-protocol/target/hbase-protocol-0.97.0-SNAPSHOT-tests.jar>
to /var/lib/jenkins/jobs/HBase-0.95/modules/org.apache.hbase$hbase-protocol/builds/2013-04-29_19-20-35/archive/org.apache.hbase/hbase-protocol/0.97.0-SNAPSHOT/hbase-protocol-0.97.0-SNAPSHOT-tests.jar
[JENKINS] Archiving <http://54.241.6.143/job/HBase-0.95/ws/hbase-hadoop1-compat/pom.xml>
to /var/lib/jenkins/jobs/HBase-0.95/modules/org.apache.hbase$hbase-hadoop1-compat/builds/2013-04-29_19-20-35/archive/org.apache.hbase/hbase-hadoop1-compat/0.97.0-SNAPSHOT/hbase-hadoop1-compat-0.97.0-SNAPSHOT.pom
[JENKINS] Archiving <http://54.241.6.143/job/HBase-0.95/ws/hbase-hadoop1-compat/target/hbase-hadoop1-compat-0.97.0-SNAPSHOT.jar>
to /var/lib/jenkins/jobs/HBase-0.95/modules/org.apache.hbase$hbase-hadoop1-compat/builds/2013-04-29_19-20-35/archive/org.apache.hbase/hbase-hadoop1-compat/0.97.0-SNAPSHOT/hbase-hadoop1-compat-0.97.0-SNAPSHOT.jar
[JENKINS] Archiving <http://54.241.6.143/job/HBase-0.95/ws/hbase-hadoop1-compat/target/hbase-hadoop1-compat-0.97.0-SNAPSHOT-sources.jar>
to /var/lib/jenkins/jobs/HBase-0.95/modules/org.apache.hbase$hbase-hadoop1-compat/builds/2013-04-29_19-20-35/archive/org.apache.hbase/hbase-hadoop1-compat/0.97.0-SNAPSHOT/hbase-hadoop1-compat-0.97.0-SNAPSHOT-sources.jar
[JENKINS] Archiving <http://54.241.6.143/job/HBase-0.95/ws/hbase-hadoop1-compat/target/hbase-hadoop1-compat-0.97.0-SNAPSHOT-tests.jar>
to /var/lib/jenkins/jobs/HBase-0.95/modules/org.apache.hbase$hbase-hadoop1-compat/builds/2013-04-29_19-20-35/archive/org.apache.hbase/hbase-hadoop1-compat/0.97.0-SNAPSHOT/hbase-hadoop1-compat-0.97.0-SNAPSHOT-tests.jar
[JENKINS] Archiving <http://54.241.6.143/job/HBase-0.95/ws/hbase-server/pom.xml> to
/var/lib/jenkins/jobs/HBase-0.95/modules/org.apache.hbase$hbase-server/builds/2013-04-29_19-20-35/archive/org.apache.hbase/hbase-server/0.97.0-SNAPSHOT/hbase-server-0.97.0-SNAPSHOT.pom
Waiting for Jenkins to finish collecting data
mavenExecutionResult exceptions not empty
message : Failed to execute goal org.apache.maven.plugins:maven-surefire-plugin:2.12-TRUNK-HBASE-2:test
(secondPartTestsExecution) on project hbase-server: There are test failures.

Please refer to <http://54.241.6.143/job/HBase-0.95/ws/hbase-server/target/surefire-reports>
for the individual test results.
cause : There are test failures.

Please refer to <http://54.241.6.143/job/HBase-0.95/ws/hbase-server/target/surefire-reports>
for the individual test results.
Stack trace : 
org.apache.maven.lifecycle.LifecycleExecutionException: Failed to execute goal org.apache.maven.plugins:maven-surefire-plugin:2.12-TRUNK-HBASE-2:test
(secondPartTestsExecution) on project hbase-server: There are test failures.

Please refer to <http://54.241.6.143/job/HBase-0.95/ws/hbase-server/target/surefire-reports>
for the individual test results.
	at org.apache.maven.lifecycle.internal.MojoExecutor.execute(MojoExecutor.java:213)
	at org.apache.maven.lifecycle.internal.MojoExecutor.execute(MojoExecutor.java:153)
	at org.apache.maven.lifecycle.internal.MojoExecutor.execute(MojoExecutor.java:145)
	at org.apache.maven.lifecycle.internal.LifecycleModuleBuilder.buildProject(LifecycleModuleBuilder.java:84)
	at org.apache.maven.lifecycle.internal.LifecycleModuleBuilder.buildProject(LifecycleModuleBuilder.java:59)
	at org.apache.maven.lifecycle.internal.LifecycleStarter.singleThreadedBuild(LifecycleStarter.java:183)
	at org.apache.maven.lifecycle.internal.LifecycleStarter.execute(LifecycleStarter.java:161)
	at org.apache.maven.DefaultMaven.doExecute(DefaultMaven.java:320)
	at org.apache.maven.DefaultMaven.execute(DefaultMaven.java:156)
	at org.jvnet.hudson.maven3.launcher.Maven3Launcher.main(Maven3Launcher.java:79)
	at sun.reflect.NativeMethodAccessorImpl.invoke0(Native Method)
	at sun.reflect.NativeMethodAccessorImpl.invoke(NativeMethodAccessorImpl.java:39)
	at sun.reflect.DelegatingMethodAccessorImpl.invoke(DelegatingMethodAccessorImpl.java:25)
	at java.lang.reflect.Method.invoke(Method.java:597)
	at org.codehaus.plexus.classworlds.launcher.Launcher.launchStandard(Launcher.java:329)
	at org.codehaus.plexus.classworlds.launcher.Launcher.launch(Launcher.java:239)
	at org.jvnet.hudson.maven3.agent.Maven3Main.launch(Maven3Main.java:158)
	at hudson.maven.Maven3Builder.call(Maven3Builder.java:100)
	at hudson.maven.Maven3Builder.call(Maven3Builder.java:66)
	at hudson.remoting.UserRequest.perform(UserRequest.java:118)
	at hudson.remoting.UserRequest.perform(UserRequest.java:48)
	at hudson.remoting.Request$2.run(Request.java:326)
	at hudson.remoting.InterceptingExecutorService$1.call(InterceptingExecutorService.java:72)
	at java.util.concurrent.FutureTask$Sync.innerRun(FutureTask.java:303)
	at java.util.concurrent.FutureTask.run(FutureTask.java:138)
	at java.util.concurrent.ThreadPoolExecutor$Worker.runTask(ThreadPoolExecutor.java:895)
	at java.util.concurrent.ThreadPoolExecutor$Worker.run(ThreadPoolExecutor.java:918)
	at java.lang.Thread.run(Thread.java:662)
Caused by: org.apache.maven.plugin.MojoFailureException: There are test failures.

Please refer to <http://54.241.6.143/job/HBase-0.95/ws/hbase-server/target/surefire-reports>
for the individual test results.
	at org.apache.maven.plugin.surefire.SurefireHelper.reportExecution(SurefireHelper.java:87)
	at org.apache.maven.plugin.surefire.SurefirePlugin.writeSummary(SurefirePlugin.java:651)
	at org.apache.maven.plugin.surefire.SurefirePlugin.handleSummary(SurefirePlugin.java:625)
	at org.apache.maven.plugin.surefire.AbstractSurefireMojo.executeAfterPreconditionsChecked(AbstractSurefireMojo.java:137)
	at org.apache.maven.plugin.surefire.AbstractSurefireMojo.execute(AbstractSurefireMojo.java:98)
	at org.apache.maven.plugin.DefaultBuildPluginManager.executeMojo(DefaultBuildPluginManager.java:101)
	at org.apache.maven.lifecycle.internal.MojoExecutor.execute(MojoExecutor.java:209)
	... 27 more
channel stopped

Mime
View raw message