hbase-dev mailing list archives

Site index · List index
Message view « Date » · « Thread »
Top « Date » · « Thread »
From Apache Jenkins Server <jenk...@builds.apache.org>
Subject Build failed in Jenkins: hbase-0.95-on-hadoop2 #49
Date Mon, 01 Apr 2013 00:28:58 GMT
See <https://builds.apache.org/job/hbase-0.95-on-hadoop2/49/changes>

Changes:

[apurtell] HBASE-8232. TestAccessController occasionally fails with IndexOutOfBoundsException

[tedyu] HBASE-7904 Make mapreduce jobs pass based on 2.0.4-alpha (Ted Yu)

------------------------------------------
[...truncated 20692 lines...]
	at org.apache.maven.wagon.shared.http4.AbstractHttpClientWagon.fillInputData(AbstractHttpClientWagon.java:799)
	at org.apache.maven.wagon.StreamWagon.getInputStream(StreamWagon.java:116)
	at org.apache.maven.wagon.StreamWagon.getIfNewer(StreamWagon.java:88)
	at org.apache.maven.wagon.StreamWagon.get(StreamWagon.java:61)
	at org.sonatype.aether.connector.wagon.WagonRepositoryConnector$GetTask.run(WagonRepositoryConnector.java:601)
	... 4 more
Caused by: org.apache.maven.wagon.providers.http.httpclient.conn.HttpHostConnectException:
Connection to http://repository.apache.org refused
	at org.apache.maven.wagon.providers.http.httpclient.impl.conn.DefaultClientConnectionOperator.openConnection(DefaultClientConnectionOperator.java:158)
	at org.apache.maven.wagon.providers.http.httpclient.impl.conn.AbstractPoolEntry.open(AbstractPoolEntry.java:149)
	at org.apache.maven.wagon.providers.http.httpclient.impl.conn.AbstractPooledConnAdapter.open(AbstractPooledConnAdapter.java:121)
	at org.apache.maven.wagon.providers.http.httpclient.impl.client.DefaultRequestDirector.tryConnect(DefaultRequestDirector.java:573)
	at org.apache.maven.wagon.providers.http.httpclient.impl.client.DefaultRequestDirector.execute(DefaultRequestDirector.java:425)
	at org.apache.maven.wagon.providers.http.httpclient.impl.client.AbstractHttpClient.execute(AbstractHttpClient.java:820)
	at org.apache.maven.wagon.providers.http.httpclient.impl.client.AbstractHttpClient.execute(AbstractHttpClient.java:754)
	at org.apache.maven.wagon.shared.http4.AbstractHttpClientWagon.execute(AbstractHttpClientWagon.java:674)
	at org.apache.maven.wagon.shared.http4.AbstractHttpClientWagon.fillInputData(AbstractHttpClientWagon.java:793)
	... 8 more
Caused by: java.net.ConnectException: Connection refused
	at java.net.PlainSocketImpl.socketConnect(Native Method)
	at java.net.PlainSocketImpl.doConnect(PlainSocketImpl.java:351)
	at java.net.PlainSocketImpl.connectToAddress(PlainSocketImpl.java:213)
	at java.net.PlainSocketImpl.connect(PlainSocketImpl.java:200)
	at java.net.SocksSocketImpl.connect(SocksSocketImpl.java:366)
	at java.net.Socket.connect(Socket.java:529)
	at org.apache.maven.wagon.providers.http.httpclient.conn.scheme.PlainSocketFactory.connectSocket(PlainSocketFactory.java:123)
	at org.apache.maven.wagon.providers.http.httpclient.impl.conn.DefaultClientConnectionOperator.openConnection(DefaultClientConnectionOperator.java:148)
	... 16 more
[DEBUG] Could not find metadata org.apache.hadoop:hadoop-minicluster:2.0.4-SNAPSHOT/maven-metadata.xml
in local (/home/jenkins/.m2/repository)
[DEBUG] Skipped remote update check for org.apache.hadoop:hadoop-minicluster:2.0.4-SNAPSHOT/maven-metadata.xml,
already updated during this session.
[DEBUG] Failure to find org.apache.hadoop:hadoop-minicluster:2.0.4-SNAPSHOT/maven-metadata.xml
in http://repository-netty.forge.cloudbees.com/snapshot/ was cached in the local repository,
resolution will not be reattempted until the update interval of cloudbees netty has elapsed
or updates are forced
[DEBUG] Skipped remote update check for org.apache.hadoop:hadoop-minicluster:2.0.4-SNAPSHOT/maven-metadata.xml,
already updated during this session.
[WARNING] Failure to transfer org.apache.hadoop:hadoop-minicluster:2.0.4-SNAPSHOT/maven-metadata.xml
from https://repository.apache.org/content/repositories/releases/ was cached in the local
repository, resolution will not be reattempted until the update interval of apache release
has elapsed or updates are forced. Original error: Could not transfer metadata org.apache.hadoop:hadoop-minicluster:2.0.4-SNAPSHOT/maven-metadata.xml
from/to apache release (https://repository.apache.org/content/repositories/releases/): Connection
to https://repository.apache.org refused
org.sonatype.aether.transfer.MetadataTransferException: Failure to transfer org.apache.hadoop:hadoop-minicluster:2.0.4-SNAPSHOT/maven-metadata.xml
from https://repository.apache.org/content/repositories/releases/ was cached in the local
repository, resolution will not be reattempted until the update interval of apache release
has elapsed or updates are forced. Original error: Could not transfer metadata org.apache.hadoop:hadoop-minicluster:2.0.4-SNAPSHOT/maven-metadata.xml
from/to apache release (https://repository.apache.org/content/repositories/releases/): Connection
to https://repository.apache.org refused
	at org.sonatype.aether.impl.internal.DefaultUpdateCheckManager.newException(DefaultUpdateCheckManager.java:369)
	at org.sonatype.aether.impl.internal.DefaultUpdateCheckManager.checkMetadata(DefaultUpdateCheckManager.java:315)
	at org.sonatype.aether.impl.internal.DefaultMetadataResolver.resolve(DefaultMetadataResolver.java:295)
	at org.sonatype.aether.impl.internal.DefaultMetadataResolver.resolveMetadata(DefaultMetadataResolver.java:173)
	at org.apache.maven.repository.internal.DefaultVersionResolver.resolveVersion(DefaultVersionResolver.java:225)
	at org.sonatype.aether.impl.internal.DefaultArtifactResolver.resolve(DefaultArtifactResolver.java:272)
	at org.sonatype.aether.impl.internal.DefaultArtifactResolver.resolveArtifacts(DefaultArtifactResolver.java:216)
	at org.sonatype.aether.impl.internal.DefaultArtifactResolver.resolveArtifact(DefaultArtifactResolver.java:193)
	at org.apache.maven.repository.internal.DefaultArtifactDescriptorReader.loadPom(DefaultArtifactDescriptorReader.java:281)
	at org.apache.maven.repository.internal.DefaultArtifactDescriptorReader.readArtifactDescriptor(DefaultArtifactDescriptorReader.java:186)
	at org.sonatype.aether.impl.internal.DefaultDependencyCollector.process(DefaultDependencyCollector.java:412)
	at org.sonatype.aether.impl.internal.DefaultDependencyCollector.collectDependencies(DefaultDependencyCollector.java:240)
	at org.sonatype.aether.impl.internal.DefaultRepositorySystem.collectDependencies(DefaultRepositorySystem.java:308)
	at org.apache.maven.project.DefaultProjectDependenciesResolver.resolve(DefaultProjectDependenciesResolver.java:150)
	at org.apache.maven.lifecycle.internal.LifecycleDependencyResolver.getDependencies(LifecycleDependencyResolver.java:185)
	at org.apache.maven.lifecycle.internal.LifecycleDependencyResolver.resolveProjectDependencies(LifecycleDependencyResolver.java:117)
	at org.apache.maven.lifecycle.internal.MojoExecutor.ensureDependenciesAreResolved(MojoExecutor.java:258)
	at org.apache.maven.lifecycle.internal.MojoExecutor.execute(MojoExecutor.java:201)
	at org.apache.maven.lifecycle.internal.MojoExecutor.execute(MojoExecutor.java:153)
	at org.apache.maven.lifecycle.internal.MojoExecutor.execute(MojoExecutor.java:145)
	at org.apache.maven.lifecycle.internal.LifecycleModuleBuilder.buildProject(LifecycleModuleBuilder.java:84)
	at org.apache.maven.lifecycle.internal.LifecycleModuleBuilder.buildProject(LifecycleModuleBuilder.java:59)
	at org.apache.maven.lifecycle.internal.LifecycleStarter.singleThreadedBuild(LifecycleStarter.java:183)
	at org.apache.maven.lifecycle.internal.LifecycleStarter.execute(LifecycleStarter.java:161)
	at org.apache.maven.DefaultMaven.doExecute(DefaultMaven.java:320)
	at org.apache.maven.DefaultMaven.execute(DefaultMaven.java:156)
	at org.apache.maven.cli.MavenCli.execute(MavenCli.java:537)
	at org.apache.maven.cli.MavenCli.doMain(MavenCli.java:196)
	at org.apache.maven.cli.MavenCli.main(MavenCli.java:141)
	at sun.reflect.NativeMethodAccessorImpl.invoke0(Native Method)
	at sun.reflect.NativeMethodAccessorImpl.invoke(NativeMethodAccessorImpl.java:39)
	at sun.reflect.DelegatingMethodAccessorImpl.invoke(DelegatingMethodAccessorImpl.java:25)
	at java.lang.reflect.Method.invoke(Method.java:597)
	at org.codehaus.plexus.classworlds.launcher.Launcher.launchEnhanced(Launcher.java:290)
	at org.codehaus.plexus.classworlds.launcher.Launcher.launch(Launcher.java:230)
	at org.codehaus.plexus.classworlds.launcher.Launcher.mainWithExitCode(Launcher.java:409)
	at org.codehaus.plexus.classworlds.launcher.Launcher.main(Launcher.java:352)
[DEBUG] Skipped remote update check for org.apache.hadoop:hadoop-minicluster:2.0.4-SNAPSHOT/maven-metadata.xml,
already updated during this session.
[DEBUG] Failure to find org.apache.hadoop:hadoop-minicluster:2.0.4-SNAPSHOT/maven-metadata.xml
in http://people.apache.org/~garyh/mvn/ was cached in the local repository, resolution will
not be reattempted until the update interval of ghelmling.testing has elapsed or updates are
forced
[DEBUG] Skipped remote update check for org.apache.hadoop:hadoop-minicluster:2.0.4-SNAPSHOT/maven-metadata.xml,
already updated during this session.
[WARNING] Failure to transfer org.apache.hadoop:hadoop-minicluster:2.0.4-SNAPSHOT/maven-metadata.xml
from http://repository.apache.org/snapshots was cached in the local repository, resolution
will not be reattempted until the update interval of Nexus has elapsed or updates are forced.
Original error: Could not transfer metadata org.apache.hadoop:hadoop-minicluster:2.0.4-SNAPSHOT/maven-metadata.xml
from/to Nexus (http://repository.apache.org/snapshots): Connection to http://repository.apache.org
refused
org.sonatype.aether.transfer.MetadataTransferException: Failure to transfer org.apache.hadoop:hadoop-minicluster:2.0.4-SNAPSHOT/maven-metadata.xml
from http://repository.apache.org/snapshots was cached in the local repository, resolution
will not be reattempted until the update interval of Nexus has elapsed or updates are forced.
Original error: Could not transfer metadata org.apache.hadoop:hadoop-minicluster:2.0.4-SNAPSHOT/maven-metadata.xml
from/to Nexus (http://repository.apache.org/snapshots): Connection to http://repository.apache.org
refused
	at org.sonatype.aether.impl.internal.DefaultUpdateCheckManager.newException(DefaultUpdateCheckManager.java:369)
	at org.sonatype.aether.impl.internal.DefaultUpdateCheckManager.checkMetadata(DefaultUpdateCheckManager.java:315)
	at org.sonatype.aether.impl.internal.DefaultMetadataResolver.resolve(DefaultMetadataResolver.java:295)
	at org.sonatype.aether.impl.internal.DefaultMetadataResolver.resolveMetadata(DefaultMetadataResolver.java:173)
	at org.apache.maven.repository.internal.DefaultVersionResolver.resolveVersion(DefaultVersionResolver.java:225)
	at org.sonatype.aether.impl.internal.DefaultArtifactResolver.resolve(DefaultArtifactResolver.java:272)
	at org.sonatype.aether.impl.internal.DefaultArtifactResolver.resolveArtifacts(DefaultArtifactResolver.java:216)
	at org.sonatype.aether.impl.internal.DefaultArtifactResolver.resolveArtifact(DefaultArtifactResolver.java:193)
	at org.apache.maven.repository.internal.DefaultArtifactDescriptorReader.loadPom(DefaultArtifactDescriptorReader.java:281)
	at org.apache.maven.repository.internal.DefaultArtifactDescriptorReader.readArtifactDescriptor(DefaultArtifactDescriptorReader.java:186)
	at org.sonatype.aether.impl.internal.DefaultDependencyCollector.process(DefaultDependencyCollector.java:412)
	at org.sonatype.aether.impl.internal.DefaultDependencyCollector.collectDependencies(DefaultDependencyCollector.java:240)
	at org.sonatype.aether.impl.internal.DefaultRepositorySystem.collectDependencies(DefaultRepositorySystem.java:308)
	at org.apache.maven.project.DefaultProjectDependenciesResolver.resolve(DefaultProjectDependenciesResolver.java:150)
	at org.apache.maven.lifecycle.internal.LifecycleDependencyResolver.getDependencies(LifecycleDependencyResolver.java:185)
	at org.apache.maven.lifecycle.internal.LifecycleDependencyResolver.resolveProjectDependencies(LifecycleDependencyResolver.java:117)
	at org.apache.maven.lifecycle.internal.MojoExecutor.ensureDependenciesAreResolved(MojoExecutor.java:258)
	at org.apache.maven.lifecycle.internal.MojoExecutor.execute(MojoExecutor.java:201)
	at org.apache.maven.lifecycle.internal.MojoExecutor.execute(MojoExecutor.java:153)
	at org.apache.maven.lifecycle.internal.MojoExecutor.execute(MojoExecutor.java:145)
	at org.apache.maven.lifecycle.internal.LifecycleModuleBuilder.buildProject(LifecycleModuleBuilder.java:84)
	at org.apache.maven.lifecycle.internal.LifecycleModuleBuilder.buildProject(LifecycleModuleBuilder.java:59)
	at org.apache.maven.lifecycle.internal.LifecycleStarter.singleThreadedBuild(LifecycleStarter.java:183)
	at org.apache.maven.lifecycle.internal.LifecycleStarter.execute(LifecycleStarter.java:161)
	at org.apache.maven.DefaultMaven.doExecute(DefaultMaven.java:320)
	at org.apache.maven.DefaultMaven.execute(DefaultMaven.java:156)
	at org.apache.maven.cli.MavenCli.execute(MavenCli.java:537)
	at org.apache.maven.cli.MavenCli.doMain(MavenCli.java:196)
	at org.apache.maven.cli.MavenCli.main(MavenCli.java:141)
	at sun.reflect.NativeMethodAccessorImpl.invoke0(Native Method)
	at sun.reflect.NativeMethodAccessorImpl.invoke(NativeMethodAccessorImpl.java:39)
	at sun.reflect.DelegatingMethodAccessorImpl.invoke(DelegatingMethodAccessorImpl.java:25)
	at java.lang.reflect.Method.invoke(Method.java:597)
	at org.codehaus.plexus.classworlds.launcher.Launcher.launchEnhanced(Launcher.java:290)
	at org.codehaus.plexus.classworlds.launcher.Launcher.launch(Launcher.java:230)
	at org.codehaus.plexus.classworlds.launcher.Launcher.mainWithExitCode(Launcher.java:409)
	at org.codehaus.plexus.classworlds.launcher.Launcher.main(Launcher.java:352)
[DEBUG] Using connector WagonRepositoryConnector with priority 0 for http://repository-netty.forge.cloudbees.com/snapshot/
Downloading: http://repository-netty.forge.cloudbees.com/snapshot/org/apache/hadoop/hadoop-minicluster/2.0.4-SNAPSHOT/hadoop-minicluster-2.0.4-SNAPSHOT.pom
        
[DEBUG] Writing resolution tracking file /home/jenkins/.m2/repository/org/apache/hadoop/hadoop-minicluster/2.0.4-SNAPSHOT/hadoop-minicluster-2.0.4-SNAPSHOT.pom.lastUpdated
[DEBUG] Using connector WagonRepositoryConnector with priority 0 for https://repository.apache.org/content/repositories/releases/
Downloading: https://repository.apache.org/content/repositories/releases/org/apache/hadoop/hadoop-minicluster/2.0.4-SNAPSHOT/hadoop-minicluster-2.0.4-SNAPSHOT.pom
        
[DEBUG] Writing resolution tracking file /home/jenkins/.m2/repository/org/apache/hadoop/hadoop-minicluster/2.0.4-SNAPSHOT/hadoop-minicluster-2.0.4-SNAPSHOT.pom.lastUpdated
[DEBUG] Using connector WagonRepositoryConnector with priority 0 for http://people.apache.org/~garyh/mvn/
Downloading: http://people.apache.org/~garyh/mvn/org/apache/hadoop/hadoop-minicluster/2.0.4-SNAPSHOT/hadoop-minicluster-2.0.4-SNAPSHOT.pom
        
[DEBUG] Writing resolution tracking file /home/jenkins/.m2/repository/org/apache/hadoop/hadoop-minicluster/2.0.4-SNAPSHOT/hadoop-minicluster-2.0.4-SNAPSHOT.pom.lastUpdated
[DEBUG] Using connector WagonRepositoryConnector with priority 0 for http://repository.apache.org/snapshots
Downloading: http://repository.apache.org/snapshots/org/apache/hadoop/hadoop-minicluster/2.0.4-SNAPSHOT/hadoop-minicluster-2.0.4-SNAPSHOT.pom
        
[DEBUG] Writing resolution tracking file /home/jenkins/.m2/repository/org/apache/hadoop/hadoop-minicluster/2.0.4-SNAPSHOT/hadoop-minicluster-2.0.4-SNAPSHOT.pom.lastUpdated
[INFO]                                                                         
[INFO] ------------------------------------------------------------------------
[INFO] Skipping HBase
[INFO] This project has been banned from the build due to previous failures.
[INFO] ------------------------------------------------------------------------
[INFO] ------------------------------------------------------------------------
[INFO] Reactor Summary:
[INFO] 
[INFO] HBase ............................................. SUCCESS [4.332s]
[INFO] HBase - Common .................................... SUCCESS [27.851s]
[INFO] HBase - Protocol .................................. SUCCESS [12.304s]
[INFO] HBase - Client .................................... SUCCESS [7.688s]
[INFO] HBase - Prefix Tree ............................... SUCCESS [2.769s]
[INFO] HBase - Hadoop Compatibility ...................... SUCCESS [0.507s]
[INFO] HBase - Hadoop Two Compatibility .................. FAILURE [15.407s]
[INFO] HBase - Server .................................... SKIPPED
[INFO] HBase - Integration Tests ......................... SKIPPED
[INFO] HBase - Examples .................................. SKIPPED
[INFO] HBase - Assembly .................................. SKIPPED
[INFO] ------------------------------------------------------------------------
[INFO] BUILD FAILURE
[INFO] ------------------------------------------------------------------------
[INFO] Total time: 1:13.514s
[INFO] Finished at: Mon Apr 01 00:28:55 UTC 2013
[INFO] Final Memory: 47M/283M
[INFO] ------------------------------------------------------------------------
[ERROR] Failed to execute goal on project hbase-hadoop2-compat: Could not resolve dependencies
for project org.apache.hbase:hbase-hadoop2-compat:jar:0.95.0-SNAPSHOT: Failed to collect dependencies
for [org.apache.hbase:hbase-hadoop-compat:jar:0.95.0-SNAPSHOT (compile), org.apache.hbase:hbase-hadoop-compat:jar:tests:0.95.0-SNAPSHOT
(test), org.apache.hadoop:hadoop-client:jar:2.0.4-SNAPSHOT (compile), org.apache.hadoop:hadoop-annotations:jar:2.0.4-SNAPSHOT
(compile), org.apache.hadoop:hadoop-common:jar:2.0.4-SNAPSHOT (compile), com.yammer.metrics:metrics-core:jar:2.1.2
(compile), log4j:log4j:jar:1.2.17 (compile), org.apache.hadoop:hadoop-minicluster:jar:2.0.4-SNAPSHOT
(compile), com.github.stephenc.findbugs:findbugs-annotations:jar:1.3.9-1 (compile), junit:junit:jar:4.11
(test), org.mockito:mockito-all:jar:1.9.0 (test)]: Failed to read artifact descriptor for
org.apache.hadoop:hadoop-minicluster:jar:2.0.4-SNAPSHOT: Could not transfer artifact org.apache.hadoop:hadoop-minicluster:pom:2.0.4-SNAPSHOT
from/to apache release (https://repository.apache.org/content/repositories/releases/): Connection
to https://repository.apache.org refused: Connection refused -> [Help 1]
org.apache.maven.lifecycle.LifecycleExecutionException: Failed to execute goal on project
hbase-hadoop2-compat: Could not resolve dependencies for project org.apache.hbase:hbase-hadoop2-compat:jar:0.95.0-SNAPSHOT:
Failed to collect dependencies for [org.apache.hbase:hbase-hadoop-compat:jar:0.95.0-SNAPSHOT
(compile), org.apache.hbase:hbase-hadoop-compat:jar:tests:0.95.0-SNAPSHOT (test), org.apache.hadoop:hadoop-client:jar:2.0.4-SNAPSHOT
(compile), org.apache.hadoop:hadoop-annotations:jar:2.0.4-SNAPSHOT (compile), org.apache.hadoop:hadoop-common:jar:2.0.4-SNAPSHOT
(compile), com.yammer.metrics:metrics-core:jar:2.1.2 (compile), log4j:log4j:jar:1.2.17 (compile),
org.apache.hadoop:hadoop-minicluster:jar:2.0.4-SNAPSHOT (compile), com.github.stephenc.findbugs:findbugs-annotations:jar:1.3.9-1
(compile), junit:junit:jar:4.11 (test), org.mockito:mockito-all:jar:1.9.0 (test)]
	at org.apache.maven.lifecycle.internal.LifecycleDependencyResolver.getDependencies(LifecycleDependencyResolver.java:210)
	at org.apache.maven.lifecycle.internal.LifecycleDependencyResolver.resolveProjectDependencies(LifecycleDependencyResolver.java:117)
	at org.apache.maven.lifecycle.internal.MojoExecutor.ensureDependenciesAreResolved(MojoExecutor.java:258)
	at org.apache.maven.lifecycle.internal.MojoExecutor.execute(MojoExecutor.java:201)
	at org.apache.maven.lifecycle.internal.MojoExecutor.execute(MojoExecutor.java:153)
	at org.apache.maven.lifecycle.internal.MojoExecutor.execute(MojoExecutor.java:145)
	at org.apache.maven.lifecycle.internal.LifecycleModuleBuilder.buildProject(LifecycleModuleBuilder.java:84)
	at org.apache.maven.lifecycle.internal.LifecycleModuleBuilder.buildProject(LifecycleModuleBuilder.java:59)
	at org.apache.maven.lifecycle.internal.LifecycleStarter.singleThreadedBuild(LifecycleStarter.java:183)
	at org.apache.maven.lifecycle.internal.LifecycleStarter.execute(LifecycleStarter.java:161)
	at org.apache.maven.DefaultMaven.doExecute(DefaultMaven.java:320)
	at org.apache.maven.DefaultMaven.execute(DefaultMaven.java:156)
	at org.apache.maven.cli.MavenCli.execute(MavenCli.java:537)
	at org.apache.maven.cli.MavenCli.doMain(MavenCli.java:196)
	at org.apache.maven.cli.MavenCli.main(MavenCli.java:141)
	at sun.reflect.NativeMethodAccessorImpl.invoke0(Native Method)
	at sun.reflect.NativeMethodAccessorImpl.invoke(NativeMethodAccessorImpl.java:39)
	at sun.reflect.DelegatingMethodAccessorImpl.invoke(DelegatingMethodAccessorImpl.java:25)
	at java.lang.reflect.Method.invoke(Method.java:597)
	at org.codehaus.plexus.classworlds.launcher.Launcher.launchEnhanced(Launcher.java:290)
	at org.codehaus.plexus.classworlds.launcher.Launcher.launch(Launcher.java:230)
	at org.codehaus.plexus.classworlds.launcher.Launcher.mainWithExitCode(Launcher.java:409)
	at org.codehaus.plexus.classworlds.launcher.Launcher.main(Launcher.java:352)
Caused by: org.apache.maven.project.DependencyResolutionException: Could not resolve dependencies
for project org.apache.hbase:hbase-hadoop2-compat:jar:0.95.0-SNAPSHOT: Failed to collect dependencies
for [org.apache.hbase:hbase-hadoop-compat:jar:0.95.0-SNAPSHOT (compile), org.apache.hbase:hbase-hadoop-compat:jar:tests:0.95.0-SNAPSHOT
(test), org.apache.hadoop:hadoop-client:jar:2.0.4-SNAPSHOT (compile), org.apache.hadoop:hadoop-annotations:jar:2.0.4-SNAPSHOT
(compile), org.apache.hadoop:hadoop-common:jar:2.0.4-SNAPSHOT (compile), com.yammer.metrics:metrics-core:jar:2.1.2
(compile), log4j:log4j:jar:1.2.17 (compile), org.apache.hadoop:hadoop-minicluster:jar:2.0.4-SNAPSHOT
(compile), com.github.stephenc.findbugs:findbugs-annotations:jar:1.3.9-1 (compile), junit:junit:jar:4.11
(test), org.mockito:mockito-all:jar:1.9.0 (test)]
	at org.apache.maven.project.DefaultProjectDependenciesResolver.resolve(DefaultProjectDependenciesResolver.java:158)
	at org.apache.maven.lifecycle.internal.LifecycleDependencyResolver.getDependencies(LifecycleDependencyResolver.java:185)
	... 22 more
Caused by: org.sonatype.aether.collection.DependencyCollectionException: Failed to collect
dependencies for [org.apache.hbase:hbase-hadoop-compat:jar:0.95.0-SNAPSHOT (compile), org.apache.hbase:hbase-hadoop-compat:jar:tests:0.95.0-SNAPSHOT
(test), org.apache.hadoop:hadoop-client:jar:2.0.4-SNAPSHOT (compile), org.apache.hadoop:hadoop-annotations:jar:2.0.4-SNAPSHOT
(compile), org.apache.hadoop:hadoop-common:jar:2.0.4-SNAPSHOT (compile), com.yammer.metrics:metrics-core:jar:2.1.2
(compile), log4j:log4j:jar:1.2.17 (compile), org.apache.hadoop:hadoop-minicluster:jar:2.0.4-SNAPSHOT
(compile), com.github.stephenc.findbugs:findbugs-annotations:jar:1.3.9-1 (compile), junit:junit:jar:4.11
(test), org.mockito:mockito-all:jar:1.9.0 (test)]
	at org.sonatype.aether.impl.internal.DefaultDependencyCollector.collectDependencies(DefaultDependencyCollector.java:258)
	at org.sonatype.aether.impl.internal.DefaultRepositorySystem.collectDependencies(DefaultRepositorySystem.java:308)
	at org.apache.maven.project.DefaultProjectDependenciesResolver.resolve(DefaultProjectDependenciesResolver.java:150)
	... 23 more
Caused by: org.sonatype.aether.resolution.ArtifactDescriptorException: Failed to read artifact
descriptor for org.apache.hadoop:hadoop-minicluster:jar:2.0.4-SNAPSHOT
	at org.apache.maven.repository.internal.DefaultArtifactDescriptorReader.loadPom(DefaultArtifactDescriptorReader.java:296)
	at org.apache.maven.repository.internal.DefaultArtifactDescriptorReader.readArtifactDescriptor(DefaultArtifactDescriptorReader.java:186)
	at org.sonatype.aether.impl.internal.DefaultDependencyCollector.process(DefaultDependencyCollector.java:412)
	at org.sonatype.aether.impl.internal.DefaultDependencyCollector.collectDependencies(DefaultDependencyCollector.java:240)
	... 25 more
Caused by: org.sonatype.aether.resolution.ArtifactResolutionException: Could not transfer
artifact org.apache.hadoop:hadoop-minicluster:pom:2.0.4-SNAPSHOT from/to apache release (https://repository.apache.org/content/repositories/releases/):
Connection to https://repository.apache.org refused
	at org.sonatype.aether.impl.internal.DefaultArtifactResolver.resolve(DefaultArtifactResolver.java:538)
	at org.sonatype.aether.impl.internal.DefaultArtifactResolver.resolveArtifacts(DefaultArtifactResolver.java:216)
	at org.sonatype.aether.impl.internal.DefaultArtifactResolver.resolveArtifact(DefaultArtifactResolver.java:193)
	at org.apache.maven.repository.internal.DefaultArtifactDescriptorReader.loadPom(DefaultArtifactDescriptorReader.java:281)
	... 28 more
Caused by: org.sonatype.aether.transfer.ArtifactTransferException: Could not transfer artifact
org.apache.hadoop:hadoop-minicluster:pom:2.0.4-SNAPSHOT from/to apache release (https://repository.apache.org/content/repositories/releases/):
Connection to https://repository.apache.org refused
	at org.sonatype.aether.connector.wagon.WagonRepositoryConnector$4.wrap(WagonRepositoryConnector.java:951)
	at org.sonatype.aether.connector.wagon.WagonRepositoryConnector$4.wrap(WagonRepositoryConnector.java:941)
	at org.sonatype.aether.connector.wagon.WagonRepositoryConnector$GetTask.run(WagonRepositoryConnector.java:669)
	at org.sonatype.aether.util.concurrency.RunnableErrorForwarder$1.run(RunnableErrorForwarder.java:60)
	at java.util.concurrent.ThreadPoolExecutor$Worker.runTask(ThreadPoolExecutor.java:886)
	at java.util.concurrent.ThreadPoolExecutor$Worker.run(ThreadPoolExecutor.java:908)
	at java.lang.Thread.run(Thread.java:662)
Caused by: org.apache.maven.wagon.TransferFailedException: Connection to https://repository.apache.org
refused
	at org.apache.maven.wagon.shared.http4.AbstractHttpClientWagon.fillInputData(AbstractHttpClientWagon.java:799)
	at org.apache.maven.wagon.StreamWagon.getInputStream(StreamWagon.java:116)
	at org.apache.maven.wagon.StreamWagon.getIfNewer(StreamWagon.java:88)
	at org.apache.maven.wagon.StreamWagon.get(StreamWagon.java:61)
	at org.sonatype.aether.connector.wagon.WagonRepositoryConnector$GetTask.run(WagonRepositoryConnector.java:601)
	... 4 more
Caused by: org.apache.maven.wagon.providers.http.httpclient.conn.HttpHostConnectException:
Connection to https://repository.apache.org refused
	at org.apache.maven.wagon.providers.http.httpclient.impl.conn.DefaultClientConnectionOperator.openConnection(DefaultClientConnectionOperator.java:158)
	at org.apache.maven.wagon.providers.http.httpclient.impl.conn.AbstractPoolEntry.open(AbstractPoolEntry.java:149)
	at org.apache.maven.wagon.providers.http.httpclient.impl.conn.AbstractPooledConnAdapter.open(AbstractPooledConnAdapter.java:121)
	at org.apache.maven.wagon.providers.http.httpclient.impl.client.DefaultRequestDirector.tryConnect(DefaultRequestDirector.java:573)
	at org.apache.maven.wagon.providers.http.httpclient.impl.client.DefaultRequestDirector.execute(DefaultRequestDirector.java:425)
	at org.apache.maven.wagon.providers.http.httpclient.impl.client.AbstractHttpClient.execute(AbstractHttpClient.java:820)
	at org.apache.maven.wagon.providers.http.httpclient.impl.client.AbstractHttpClient.execute(AbstractHttpClient.java:754)
	at org.apache.maven.wagon.shared.http4.AbstractHttpClientWagon.execute(AbstractHttpClientWagon.java:674)
	at org.apache.maven.wagon.shared.http4.AbstractHttpClientWagon.fillInputData(AbstractHttpClientWagon.java:793)
	... 8 more
Caused by: java.net.ConnectException: Connection refused
	at java.net.PlainSocketImpl.socketConnect(Native Method)
	at java.net.PlainSocketImpl.doConnect(PlainSocketImpl.java:351)
	at java.net.PlainSocketImpl.connectToAddress(PlainSocketImpl.java:213)
	at java.net.PlainSocketImpl.connect(PlainSocketImpl.java:200)
	at java.net.SocksSocketImpl.connect(SocksSocketImpl.java:366)
	at java.net.Socket.connect(Socket.java:529)
	at com.sun.net.ssl.internal.ssl.SSLSocketImpl.connect(SSLSocketImpl.java:564)
	at org.apache.maven.wagon.providers.http.httpclient.conn.ssl.SSLSocketFactory.connectSocket(SSLSocketFactory.java:375)
	at org.apache.maven.wagon.providers.http.httpclient.impl.conn.DefaultClientConnectionOperator.openConnection(DefaultClientConnectionOperator.java:148)
	... 16 more
[ERROR] 
[ERROR] 
[ERROR] For more information about the errors and possible solutions, please read the following
articles:
[ERROR] [Help 1] http://cwiki.apache.org/confluence/display/MAVEN/DependencyResolutionException
[ERROR] 
[ERROR] After correcting the problems, you can resume the build with the command
[ERROR]   mvn <goals> -rf :hbase-hadoop2-compat
Build step 'Invoke top-level Maven targets' marked build as failure
Archiving artifacts
Recording test results
Updating HBASE-8232
Updating HBASE-7904

Mime
View raw message