hbase-dev mailing list archives

Site index · List index
Message view « Date » · « Thread »
Top « Date » · « Thread »
From Apache Jenkins Server <jenk...@builds.apache.org>
Subject Build failed in Jenkins: HBase-TRUNK #4036
Date Sun, 07 Apr 2013 22:03:38 GMT
See <https://builds.apache.org/job/HBase-TRUNK/4036/>

------------------------------------------
[...truncated 3701 lines...]
Tests run: 22, Failures: 0, Errors: 0, Skipped: 0, Time elapsed: 36.27 sec
Running org.apache.hadoop.hbase.regionserver.TestCompactionState
Tests run: 5, Failures: 0, Errors: 0, Skipped: 0, Time elapsed: 79.555 sec
Running org.apache.hadoop.hbase.regionserver.TestGetClosestAtOrBefore
Tests run: 3, Failures: 0, Errors: 0, Skipped: 0, Time elapsed: 0.857 sec
Running org.apache.hadoop.hbase.regionserver.TestRSKilledWhenMasterInitializing
Tests run: 1, Failures: 0, Errors: 0, Skipped: 0, Time elapsed: 33.725 sec
Running org.apache.hadoop.hbase.regionserver.TestAtomicOperation
Tests run: 5, Failures: 0, Errors: 0, Skipped: 0, Time elapsed: 18.026 sec
Running org.apache.hadoop.hbase.regionserver.TestHRegionBusyWait
Tests run: 63, Failures: 0, Errors: 0, Skipped: 0, Time elapsed: 39.625 sec
Running org.apache.hadoop.hbase.regionserver.TestRegionServerNoMaster
Tests run: 7, Failures: 0, Errors: 0, Skipped: 0, Time elapsed: 25.094 sec
Running org.apache.hadoop.hbase.regionserver.TestFSErrorsExposed
Tests run: 3, Failures: 0, Errors: 0, Skipped: 1, Time elapsed: 0.662 sec
Running org.apache.hadoop.hbase.regionserver.TestHRegionOnCluster
Tests run: 1, Failures: 0, Errors: 0, Skipped: 0, Time elapsed: 24.609 sec
Running org.apache.hadoop.hbase.regionserver.TestServerCustomProtocol
Tests run: 7, Failures: 0, Errors: 0, Skipped: 0, Time elapsed: 37.951 sec
Running org.apache.hadoop.hbase.regionserver.TestParallelPut
Tests run: 2, Failures: 0, Errors: 0, Skipped: 0, Time elapsed: 4.021 sec
Running org.apache.hadoop.hbase.regionserver.TestCompoundBloomFilter
Tests run: 3, Failures: 0, Errors: 0, Skipped: 0, Time elapsed: 16.614 sec
Running org.apache.hadoop.hbase.regionserver.TestPriorityRpc
Tests run: 3, Failures: 0, Errors: 0, Skipped: 0, Time elapsed: 0.959 sec
Running org.apache.hadoop.hbase.regionserver.TestSeekOptimizations
Tests run: 6, Failures: 0, Errors: 0, Skipped: 0, Time elapsed: 2.482 sec
Running org.apache.hadoop.hbase.regionserver.handler.TestCloseRegionHandler
Tests run: 3, Failures: 0, Errors: 0, Skipped: 0, Time elapsed: 1.286 sec
Running org.apache.hadoop.hbase.regionserver.handler.TestOpenRegionHandler
Tests run: 5, Failures: 0, Errors: 0, Skipped: 0, Time elapsed: 1.127 sec
Running org.apache.hadoop.hbase.regionserver.TestBlocksRead
Tests run: 4, Failures: 0, Errors: 0, Skipped: 0, Time elapsed: 1.231 sec
Running org.apache.hadoop.hbase.regionserver.TestSplitLogWorker
Tests run: 5, Failures: 0, Errors: 0, Skipped: 0, Time elapsed: 2.6 sec
Running org.apache.hadoop.hbase.regionserver.TestStoreScanner
Tests run: 16, Failures: 0, Errors: 0, Skipped: 0, Time elapsed: 0.393 sec
Running org.apache.hadoop.hbase.regionserver.TestCompaction
Tests run: 17, Failures: 0, Errors: 0, Skipped: 0, Time elapsed: 34.157 sec
Running org.apache.hadoop.hbase.regionserver.TestStoreFileBlockCacheSummary
Tests run: 1, Failures: 0, Errors: 0, Skipped: 0, Time elapsed: 12.395 sec
Running org.apache.hadoop.hbase.regionserver.TestHRegionServerBulkLoad
Tests run: 1, Failures: 0, Errors: 0, Skipped: 0, Time elapsed: 43.338 sec
Running org.apache.hadoop.hbase.regionserver.TestClusterId
Tests run: 1, Failures: 0, Errors: 0, Skipped: 0, Time elapsed: 23.019 sec
Running org.apache.hadoop.hbase.regionserver.TestRegionMergeTransactionOnCluster
Tests run: 2, Failures: 0, Errors: 0, Skipped: 0, Time elapsed: 19.789 sec
Running org.apache.hadoop.hbase.regionserver.TestEndToEndSplitTransaction
Tests run: 2, Failures: 0, Errors: 0, Skipped: 0, Time elapsed: 32.152 sec
Running org.apache.hadoop.hbase.regionserver.TestMultiColumnScanner
Tests run: 12, Failures: 0, Errors: 0, Skipped: 0, Time elapsed: 38.174 sec
Running org.apache.hadoop.hbase.regionserver.TestMasterAddressManager
Tests run: 1, Failures: 0, Errors: 0, Skipped: 0, Time elapsed: 0.548 sec
Running org.apache.hadoop.hbase.regionserver.TestJoinedScanners
Tests run: 1, Failures: 0, Errors: 0, Skipped: 0, Time elapsed: 443.639 sec
Running org.apache.hadoop.hbase.regionserver.TestHRegion
Tests run: 62, Failures: 0, Errors: 0, Skipped: 0, Time elapsed: 39.638 sec
Running org.apache.hadoop.hbase.backup.example.TestZooKeeperTableArchiveClient
Tests run: 3, Failures: 0, Errors: 0, Skipped: 0, Time elapsed: 5.555 sec
Running org.apache.hadoop.hbase.TestLocalHBaseCluster
Tests run: 1, Failures: 0, Errors: 0, Skipped: 0, Time elapsed: 11.186 sec
Running org.apache.hadoop.hbase.security.token.TestTokenAuthentication
Tests run: 2, Failures: 0, Errors: 0, Skipped: 0, Time elapsed: 1.169 sec
Running org.apache.hadoop.hbase.security.token.TestZKSecretWatcher
Tests run: 1, Failures: 0, Errors: 0, Skipped: 0, Time elapsed: 15.388 sec
Running org.apache.hadoop.hbase.security.access.TestAccessControlFilter
Tests run: 1, Failures: 0, Errors: 0, Skipped: 0, Time elapsed: 10.626 sec
Running org.apache.hadoop.hbase.security.access.TestZKPermissionsWatcher
Tests run: 1, Failures: 0, Errors: 0, Skipped: 0, Time elapsed: 9.658 sec
Running org.apache.hadoop.hbase.security.access.TestTablePermissions
Tests run: 7, Failures: 0, Errors: 0, Skipped: 0, Time elapsed: 24.317 sec
Running org.apache.hadoop.hbase.backup.TestHFileArchiving
Tests run: 5, Failures: 0, Errors: 0, Skipped: 0, Time elapsed: 128.346 sec
Running org.apache.hadoop.hbase.TestFullLogReconstruction
Tests run: 1, Failures: 0, Errors: 0, Skipped: 0, Time elapsed: 41.342 sec
Running org.apache.hadoop.hbase.ipc.TestDelayedRpc
Tests run: 4, Failures: 0, Errors: 0, Skipped: 0, Time elapsed: 2.603 sec
Running org.apache.hadoop.hbase.ipc.TestHBaseClient
Tests run: 1, Failures: 0, Errors: 0, Skipped: 0, Time elapsed: 0.204 sec
Running org.apache.hadoop.hbase.ipc.TestProtoBufRpc
Tests run: 1, Failures: 0, Errors: 0, Skipped: 0, Time elapsed: 0.758 sec
Running org.apache.hadoop.hbase.TestGlobalMemStoreSize
Tests run: 1, Failures: 0, Errors: 0, Skipped: 0, Time elapsed: 13.414 sec
Running org.apache.hadoop.hbase.constraint.TestConstraint
Tests run: 5, Failures: 0, Errors: 0, Skipped: 0, Time elapsed: 23.94 sec
Running org.apache.hadoop.hbase.rest.TestSchemaResource
Tests run: 2, Failures: 0, Errors: 0, Skipped: 0, Time elapsed: 16.565 sec
Running org.apache.hadoop.hbase.rest.client.TestRemoteAdmin
Tests run: 1, Failures: 0, Errors: 0, Skipped: 0, Time elapsed: 13.181 sec
Running org.apache.hadoop.hbase.security.access.TestAccessController
Tests run: 37, Failures: 1, Errors: 0, Skipped: 0, Time elapsed: 153.629 sec <<<
FAILURE!
Running org.apache.hadoop.hbase.rest.client.TestRemoteTable
Tests run: 4, Failures: 0, Errors: 0, Skipped: 0, Time elapsed: 10.901 sec
Running org.apache.hadoop.hbase.rest.TestTableResource
Tests run: 8, Failures: 0, Errors: 0, Skipped: 0, Time elapsed: 18.614 sec
Running org.apache.hadoop.hbase.rest.TestMultiRowResource
Tests run: 3, Failures: 0, Errors: 0, Skipped: 0, Time elapsed: 10.998 sec
Running org.apache.hadoop.hbase.rest.TestGzipFilter
Tests run: 2, Failures: 0, Errors: 0, Skipped: 0, Time elapsed: 11.045 sec
Running org.apache.hadoop.hbase.rest.TestRowResource
Tests run: 12, Failures: 0, Errors: 0, Skipped: 0, Time elapsed: 12.703 sec
Running org.apache.hadoop.hbase.rest.TestVersionResource
Tests run: 7, Failures: 0, Errors: 0, Skipped: 0, Time elapsed: 9.962 sec
Running org.apache.hadoop.hbase.rest.TestScannerResource
Tests run: 5, Failures: 0, Errors: 0, Skipped: 0, Time elapsed: 21.218 sec
Running org.apache.hadoop.hbase.rest.TestStatusResource
Tests run: 2, Failures: 0, Errors: 0, Skipped: 0, Time elapsed: 9.645 sec
Running org.apache.hadoop.hbase.rest.TestScannersWithFilters
Tests run: 10, Failures: 0, Errors: 0, Skipped: 0, Time elapsed: 14.326 sec
Running org.apache.hadoop.hbase.trace.TestHTraceHooks
Tests run: 1, Failures: 0, Errors: 0, Skipped: 0, Time elapsed: 11.598 sec
Running org.apache.hadoop.hbase.io.hfile.TestHFileSeek
Tests run: 1, Failures: 0, Errors: 0, Skipped: 0, Time elapsed: 5.278 sec
Running org.apache.hadoop.hbase.io.hfile.TestHFileBlockIndex
Tests run: 10, Failures: 0, Errors: 0, Skipped: 0, Time elapsed: 7.574 sec
Running org.apache.hadoop.hbase.io.hfile.TestHFilePerformance
Tests run: 1, Failures: 0, Errors: 0, Skipped: 0, Time elapsed: 4.163 sec
Running org.apache.hadoop.hbase.io.hfile.TestForceCacheImportantBlocks
Tests run: 2, Failures: 0, Errors: 0, Skipped: 0, Time elapsed: 18.788 sec
Running org.apache.hadoop.hbase.io.hfile.TestCacheOnWrite
Tests run: 36, Failures: 0, Errors: 0, Skipped: 0, Time elapsed: 25.011 sec
Running org.apache.hadoop.hbase.io.hfile.TestScannerSelectionUsingTTL
Tests run: 6, Failures: 0, Errors: 0, Skipped: 0, Time elapsed: 61.482 sec
Running org.apache.hadoop.hbase.io.hfile.TestHFileBlock
Tests run: 14, Failures: 0, Errors: 0, Skipped: 0, Time elapsed: 49.036 sec
Running org.apache.hadoop.hbase.io.hfile.slab.TestSlabCache
Tests run: 7, Failures: 0, Errors: 0, Skipped: 0, Time elapsed: 12.42 sec
Running org.apache.hadoop.hbase.io.hfile.slab.TestSingleSizeCache
Tests run: 5, Failures: 0, Errors: 0, Skipped: 0, Time elapsed: 14.449 sec
Running org.apache.hadoop.hbase.io.TestFileLink
Tests run: 3, Failures: 0, Errors: 0, Skipped: 0, Time elapsed: 11.607 sec
Running org.apache.hadoop.hbase.io.encoding.TestEncodedSeekers
Tests run: 10, Failures: 0, Errors: 0, Skipped: 0, Time elapsed: 29.585 sec
Running org.apache.hadoop.hbase.io.encoding.TestDataBlockEncoders
Tests run: 12, Failures: 0, Errors: 0, Skipped: 0, Time elapsed: 87.011 sec
Running org.apache.hadoop.hbase.io.encoding.TestBufferedDataBlockEncoder
Tests run: 1, Failures: 0, Errors: 0, Skipped: 0, Time elapsed: 19.038 sec
Running org.apache.hadoop.hbase.io.encoding.TestLoadAndSwitchEncodeOnDisk
Tests run: 1, Failures: 0, Errors: 0, Skipped: 0, Time elapsed: 22.448 sec
Running org.apache.hadoop.hbase.io.encoding.TestChangingEncoding
Tests run: 4, Failures: 0, Errors: 0, Skipped: 0, Time elapsed: 165.682 sec
Running org.apache.hadoop.hbase.TestRegionRebalancing
Tests run: 2, Failures: 0, Errors: 0, Skipped: 0, Time elapsed: 29.498 sec
Running org.apache.hadoop.hbase.mapred.TestTableInputFormat
Tests run: 10, Failures: 0, Errors: 0, Skipped: 0, Time elapsed: 21.789 sec
Running org.apache.hadoop.hbase.replication.TestReplicationDisableInactivePeer
Tests run: 1, Failures: 0, Errors: 0, Skipped: 0, Time elapsed: 50.938 sec
Running org.apache.hadoop.hbase.mapred.TestTableMapReduce
Tests run: 1, Failures: 0, Errors: 0, Skipped: 0, Time elapsed: 63.156 sec
Running org.apache.hadoop.hbase.replication.TestReplicationQueueFailoverCompressed
Tests run: 1, Failures: 0, Errors: 0, Skipped: 0, Time elapsed: 46.379 sec
Running org.apache.hadoop.hbase.replication.TestReplicationZookeeper
Tests run: 4, Failures: 0, Errors: 0, Skipped: 0, Time elapsed: 0.625 sec
Running org.apache.hadoop.hbase.replication.TestReplicationQueueFailover
Tests run: 1, Failures: 0, Errors: 0, Skipped: 0, Time elapsed: 51.234 sec
Running org.apache.hadoop.hbase.replication.regionserver.TestReplicationSourceManager
Tests run: 3, Failures: 0, Errors: 0, Skipped: 0, Time elapsed: 1.081 sec
Running org.apache.hadoop.hbase.replication.TestReplicationSource
Tests run: 1, Failures: 0, Errors: 0, Skipped: 0, Time elapsed: 2.45 sec
Running org.apache.hadoop.hbase.replication.regionserver.TestReplicationSink
Tests run: 5, Failures: 0, Errors: 0, Skipped: 0, Time elapsed: 11.987 sec
Running org.apache.hadoop.hbase.replication.TestReplicationStateZKImpl
Tests run: 2, Failures: 0, Errors: 0, Skipped: 0, Time elapsed: 0.883 sec
Running org.apache.hadoop.hbase.replication.TestMultiSlaveReplication
Tests run: 1, Failures: 0, Errors: 0, Skipped: 0, Time elapsed: 33.525 sec
Running org.apache.hadoop.hbase.replication.TestReplicationSmallTests
Tests run: 8, Failures: 0, Errors: 0, Skipped: 0, Time elapsed: 68.647 sec
Running org.apache.hadoop.hbase.replication.TestMasterReplication
Tests run: 2, Failures: 0, Errors: 0, Skipped: 0, Time elapsed: 48.123 sec
Running org.apache.hadoop.hbase.util.TestFSTableDescriptors
Tests run: 12, Failures: 0, Errors: 0, Skipped: 0, Time elapsed: 0.966 sec
Running org.apache.hadoop.hbase.util.TestMergeTool
Tests run: 1, Failures: 0, Errors: 0, Skipped: 0, Time elapsed: 25.039 sec
Running org.apache.hadoop.hbase.util.TestIdLock
Tests run: 1, Failures: 0, Errors: 0, Skipped: 0, Time elapsed: 15.37 sec
Running org.apache.hadoop.hbase.util.TestMergeTable
Tests run: 1, Failures: 0, Errors: 0, Skipped: 0, Time elapsed: 22.156 sec
Running org.apache.hadoop.hbase.util.TestMiniClusterLoadSequential
Tests run: 4, Failures: 0, Errors: 0, Skipped: 0, Time elapsed: 79.169 sec
Running org.apache.hadoop.hbase.util.TestMiniClusterLoadParallel
Tests run: 4, Failures: 0, Errors: 0, Skipped: 0, Time elapsed: 73.967 sec
Running org.apache.hadoop.hbase.util.TestFSUtils
Tests run: 6, Failures: 0, Errors: 0, Skipped: 0, Time elapsed: 18.597 sec
Running org.apache.hadoop.hbase.util.TestRegionSplitter
Tests run: 5, Failures: 0, Errors: 0, Skipped: 0, Time elapsed: 12.26 sec
Running org.apache.hadoop.hbase.util.TestProcessBasedCluster
Tests run: 1, Failures: 0, Errors: 0, Skipped: 0, Time elapsed: 0.357 sec
Running org.apache.hadoop.hbase.util.TestMiniClusterLoadEncoded
Tests run: 5, Failures: 0, Errors: 0, Skipped: 0, Time elapsed: 56.389 sec
Running org.apache.hadoop.hbase.util.TestCoprocessorScanPolicy
Tests run: 4, Failures: 0, Errors: 0, Skipped: 0, Time elapsed: 20.246 sec
Running org.apache.hadoop.hbase.util.TestFSVisitor
Tests run: 3, Failures: 0, Errors: 0, Skipped: 0, Time elapsed: 1.638 sec
Running org.apache.hadoop.hbase.util.hbck.TestOfflineMetaRebuildBase
Tests run: 1, Failures: 0, Errors: 0, Skipped: 0, Time elapsed: 20.304 sec
Running org.apache.hadoop.hbase.util.hbck.TestOfflineMetaRebuildOverlap
Tests run: 1, Failures: 0, Errors: 0, Skipped: 0, Time elapsed: 19.569 sec
Running org.apache.hadoop.hbase.util.hbck.TestOfflineMetaRebuildHole
Tests run: 1, Failures: 0, Errors: 0, Skipped: 0, Time elapsed: 19.699 sec
Running org.apache.hadoop.hbase.util.TestDefaultEnvironmentEdge
Tests run: 1, Failures: 0, Errors: 0, Skipped: 0, Time elapsed: 0.181 sec
Running org.apache.hadoop.hbase.TestInfoServers
Tests run: 3, Failures: 0, Errors: 0, Skipped: 0, Time elapsed: 10.534 sec
Running org.apache.hadoop.hbase.util.TestHBaseFsck
Tests run: 35, Failures: 0, Errors: 0, Skipped: 1, Time elapsed: 220.884 sec

Results :

Failed tests:   testAddColumn(org.apache.hadoop.hbase.security.access.TestAccessController):
Expected action to pass for user 'tbl_create' but was denied

Tests run: 1481, Failures: 1, Errors: 0, Skipped: 13

[INFO] ------------------------------------------------------------------------
[INFO] Reactor Summary:
[INFO] 
[INFO] HBase ............................................. SUCCESS [3.259s]
[INFO] HBase - Common .................................... SUCCESS [17.089s]
[INFO] HBase - Protocol .................................. SUCCESS [12.460s]
[INFO] HBase - Client .................................... SUCCESS [7.572s]
[INFO] HBase - Prefix Tree ............................... SUCCESS [2.493s]
[INFO] HBase - Hadoop Compatibility ...................... SUCCESS [0.668s]
[INFO] HBase - Hadoop One Compatibility .................. SUCCESS [1.428s]
[INFO] HBase - Server .................................... FAILURE [1:25:44.226s]
[INFO] HBase - Integration Tests ......................... SKIPPED
[INFO] HBase - Examples .................................. SKIPPED
[INFO] HBase - Assembly .................................. SKIPPED
[INFO] ------------------------------------------------------------------------
[INFO] BUILD FAILURE
[INFO] ------------------------------------------------------------------------
[INFO] Total time: 1:26:29.655s
[INFO] Finished at: Sun Apr 07 22:03:10 UTC 2013
[INFO] Final Memory: 42M/1228M
[INFO] ------------------------------------------------------------------------
[ERROR] Failed to execute goal org.apache.maven.plugins:maven-surefire-plugin:2.12-TRUNK-HBASE-2:test
(secondPartTestsExecution) on project hbase-server: There are test failures.
[ERROR] 
[ERROR] Please refer to /x1/jenkins/jenkins-slave/workspace/HBase-TRUNK/trunk/hbase-server/target/surefire-reports
for the individual test results.
[ERROR] -> [Help 1]
[ERROR] 
[ERROR] To see the full stack trace of the errors, re-run Maven with the -e switch.
[ERROR] Re-run Maven using the -X switch to enable full debug logging.
[ERROR] 
[ERROR] For more information about the errors and possible solutions, please read the following
articles:
[ERROR] [Help 1] http://cwiki.apache.org/confluence/display/MAVEN/MojoFailureException
[ERROR] 
[ERROR] After correcting the problems, you can resume the build with the command
[ERROR]   mvn <goals> -rf :hbase-server
Build step 'Invoke top-level Maven targets' marked build as failure
Archiving artifacts
Recording test results

Mime
View raw message