hbase-dev mailing list archives

Site index · List index
Message view « Date » · « Thread »
Top « Date » · « Thread »
From apurt...@apache.org
Subject Build failed in Jenkins: HBase-0.95-Hadoop-2 #141
Date Fri, 19 Apr 2013 01:20:47 GMT
See <http://54.241.6.143/job/HBase-0.95-Hadoop-2/141/>

------------------------------------------
[...truncated 7775 lines...]
Tests run: 3, Failures: 0, Errors: 0, Skipped: 0, Time elapsed: 7.9 sec
Running org.apache.hadoop.hbase.regionserver.TestGetClosestAtOrBefore
Tests run: 3, Failures: 0, Errors: 0, Skipped: 0, Time elapsed: 5.806 sec
Running org.apache.hadoop.hbase.regionserver.TestCompoundBloomFilter
Tests run: 3, Failures: 0, Errors: 0, Skipped: 0, Time elapsed: 44.548 sec
Running org.apache.hadoop.hbase.regionserver.TestRegionServerNoMaster
Tests run: 7, Failures: 0, Errors: 0, Skipped: 0, Time elapsed: 35.086 sec
Running org.apache.hadoop.hbase.regionserver.TestSplitTransactionOnCluster
Tests run: 9, Failures: 0, Errors: 0, Skipped: 0, Time elapsed: 63.176 sec
Running org.apache.hadoop.hbase.regionserver.TestMemStore
Tests run: 22, Failures: 0, Errors: 0, Skipped: 0, Time elapsed: 42.244 sec
Running org.apache.hadoop.hbase.regionserver.TestClusterId
Tests run: 1, Failures: 0, Errors: 0, Skipped: 0, Time elapsed: 30.983 sec
Running org.apache.hadoop.hbase.regionserver.TestCompactionState
Tests run: 5, Failures: 0, Errors: 0, Skipped: 0, Time elapsed: 56.293 sec
Running org.apache.hadoop.hbase.security.token.TestTokenAuthentication
Tests run: 2, Failures: 0, Errors: 0, Skipped: 0, Time elapsed: 6.265 sec
Running org.apache.hadoop.hbase.regionserver.TestCompaction
Tests run: 17, Failures: 0, Errors: 0, Skipped: 0, Time elapsed: 109.05 sec
Running org.apache.hadoop.hbase.security.token.TestZKSecretWatcher
Tests run: 1, Failures: 0, Errors: 0, Skipped: 0, Time elapsed: 18.755 sec
Running org.apache.hadoop.hbase.regionserver.TestRegionServerMetrics
Tests run: 9, Failures: 0, Errors: 0, Skipped: 0, Time elapsed: 28.102 sec
Running org.apache.hadoop.hbase.security.access.TestZKPermissionsWatcher
Tests run: 1, Failures: 0, Errors: 0, Skipped: 0, Time elapsed: 17.337 sec
Running org.apache.hadoop.hbase.security.access.TestAccessControlFilter
Tests run: 1, Failures: 0, Errors: 0, Skipped: 0, Time elapsed: 20.377 sec
Running org.apache.hadoop.hbase.zookeeper.TestZooKeeperACL
Tests run: 5, Failures: 0, Errors: 0, Skipped: 0, Time elapsed: 10.72 sec
Running org.apache.hadoop.hbase.security.access.TestTablePermissions
Tests run: 7, Failures: 0, Errors: 0, Skipped: 0, Time elapsed: 31.405 sec
Running org.apache.hadoop.hbase.zookeeper.TestRecoverableZooKeeper
Tests run: 1, Failures: 0, Errors: 0, Skipped: 0, Time elapsed: 4.032 sec
Running org.apache.hadoop.hbase.zookeeper.TestZKLeaderManager
Tests run: 1, Failures: 0, Errors: 0, Skipped: 0, Time elapsed: 2.461 sec
Running org.apache.hadoop.hbase.TestMultiVersions
Tests run: 3, Failures: 0, Errors: 0, Skipped: 0, Time elapsed: 23.621 sec
Running org.apache.hadoop.hbase.zookeeper.TestZooKeeperNodeTracker
Tests run: 3, Failures: 0, Errors: 0, Skipped: 0, Time elapsed: 2.681 sec
Running org.apache.hadoop.hbase.zookeeper.TestHQuorumPeer
Tests run: 3, Failures: 0, Errors: 0, Skipped: 0, Time elapsed: 2.864 sec
Running org.apache.hadoop.hbase.zookeeper.TestZKTable
Tests run: 1, Failures: 0, Errors: 0, Skipped: 0, Time elapsed: 1.995 sec
Running org.apache.hadoop.hbase.zookeeper.TestZKMulti
Tests run: 6, Failures: 0, Errors: 0, Skipped: 0, Time elapsed: 2.004 sec
Running org.apache.hadoop.hbase.procedure.TestZKProcedureControllers
Tests run: 4, Failures: 0, Errors: 0, Skipped: 0, Time elapsed: 4.406 sec
Running org.apache.hadoop.hbase.procedure.TestZKProcedure
Tests run: 4, Failures: 0, Errors: 0, Skipped: 0, Time elapsed: 3.826 sec
Running org.apache.hadoop.hbase.TestInfoServers
Tests run: 3, Failures: 0, Errors: 0, Skipped: 0, Time elapsed: 17.08 sec
Running org.apache.hadoop.hbase.zookeeper.lock.TestZKInterProcessReadWriteLock
Tests run: 6, Failures: 0, Errors: 0, Skipped: 0, Time elapsed: 27.399 sec
Running org.apache.hadoop.hbase.snapshot.TestSnapshotDescriptionUtils
Tests run: 2, Failures: 0, Errors: 0, Skipped: 0, Time elapsed: 2.41 sec
Running org.apache.hadoop.hbase.regionserver.TestCompactionWithCoprocessor
Tests run: 17, Failures: 0, Errors: 0, Skipped: 0, Time elapsed: 101.585 sec
Running org.apache.hadoop.hbase.master.TestZKBasedOpenCloseRegion
Tests run: 4, Failures: 0, Errors: 0, Skipped: 0, Time elapsed: 27.686 sec
Running org.apache.hadoop.hbase.snapshot.TestFlushSnapshotFromClient
Tests run: 5, Failures: 0, Errors: 0, Skipped: 0, Time elapsed: 47.717 sec
Running org.apache.hadoop.hbase.snapshot.TestExportSnapshot
Tests run: 3, Failures: 0, Errors: 0, Skipped: 0, Time elapsed: 42.889 sec
Running org.apache.hadoop.hbase.master.cleaner.TestLogsCleaner
Tests run: 1, Failures: 0, Errors: 0, Skipped: 0, Time elapsed: 15.583 sec
Running org.apache.hadoop.hbase.master.cleaner.TestHFileCleaner
Tests run: 3, Failures: 0, Errors: 0, Skipped: 0, Time elapsed: 9.768 sec
Running org.apache.hadoop.hbase.master.TestRollingRestart
Tests run: 1, Failures: 0, Errors: 0, Skipped: 0, Time elapsed: 46.405 sec
Running org.apache.hadoop.hbase.master.cleaner.TestSnapshotFromMaster
Tests run: 4, Failures: 0, Errors: 0, Skipped: 0, Time elapsed: 38.433 sec
Running org.apache.hadoop.hbase.snapshot.TestRestoreFlushSnapshotFromClient
Tests run: 5, Failures: 0, Errors: 0, Skipped: 0, Time elapsed: 101.643 sec
Running org.apache.hadoop.hbase.security.access.TestAccessController
Tests run: 37, Failures: 0, Errors: 0, Skipped: 0, Time elapsed: 195.436 sec
Running org.apache.hadoop.hbase.master.TestMasterMetrics
Tests run: 2, Failures: 0, Errors: 0, Skipped: 0, Time elapsed: 27.686 sec
Running org.apache.hadoop.hbase.master.handler.TestTableDescriptorModification
Tests run: 3, Failures: 0, Errors: 0, Skipped: 0, Time elapsed: 19.961 sec
Running org.apache.hadoop.hbase.master.handler.TestCreateTableHandler
Tests run: 2, Failures: 0, Errors: 0, Skipped: 0, Time elapsed: 21.281 sec
Running org.apache.hadoop.hbase.master.handler.TestTableDeleteFamilyHandler
Tests run: 1, Failures: 0, Errors: 0, Skipped: 0, Time elapsed: 29.126 sec
Running org.apache.hadoop.hbase.master.TestMasterRestartAfterDisablingTable
Tests run: 1, Failures: 0, Errors: 0, Skipped: 0, Time elapsed: 19.287 sec
Running org.apache.hadoop.hbase.master.TestOpenedRegionHandler
Tests run: 2, Failures: 0, Errors: 0, Skipped: 0, Time elapsed: 17.866 sec
Running org.apache.hadoop.hbase.master.TestSplitLogManager
Tests run: 13, Failures: 0, Errors: 0, Skipped: 0, Time elapsed: 85.718 sec
Running org.apache.hadoop.hbase.master.TestAssignmentManager
Tests run: 15, Failures: 0, Errors: 0, Skipped: 0, Time elapsed: 7.89 sec
Running org.apache.hadoop.hbase.master.TestClusterStatusPublisher
Tests run: 3, Failures: 0, Errors: 0, Skipped: 0, Time elapsed: 0.692 sec
Running org.apache.hadoop.hbase.master.balancer.TestDefaultLoadBalancer
Tests run: 1, Failures: 0, Errors: 0, Skipped: 0, Time elapsed: 3.687 sec
Running org.apache.hadoop.hbase.master.TestMasterFailover
Tests run: 4, Failures: 0, Errors: 0, Skipped: 0, Time elapsed: 53.834 sec
Running org.apache.hadoop.hbase.master.balancer.TestBaseLoadBalancer
Tests run: 3, Failures: 0, Errors: 0, Skipped: 0, Time elapsed: 2.226 sec
Running org.apache.hadoop.hbase.master.TestMasterTransitions
Tests run: 3, Failures: 0, Errors: 0, Skipped: 3, Time elapsed: 21.794 sec
Running org.apache.hadoop.hbase.master.TestMasterStatusServlet
Tests run: 4, Failures: 0, Errors: 0, Skipped: 0, Time elapsed: 4.63 sec
Running org.apache.hadoop.hbase.master.TestMasterFailoverBalancerPersistence
Tests run: 1, Failures: 0, Errors: 0, Skipped: 0, Time elapsed: 17.847 sec
Running org.apache.hadoop.hbase.master.TestHMasterRPCException
Tests run: 1, Failures: 0, Errors: 0, Skipped: 0, Time elapsed: 4.201 sec
Running org.apache.hadoop.hbase.master.TestMasterNoCluster
Tests run: 3, Failures: 0, Errors: 0, Skipped: 0, Time elapsed: 9.224 sec
Running org.apache.hadoop.hbase.master.TestMaster
Tests run: 4, Failures: 0, Errors: 0, Skipped: 0, Time elapsed: 29.761 sec
Running org.apache.hadoop.hbase.master.TestDeadServer
Tests run: 3, Failures: 0, Errors: 0, Skipped: 0, Time elapsed: 0.615 sec
Running org.apache.hadoop.hbase.master.TestRestartCluster
Tests run: 2, Failures: 0, Errors: 0, Skipped: 0, Time elapsed: 35.187 sec
Running org.apache.hadoop.hbase.master.TestActiveMasterManager
Tests run: 2, Failures: 0, Errors: 0, Skipped: 0, Time elapsed: 2.835 sec
Running org.apache.hadoop.hbase.master.TestAssignmentManagerOnCluster
Tests run: 7, Failures: 0, Errors: 0, Skipped: 0, Time elapsed: 41.305 sec
Running org.apache.hadoop.hbase.master.TestMasterMetricsWrapper
Tests run: 1, Failures: 0, Errors: 0, Skipped: 0, Time elapsed: 15.95 sec
Running org.apache.hadoop.hbase.master.balancer.TestStochasticLoadBalancer
Tests run: 9, Failures: 0, Errors: 0, Skipped: 1, Time elapsed: 74.175 sec
Running org.apache.hadoop.hbase.master.TestMasterFileSystem
Tests run: 1, Failures: 0, Errors: 0, Skipped: 0, Time elapsed: 15.239 sec
Running org.apache.hadoop.hbase.master.snapshot.TestSnapshotFileCache
Tests run: 4, Failures: 0, Errors: 0, Skipped: 0, Time elapsed: 7.115 sec
Running org.apache.hadoop.hbase.master.TestMasterShutdown
Tests run: 1, Failures: 0, Errors: 0, Skipped: 0, Time elapsed: 18.593 sec
Running org.apache.hadoop.hbase.master.TestDistributedLogSplitting
Tests run: 4, Failures: 0, Errors: 0, Skipped: 0, Time elapsed: 204.572 sec
Running org.apache.hadoop.hbase.master.TestTableLockManager
Tests run: 5, Failures: 0, Errors: 0, Skipped: 0, Time elapsed: 189.531 sec

Results :

Failed tests:   testWALPlayer(org.apache.hadoop.hbase.mapreduce.TestWALPlayer): expected:<0>
but was:<1>
  testExcludeAllFromMinorCompaction(org.apache.hadoop.hbase.mapreduce.TestHFileOutputFormat)

Tests in error: 
  org.apache.hadoop.hbase.mapreduce.TestMultithreadedTableMapper: Failed to Start org.apache.hadoop.mapred.MiniMRCluster

Tests run: 1456, Failures: 2, Errors: 1, Skipped: 14

[JENKINS] Recording test results
[INFO]                                                                         
[INFO] ------------------------------------------------------------------------
[INFO] Skipping HBase
[INFO] This project has been banned from the build due to previous failures.
[INFO] ------------------------------------------------------------------------
[INFO]                                                                         
[INFO] ------------------------------------------------------------------------
[INFO] Skipping HBase
[INFO] This project has been banned from the build due to previous failures.
[INFO] ------------------------------------------------------------------------
[INFO] ------------------------------------------------------------------------
[INFO] Reactor Summary:
[INFO] 
[INFO] HBase ............................................. SUCCESS [40.381s]
[INFO] HBase - Common .................................... SUCCESS [1:40.957s]
[INFO] HBase - Protocol .................................. SUCCESS [18.347s]
[INFO] HBase - Client .................................... SUCCESS [12.912s]
[INFO] HBase - Prefix Tree ............................... SUCCESS [5.476s]
[INFO] HBase - Hadoop Compatibility ...................... SUCCESS [1.455s]
[INFO] HBase - Hadoop Two Compatibility .................. SUCCESS [15.250s]
[INFO] HBase - Server .................................... FAILURE [59:23.195s]
[INFO] HBase - Integration Tests ......................... SKIPPED
[INFO] HBase - Examples .................................. SKIPPED
[INFO] HBase - Assembly .................................. SKIPPED
[INFO] ------------------------------------------------------------------------
[INFO] BUILD FAILURE
[INFO] ------------------------------------------------------------------------
[INFO] Total time: 1:03:10.840s
[INFO] Finished at: Fri Apr 19 01:20:17 UTC 2013
[INFO] Final Memory: 136M/1007M
[INFO] ------------------------------------------------------------------------
[JENKINS] Archiving <http://54.241.6.143/job/HBase-0.95-Hadoop-2/ws/hbase-hadoop2-compat/pom.xml>
to /var/lib/jenkins/jobs/HBase-0.95-Hadoop-2/modules/org.apache.hbase$hbase-hadoop2-compat/builds/2013-04-19_00-17-00/archive/org.apache.hbase/hbase-hadoop2-compat/0.97.0-SNAPSHOT/hbase-hadoop2-compat-0.97.0-SNAPSHOT.pom
[JENKINS] Archiving <http://54.241.6.143/job/HBase-0.95-Hadoop-2/ws/hbase-hadoop2-compat/target/hbase-hadoop2-compat-0.97.0-SNAPSHOT.jar>
to /var/lib/jenkins/jobs/HBase-0.95-Hadoop-2/modules/org.apache.hbase$hbase-hadoop2-compat/builds/2013-04-19_00-17-00/archive/org.apache.hbase/hbase-hadoop2-compat/0.97.0-SNAPSHOT/hbase-hadoop2-compat-0.97.0-SNAPSHOT.jar
[JENKINS] Archiving <http://54.241.6.143/job/HBase-0.95-Hadoop-2/ws/hbase-hadoop2-compat/target/hbase-hadoop2-compat-0.97.0-SNAPSHOT-sources.jar>
to /var/lib/jenkins/jobs/HBase-0.95-Hadoop-2/modules/org.apache.hbase$hbase-hadoop2-compat/builds/2013-04-19_00-17-00/archive/org.apache.hbase/hbase-hadoop2-compat/0.97.0-SNAPSHOT/hbase-hadoop2-compat-0.97.0-SNAPSHOT-sources.jar
[JENKINS] Archiving <http://54.241.6.143/job/HBase-0.95-Hadoop-2/ws/hbase-hadoop2-compat/target/hbase-hadoop2-compat-0.97.0-SNAPSHOT-tests.jar>
to /var/lib/jenkins/jobs/HBase-0.95-Hadoop-2/modules/org.apache.hbase$hbase-hadoop2-compat/builds/2013-04-19_00-17-00/archive/org.apache.hbase/hbase-hadoop2-compat/0.97.0-SNAPSHOT/hbase-hadoop2-compat-0.97.0-SNAPSHOT-tests.jar
[JENKINS] Archiving <http://54.241.6.143/job/HBase-0.95-Hadoop-2/ws/hbase-common/pom.xml>
to /var/lib/jenkins/jobs/HBase-0.95-Hadoop-2/modules/org.apache.hbase$hbase-common/builds/2013-04-19_00-17-00/archive/org.apache.hbase/hbase-common/0.97.0-SNAPSHOT/hbase-common-0.97.0-SNAPSHOT.pom
[JENKINS] Archiving <http://54.241.6.143/job/HBase-0.95-Hadoop-2/ws/hbase-common/target/hbase-common-0.97.0-SNAPSHOT.jar>
to /var/lib/jenkins/jobs/HBase-0.95-Hadoop-2/modules/org.apache.hbase$hbase-common/builds/2013-04-19_00-17-00/archive/org.apache.hbase/hbase-common/0.97.0-SNAPSHOT/hbase-common-0.97.0-SNAPSHOT.jar
[JENKINS] Archiving <http://54.241.6.143/job/HBase-0.95-Hadoop-2/ws/hbase-common/target/hbase-common-0.97.0-SNAPSHOT-sources.jar>
to /var/lib/jenkins/jobs/HBase-0.95-Hadoop-2/modules/org.apache.hbase$hbase-common/builds/2013-04-19_00-17-00/archive/org.apache.hbase/hbase-common/0.97.0-SNAPSHOT/hbase-common-0.97.0-SNAPSHOT-sources.jar
[JENKINS] Archiving <http://54.241.6.143/job/HBase-0.95-Hadoop-2/ws/hbase-common/target/hbase-common-0.97.0-SNAPSHOT-tests.jar>
to /var/lib/jenkins/jobs/HBase-0.95-Hadoop-2/modules/org.apache.hbase$hbase-common/builds/2013-04-19_00-17-00/archive/org.apache.hbase/hbase-common/0.97.0-SNAPSHOT/hbase-common-0.97.0-SNAPSHOT-tests.jar
[JENKINS] Archiving <http://54.241.6.143/job/HBase-0.95-Hadoop-2/ws/hbase-hadoop-compat/pom.xml>
to /var/lib/jenkins/jobs/HBase-0.95-Hadoop-2/modules/org.apache.hbase$hbase-hadoop-compat/builds/2013-04-19_00-17-00/archive/org.apache.hbase/hbase-hadoop-compat/0.97.0-SNAPSHOT/hbase-hadoop-compat-0.97.0-SNAPSHOT.pom
[JENKINS] Archiving <http://54.241.6.143/job/HBase-0.95-Hadoop-2/ws/hbase-hadoop-compat/target/hbase-hadoop-compat-0.97.0-SNAPSHOT.jar>
to /var/lib/jenkins/jobs/HBase-0.95-Hadoop-2/modules/org.apache.hbase$hbase-hadoop-compat/builds/2013-04-19_00-17-00/archive/org.apache.hbase/hbase-hadoop-compat/0.97.0-SNAPSHOT/hbase-hadoop-compat-0.97.0-SNAPSHOT.jar
[JENKINS] Archiving <http://54.241.6.143/job/HBase-0.95-Hadoop-2/ws/hbase-hadoop-compat/target/hbase-hadoop-compat-0.97.0-SNAPSHOT-sources.jar>
to /var/lib/jenkins/jobs/HBase-0.95-Hadoop-2/modules/org.apache.hbase$hbase-hadoop-compat/builds/2013-04-19_00-17-00/archive/org.apache.hbase/hbase-hadoop-compat/0.97.0-SNAPSHOT/hbase-hadoop-compat-0.97.0-SNAPSHOT-sources.jar
[JENKINS] Archiving <http://54.241.6.143/job/HBase-0.95-Hadoop-2/ws/hbase-hadoop-compat/target/hbase-hadoop-compat-0.97.0-SNAPSHOT-tests.jar>
to /var/lib/jenkins/jobs/HBase-0.95-Hadoop-2/modules/org.apache.hbase$hbase-hadoop-compat/builds/2013-04-19_00-17-00/archive/org.apache.hbase/hbase-hadoop-compat/0.97.0-SNAPSHOT/hbase-hadoop-compat-0.97.0-SNAPSHOT-tests.jar
[JENKINS] Archiving <http://54.241.6.143/job/HBase-0.95-Hadoop-2/ws/hbase-examples/pom.xml>
to /var/lib/jenkins/jobs/HBase-0.95-Hadoop-2/modules/org.apache.hbase$hbase-examples/builds/2013-04-19_00-17-00/archive/org.apache.hbase/hbase-examples/0.97.0-SNAPSHOT/hbase-examples-0.97.0-SNAPSHOT.pom
[JENKINS] Archiving <http://54.241.6.143/job/HBase-0.95-Hadoop-2/ws/hbase-it/pom.xml>
to /var/lib/jenkins/jobs/HBase-0.95-Hadoop-2/modules/org.apache.hbase$hbase-it/builds/2013-04-19_00-17-00/archive/org.apache.hbase/hbase-it/0.97.0-SNAPSHOT/hbase-it-0.97.0-SNAPSHOT.pom
[JENKINS] Archiving <http://54.241.6.143/job/HBase-0.95-Hadoop-2/ws/pom.xml> to /var/lib/jenkins/jobs/HBase-0.95-Hadoop-2/modules/org.apache.hbase$hbase/builds/2013-04-19_00-16-59/archive/org.apache.hbase/hbase/0.97.0-SNAPSHOT/hbase-0.97.0-SNAPSHOT.pom
[JENKINS] Archiving <http://54.241.6.143/job/HBase-0.95-Hadoop-2/ws/target/hbase-0.97.0-SNAPSHOT-site.xml>
to /var/lib/jenkins/jobs/HBase-0.95-Hadoop-2/modules/org.apache.hbase$hbase/builds/2013-04-19_00-16-59/archive/org.apache.hbase/hbase/0.97.0-SNAPSHOT/hbase-0.97.0-SNAPSHOT-site.xml
[JENKINS] Archiving <http://54.241.6.143/job/HBase-0.95-Hadoop-2/ws/hbase-assembly/pom.xml>
to /var/lib/jenkins/jobs/HBase-0.95-Hadoop-2/modules/org.apache.hbase$hbase-assembly/builds/2013-04-19_00-17-00/archive/org.apache.hbase/hbase-assembly/0.97.0-SNAPSHOT/hbase-assembly-0.97.0-SNAPSHOT.pom
[JENKINS] Archiving <http://54.241.6.143/job/HBase-0.95-Hadoop-2/ws/hbase-client/pom.xml>
to /var/lib/jenkins/jobs/HBase-0.95-Hadoop-2/modules/org.apache.hbase$hbase-client/builds/2013-04-19_00-17-00/archive/org.apache.hbase/hbase-client/0.97.0-SNAPSHOT/hbase-client-0.97.0-SNAPSHOT.pom
[JENKINS] Archiving <http://54.241.6.143/job/HBase-0.95-Hadoop-2/ws/hbase-client/target/hbase-client-0.97.0-SNAPSHOT.jar>
to /var/lib/jenkins/jobs/HBase-0.95-Hadoop-2/modules/org.apache.hbase$hbase-client/builds/2013-04-19_00-17-00/archive/org.apache.hbase/hbase-client/0.97.0-SNAPSHOT/hbase-client-0.97.0-SNAPSHOT.jar
[JENKINS] Archiving <http://54.241.6.143/job/HBase-0.95-Hadoop-2/ws/hbase-client/target/hbase-client-0.97.0-SNAPSHOT-sources.jar>
to /var/lib/jenkins/jobs/HBase-0.95-Hadoop-2/modules/org.apache.hbase$hbase-client/builds/2013-04-19_00-17-00/archive/org.apache.hbase/hbase-client/0.97.0-SNAPSHOT/hbase-client-0.97.0-SNAPSHOT-sources.jar
[JENKINS] Archiving <http://54.241.6.143/job/HBase-0.95-Hadoop-2/ws/hbase-client/target/hbase-client-0.97.0-SNAPSHOT-tests.jar>
to /var/lib/jenkins/jobs/HBase-0.95-Hadoop-2/modules/org.apache.hbase$hbase-client/builds/2013-04-19_00-17-00/archive/org.apache.hbase/hbase-client/0.97.0-SNAPSHOT/hbase-client-0.97.0-SNAPSHOT-tests.jar
[JENKINS] Archiving <http://54.241.6.143/job/HBase-0.95-Hadoop-2/ws/hbase-prefix-tree/pom.xml>
to /var/lib/jenkins/jobs/HBase-0.95-Hadoop-2/modules/org.apache.hbase$hbase-prefix-tree/builds/2013-04-19_00-17-00/archive/org.apache.hbase/hbase-prefix-tree/0.97.0-SNAPSHOT/hbase-prefix-tree-0.97.0-SNAPSHOT.pom
[JENKINS] Archiving <http://54.241.6.143/job/HBase-0.95-Hadoop-2/ws/hbase-prefix-tree/target/hbase-prefix-tree-0.97.0-SNAPSHOT.jar>
to /var/lib/jenkins/jobs/HBase-0.95-Hadoop-2/modules/org.apache.hbase$hbase-prefix-tree/builds/2013-04-19_00-17-00/archive/org.apache.hbase/hbase-prefix-tree/0.97.0-SNAPSHOT/hbase-prefix-tree-0.97.0-SNAPSHOT.jar
[JENKINS] Archiving <http://54.241.6.143/job/HBase-0.95-Hadoop-2/ws/hbase-prefix-tree/target/hbase-prefix-tree-0.97.0-SNAPSHOT-sources.jar>
to /var/lib/jenkins/jobs/HBase-0.95-Hadoop-2/modules/org.apache.hbase$hbase-prefix-tree/builds/2013-04-19_00-17-00/archive/org.apache.hbase/hbase-prefix-tree/0.97.0-SNAPSHOT/hbase-prefix-tree-0.97.0-SNAPSHOT-sources.jar
[JENKINS] Archiving <http://54.241.6.143/job/HBase-0.95-Hadoop-2/ws/hbase-prefix-tree/target/hbase-prefix-tree-0.97.0-SNAPSHOT-tests.jar>
to /var/lib/jenkins/jobs/HBase-0.95-Hadoop-2/modules/org.apache.hbase$hbase-prefix-tree/builds/2013-04-19_00-17-00/archive/org.apache.hbase/hbase-prefix-tree/0.97.0-SNAPSHOT/hbase-prefix-tree-0.97.0-SNAPSHOT-tests.jar
[JENKINS] Archiving <http://54.241.6.143/job/HBase-0.95-Hadoop-2/ws/hbase-protocol/pom.xml>
to /var/lib/jenkins/jobs/HBase-0.95-Hadoop-2/modules/org.apache.hbase$hbase-protocol/builds/2013-04-19_00-16-59/archive/org.apache.hbase/hbase-protocol/0.97.0-SNAPSHOT/hbase-protocol-0.97.0-SNAPSHOT.pom
[JENKINS] Archiving <http://54.241.6.143/job/HBase-0.95-Hadoop-2/ws/hbase-protocol/target/hbase-protocol-0.97.0-SNAPSHOT.jar>
to /var/lib/jenkins/jobs/HBase-0.95-Hadoop-2/modules/org.apache.hbase$hbase-protocol/builds/2013-04-19_00-16-59/archive/org.apache.hbase/hbase-protocol/0.97.0-SNAPSHOT/hbase-protocol-0.97.0-SNAPSHOT.jar
[JENKINS] Archiving <http://54.241.6.143/job/HBase-0.95-Hadoop-2/ws/hbase-protocol/target/hbase-protocol-0.97.0-SNAPSHOT-sources.jar>
to /var/lib/jenkins/jobs/HBase-0.95-Hadoop-2/modules/org.apache.hbase$hbase-protocol/builds/2013-04-19_00-16-59/archive/org.apache.hbase/hbase-protocol/0.97.0-SNAPSHOT/hbase-protocol-0.97.0-SNAPSHOT-sources.jar
[JENKINS] Archiving <http://54.241.6.143/job/HBase-0.95-Hadoop-2/ws/hbase-protocol/target/hbase-protocol-0.97.0-SNAPSHOT-tests.jar>
to /var/lib/jenkins/jobs/HBase-0.95-Hadoop-2/modules/org.apache.hbase$hbase-protocol/builds/2013-04-19_00-16-59/archive/org.apache.hbase/hbase-protocol/0.97.0-SNAPSHOT/hbase-protocol-0.97.0-SNAPSHOT-tests.jar
[JENKINS] Archiving <http://54.241.6.143/job/HBase-0.95-Hadoop-2/ws/hbase-server/pom.xml>
to /var/lib/jenkins/jobs/HBase-0.95-Hadoop-2/modules/org.apache.hbase$hbase-server/builds/2013-04-19_00-16-59/archive/org.apache.hbase/hbase-server/0.97.0-SNAPSHOT/hbase-server-0.97.0-SNAPSHOT.pom
Waiting for Jenkins to finish collecting data
mavenExecutionResult exceptions not empty
message : Failed to execute goal org.apache.maven.plugins:maven-surefire-plugin:2.12-TRUNK-HBASE-2:test
(secondPartTestsExecution) on project hbase-server: Failure or timeout
cause : Failure or timeout
Stack trace : 
org.apache.maven.lifecycle.LifecycleExecutionException: Failed to execute goal org.apache.maven.plugins:maven-surefire-plugin:2.12-TRUNK-HBASE-2:test
(secondPartTestsExecution) on project hbase-server: Failure or timeout
	at org.apache.maven.lifecycle.internal.MojoExecutor.execute(MojoExecutor.java:217)
	at org.apache.maven.lifecycle.internal.MojoExecutor.execute(MojoExecutor.java:153)
	at org.apache.maven.lifecycle.internal.MojoExecutor.execute(MojoExecutor.java:145)
	at org.apache.maven.lifecycle.internal.LifecycleModuleBuilder.buildProject(LifecycleModuleBuilder.java:84)
	at org.apache.maven.lifecycle.internal.LifecycleModuleBuilder.buildProject(LifecycleModuleBuilder.java:59)
	at org.apache.maven.lifecycle.internal.LifecycleStarter.singleThreadedBuild(LifecycleStarter.java:183)
	at org.apache.maven.lifecycle.internal.LifecycleStarter.execute(LifecycleStarter.java:161)
	at org.apache.maven.DefaultMaven.doExecute(DefaultMaven.java:320)
	at org.apache.maven.DefaultMaven.execute(DefaultMaven.java:156)
	at org.jvnet.hudson.maven3.launcher.Maven3Launcher.main(Maven3Launcher.java:79)
	at sun.reflect.NativeMethodAccessorImpl.invoke0(Native Method)
	at sun.reflect.NativeMethodAccessorImpl.invoke(NativeMethodAccessorImpl.java:39)
	at sun.reflect.DelegatingMethodAccessorImpl.invoke(DelegatingMethodAccessorImpl.java:25)
	at java.lang.reflect.Method.invoke(Method.java:597)
	at org.codehaus.plexus.classworlds.launcher.Launcher.launchStandard(Launcher.java:329)
	at org.codehaus.plexus.classworlds.launcher.Launcher.launch(Launcher.java:239)
	at org.jvnet.hudson.maven3.agent.Maven3Main.launch(Maven3Main.java:158)
	at hudson.maven.Maven3Builder.call(Maven3Builder.java:100)
	at hudson.maven.Maven3Builder.call(Maven3Builder.java:66)
	at hudson.remoting.UserRequest.perform(UserRequest.java:118)
	at hudson.remoting.UserRequest.perform(UserRequest.java:48)
	at hudson.remoting.Request$2.run(Request.java:326)
	at hudson.remoting.InterceptingExecutorService$1.call(InterceptingExecutorService.java:72)
	at java.util.concurrent.FutureTask$Sync.innerRun(FutureTask.java:303)
	at java.util.concurrent.FutureTask.run(FutureTask.java:138)
	at java.util.concurrent.ThreadPoolExecutor$Worker.runTask(ThreadPoolExecutor.java:895)
	at java.util.concurrent.ThreadPoolExecutor$Worker.run(ThreadPoolExecutor.java:918)
	at java.lang.Thread.run(Thread.java:662)
Caused by: org.apache.maven.plugin.MojoExecutionException: Failure or timeout
	at org.apache.maven.plugin.surefire.SurefirePlugin.assertNoFailureOrTimeout(SurefirePlugin.java:643)
	at org.apache.maven.plugin.surefire.SurefirePlugin.handleSummary(SurefirePlugin.java:624)
	at org.apache.maven.plugin.surefire.AbstractSurefireMojo.executeAfterPreconditionsChecked(AbstractSurefireMojo.java:137)
	at org.apache.maven.plugin.surefire.AbstractSurefireMojo.execute(AbstractSurefireMojo.java:98)
	at org.apache.maven.plugin.DefaultBuildPluginManager.executeMojo(DefaultBuildPluginManager.java:101)
	at org.apache.maven.lifecycle.internal.MojoExecutor.execute(MojoExecutor.java:209)
	... 27 more
channel stopped

Mime
View raw message