hbase-dev mailing list archives

Site index · List index
Message view « Date » · « Thread »
Top « Date » · « Thread »
From apurt...@apache.org
Subject Build failed in Jenkins: HBase-0.94-Security #89
Date Thu, 18 Apr 2013 23:32:20 GMT
See <http://54.241.6.143/job/HBase-0.94-Security/89/>

------------------------------------------
[...truncated 3188 lines...]
Downloaded: http://repo.maven.apache.org/maven2/org/apache/maven/reporting/maven-reporting-impl/2.0.2/maven-reporting-impl-2.0.2.jar
(14 KB at 430.1 KB/sec)
Downloaded: http://repo.maven.apache.org/maven2/plexus/plexus-utils/1.0.3/plexus-utils-1.0.3.jar
(157 KB at 3481.6 KB/sec)
Downloaded: http://repo.maven.apache.org/maven2/org/apache/maven/shared/maven-plugin-testing-harness/1.0-beta-1/maven-plugin-testing-harness-1.0-beta-1.jar
(18 KB at 282.6 KB/sec)
Downloaded: http://repo.maven.apache.org/maven2/org/apache/maven/maven-jxr/2.1/maven-jxr-2.1.jar
(45 KB at 165.4 KB/sec)
[INFO] configuring report plugin org.apache.rat:apache-rat-plugin:0.8
Downloading: http://people.apache.org/~garyh/mvn/org/apache/rat/apache-rat-core/0.8/apache-rat-core-0.8.pom
Downloading: http://repo.maven.apache.org/maven2/org/apache/rat/apache-rat-core/0.8/apache-rat-core-0.8.pom
Downloaded: http://repo.maven.apache.org/maven2/org/apache/rat/apache-rat-core/0.8/apache-rat-core-0.8.pom
(3 KB at 58.6 KB/sec)
Downloading: http://people.apache.org/~garyh/mvn/org/apache/commons/commons-compress/1.0/commons-compress-1.0.pom
Downloading: http://repo.maven.apache.org/maven2/org/apache/commons/commons-compress/1.0/commons-compress-1.0.pom
Downloaded: http://repo.maven.apache.org/maven2/org/apache/commons/commons-compress/1.0/commons-compress-1.0.pom
(8 KB at 358.6 KB/sec)
Downloading: http://people.apache.org/~garyh/mvn/org/apache/maven/doxia/doxia-site-renderer/1.0-alpha-8/doxia-site-renderer-1.0-alpha-8.pom
Downloading: http://repo.maven.apache.org/maven2/org/apache/maven/doxia/doxia-site-renderer/1.0-alpha-8/doxia-site-renderer-1.0-alpha-8.pom
Downloaded: http://repo.maven.apache.org/maven2/org/apache/maven/doxia/doxia-site-renderer/1.0-alpha-8/doxia-site-renderer-1.0-alpha-8.pom
(2 KB at 115.6 KB/sec)
Downloading: http://people.apache.org/~garyh/mvn/org/apache/maven/doxia/doxia/1.0-alpha-8/doxia-1.0-alpha-8.pom
Downloading: http://repo.maven.apache.org/maven2/org/apache/maven/doxia/doxia/1.0-alpha-8/doxia-1.0-alpha-8.pom
Downloaded: http://repo.maven.apache.org/maven2/org/apache/maven/doxia/doxia/1.0-alpha-8/doxia-1.0-alpha-8.pom
(3 KB at 215.4 KB/sec)
Downloading: http://people.apache.org/~garyh/mvn/org/apache/maven/doxia/doxia-core/1.0-alpha-8/doxia-core-1.0-alpha-8.pom
Downloading: http://repo.maven.apache.org/maven2/org/apache/maven/doxia/doxia-core/1.0-alpha-8/doxia-core-1.0-alpha-8.pom
Downloaded: http://repo.maven.apache.org/maven2/org/apache/maven/doxia/doxia-core/1.0-alpha-8/doxia-core-1.0-alpha-8.pom
(2 KB at 130.0 KB/sec)
Downloading: http://people.apache.org/~garyh/mvn/org/apache/maven/doxia/doxia-sink-api/1.0-alpha-8/doxia-sink-api-1.0-alpha-8.pom
Downloading: http://repo.maven.apache.org/maven2/org/apache/maven/doxia/doxia-sink-api/1.0-alpha-8/doxia-sink-api-1.0-alpha-8.pom
Downloaded: http://repo.maven.apache.org/maven2/org/apache/maven/doxia/doxia-sink-api/1.0-alpha-8/doxia-sink-api-1.0-alpha-8.pom
(424 B at 34.5 KB/sec)
Downloading: http://people.apache.org/~garyh/mvn/org/codehaus/plexus/plexus-velocity/1.1.3/plexus-velocity-1.1.3.pom
Downloading: http://repo.maven.apache.org/maven2/org/codehaus/plexus/plexus-velocity/1.1.3/plexus-velocity-1.1.3.pom
Downloaded: http://repo.maven.apache.org/maven2/org/codehaus/plexus/plexus-velocity/1.1.3/plexus-velocity-1.1.3.pom
(976 B at 79.4 KB/sec)
Downloading: http://people.apache.org/~garyh/mvn/org/codehaus/plexus/plexus-components/1.1.5/plexus-components-1.1.5.pom
Downloading: http://repo.maven.apache.org/maven2/org/codehaus/plexus/plexus-components/1.1.5/plexus-components-1.1.5.pom
Downloaded: http://repo.maven.apache.org/maven2/org/codehaus/plexus/plexus-components/1.1.5/plexus-components-1.1.5.pom
(3 KB at 147.6 KB/sec)
Downloading: http://people.apache.org/~garyh/mvn/org/apache/maven/doxia/doxia-decoration-model/1.0-alpha-8/doxia-decoration-model-1.0-alpha-8.pom
Downloading: http://repo.maven.apache.org/maven2/org/apache/maven/doxia/doxia-decoration-model/1.0-alpha-8/doxia-decoration-model-1.0-alpha-8.pom
Downloaded: http://repo.maven.apache.org/maven2/org/apache/maven/doxia/doxia-decoration-model/1.0-alpha-8/doxia-decoration-model-1.0-alpha-8.pom
(2 KB at 115.5 KB/sec)
Downloading: http://people.apache.org/~garyh/mvn/org/apache/rat/apache-rat-core/0.8/apache-rat-core-0.8.jar
Downloading: http://people.apache.org/~garyh/mvn/org/apache/commons/commons-compress/1.0/commons-compress-1.0.jar
Downloading: http://people.apache.org/~garyh/mvn/commons-cli/commons-cli/1.2/commons-cli-1.2.jar
Downloading: http://people.apache.org/~garyh/mvn/org/codehaus/plexus/plexus-utils/1.4/plexus-utils-1.4.jar
Downloading: http://people.apache.org/~garyh/mvn/org/apache/maven/doxia/doxia-core/1.0-alpha-8/doxia-core-1.0-alpha-8.jar
Downloading: http://people.apache.org/~garyh/mvn/org/codehaus/plexus/plexus-velocity/1.1.3/plexus-velocity-1.1.3.jar
Downloading: http://people.apache.org/~garyh/mvn/org/apache/maven/doxia/doxia-decoration-model/1.0-alpha-8/doxia-decoration-model-1.0-alpha-8.jar
Downloading: http://repo.maven.apache.org/maven2/org/apache/rat/apache-rat-core/0.8/apache-rat-core-0.8.jar
Downloading: http://repo.maven.apache.org/maven2/org/apache/commons/commons-compress/1.0/commons-compress-1.0.jar
Downloading: http://repo.maven.apache.org/maven2/commons-cli/commons-cli/1.2/commons-cli-1.2.jar
Downloading: http://repo.maven.apache.org/maven2/org/codehaus/plexus/plexus-utils/1.4/plexus-utils-1.4.jar
Downloading: http://repo.maven.apache.org/maven2/org/apache/maven/doxia/doxia-core/1.0-alpha-8/doxia-core-1.0-alpha-8.jar
Downloaded: http://repo.maven.apache.org/maven2/commons-cli/commons-cli/1.2/commons-cli-1.2.jar
(0 B at 0.0 KB/sec)
Downloading: http://repo.maven.apache.org/maven2/org/codehaus/plexus/plexus-velocity/1.1.3/plexus-velocity-1.1.3.jar
Downloaded: http://repo.maven.apache.org/maven2/org/codehaus/plexus/plexus-velocity/1.1.3/plexus-velocity-1.1.3.jar
(8 KB at 644.0 KB/sec)
Downloading: http://repo.maven.apache.org/maven2/org/apache/maven/doxia/doxia-decoration-model/1.0-alpha-8/doxia-decoration-model-1.0-alpha-8.jar
Downloaded: http://repo.maven.apache.org/maven2/org/apache/maven/doxia/doxia-decoration-model/1.0-alpha-8/doxia-decoration-model-1.0-alpha-8.jar
(40 KB at 2188.0 KB/sec)
Downloaded: http://repo.maven.apache.org/maven2/org/apache/commons/commons-compress/1.0/commons-compress-1.0.jar
(141 KB at 3053.8 KB/sec)
Downloaded: http://repo.maven.apache.org/maven2/org/codehaus/plexus/plexus-utils/1.4/plexus-utils-1.4.jar
(178 KB at 3176.7 KB/sec)
Downloaded: http://repo.maven.apache.org/maven2/org/apache/maven/doxia/doxia-core/1.0-alpha-8/doxia-core-1.0-alpha-8.jar
(200 KB at 3498.6 KB/sec)
Downloaded: http://repo.maven.apache.org/maven2/org/apache/rat/apache-rat-core/0.8/apache-rat-core-0.8.jar
(102 KB at 1669.6 KB/sec)
[INFO] configuring report plugin org.apache.maven.plugins:maven-surefire-report-plugin:2.7.2
Downloading: http://people.apache.org/~garyh/mvn/org/apache/maven/plugins/maven-surefire-report-plugin/2.7.2/maven-surefire-report-plugin-2.7.2.pom
Downloading: http://repo.maven.apache.org/maven2/org/apache/maven/plugins/maven-surefire-report-plugin/2.7.2/maven-surefire-report-plugin-2.7.2.pom
Downloaded: http://repo.maven.apache.org/maven2/org/apache/maven/plugins/maven-surefire-report-plugin/2.7.2/maven-surefire-report-plugin-2.7.2.pom
(7 KB at 130.6 KB/sec)
Downloading: http://people.apache.org/~garyh/mvn/org/apache/maven/surefire/surefire/2.7.2/surefire-2.7.2.pom
Downloading: http://repo.maven.apache.org/maven2/org/apache/maven/surefire/surefire/2.7.2/surefire-2.7.2.pom
Downloaded: http://repo.maven.apache.org/maven2/org/apache/maven/surefire/surefire/2.7.2/surefire-2.7.2.pom
(11 KB at 32.4 KB/sec)
Downloading: http://people.apache.org/~garyh/mvn/org/apache/maven/maven-parent/18/maven-parent-18.pom
Downloading: http://repo.maven.apache.org/maven2/org/apache/maven/maven-parent/18/maven-parent-18.pom
Downloaded: http://repo.maven.apache.org/maven2/org/apache/maven/maven-parent/18/maven-parent-18.pom
(24 KB at 1681.8 KB/sec)
Downloading: http://people.apache.org/~garyh/mvn/org/apache/maven/plugins/maven-surefire-report-plugin/2.7.2/maven-surefire-report-plugin-2.7.2.jar
Downloading: http://repo.maven.apache.org/maven2/org/apache/maven/plugins/maven-surefire-report-plugin/2.7.2/maven-surefire-report-plugin-2.7.2.jar
Downloaded: http://repo.maven.apache.org/maven2/org/apache/maven/plugins/maven-surefire-report-plugin/2.7.2/maven-surefire-report-plugin-2.7.2.jar
(39 KB at 2152.3 KB/sec)
[INFO] Parent project loaded from repository: org.apache:apache:pom:8
Downloading: https://repository.apache.org/content/repositories/releases/org/apache/apache/8/apache-8-site_en.xml
Downloading: http://people.apache.org/~stack/m2/repository/org/apache/apache/8/apache-8-site_en.xml
Downloading: http://download.java.net/maven/2/org/apache/apache/8/apache-8-site_en.xml
Downloading: http://repository.codehaus.org/org/apache/apache/8/apache-8-site_en.xml
Downloading: http://repository.jboss.org/nexus/content/groups/public-jboss/org/apache/apache/8/apache-8-site_en.xml
Downloading: http://people.apache.org/~garyh/mvn/org/apache/apache/8/apache-8-site_en.xml
Downloading: http://repo.maven.apache.org/maven2/org/apache/apache/8/apache-8-site_en.xml
[FINDBUGS] No report found for mojo site
[JENKINS] Archiving site from <http://54.241.6.143/job/HBase-0.94-Security/ws/target/site>
to /var/lib/jenkins/jobs/HBase-0.94-Security/site
Successfully loaded native POSIX impl.
[INFO] ------------------------------------------------------------------------
[INFO] BUILD FAILURE
[INFO] ------------------------------------------------------------------------
[INFO] Total time: 1:47.279s
[INFO] Finished at: Thu Apr 18 23:32:15 UTC 2013
[INFO] Final Memory: 35M/232M
[INFO] ------------------------------------------------------------------------
[JENKINS] Archiving <http://54.241.6.143/job/HBase-0.94-Security/ws/pom.xml> to /var/lib/jenkins/jobs/HBase-0.94-Security/modules/org.apache.hbase$hbase/builds/2013-04-18_23-30-23/archive/org.apache.hbase/hbase/0.94.7/hbase-0.94.7.pom
Waiting for Jenkins to finish collecting data
mavenExecutionResult exceptions not empty
message : Failed to execute goal org.apache.maven.plugins:maven-site-plugin:3.2:site (default-site)
on project hbase: SiteToolException: The site descriptor cannot be resolved from the repository:
ArtifactResolutionException: Unable to locate site descriptor: Could not transfer artifact
org.apache:apache:xml:site_en:8 from/to repository.jboss.org (http://repository.jboss.org/nexus/content/groups/public-jboss/):
Failed to transfer file: http://repository.jboss.org/nexus/content/groups/public-jboss/org/apache/apache/8/apache-8-site_en.xml.
Return code is: 503, ReasonPhrase:Service Temporarily Unavailable.
  org.apache:apache:xml:8

from the specified remote repositories:
  apache release (https://repository.apache.org/content/repositories/releases/, releases=true,
snapshots=true),
  apache non-releases (http://people.apache.org/~stack/m2/repository, releases=true, snapshots=false),
  java.net (http://download.java.net/maven/2/, releases=true, snapshots=false),
  codehaus (http://repository.codehaus.org/, releases=true, snapshots=false),
  repository.jboss.org (http://repository.jboss.org/nexus/content/groups/public-jboss/, releases=true,
snapshots=false),
  ghelmling.testing (http://people.apache.org/~garyh/mvn/, releases=true, snapshots=true),
  apache.snapshots (http://repository.apache.org/snapshots, releases=false, snapshots=true),
  central (http://repo.maven.apache.org/maven2, releases=true, snapshots=false)

cause : SiteToolException: The site descriptor cannot be resolved from the repository: ArtifactResolutionException:
Unable to locate site descriptor: Could not transfer artifact org.apache:apache:xml:site_en:8
from/to repository.jboss.org (http://repository.jboss.org/nexus/content/groups/public-jboss/):
Failed to transfer file: http://repository.jboss.org/nexus/content/groups/public-jboss/org/apache/apache/8/apache-8-site_en.xml.
Return code is: 503, ReasonPhrase:Service Temporarily Unavailable.
  org.apache:apache:xml:8

from the specified remote repositories:
  apache release (https://repository.apache.org/content/repositories/releases/, releases=true,
snapshots=true),
  apache non-releases (http://people.apache.org/~stack/m2/repository, releases=true, snapshots=false),
  java.net (http://download.java.net/maven/2/, releases=true, snapshots=false),
  codehaus (http://repository.codehaus.org/, releases=true, snapshots=false),
  repository.jboss.org (http://repository.jboss.org/nexus/content/groups/public-jboss/, releases=true,
snapshots=false),
  ghelmling.testing (http://people.apache.org/~garyh/mvn/, releases=true, snapshots=true),
  apache.snapshots (http://repository.apache.org/snapshots, releases=false, snapshots=true),
  central (http://repo.maven.apache.org/maven2, releases=true, snapshots=false)

Stack trace : 
org.apache.maven.lifecycle.LifecycleExecutionException: Failed to execute goal org.apache.maven.plugins:maven-site-plugin:3.2:site
(default-site) on project hbase: SiteToolException: The site descriptor cannot be resolved
from the repository: ArtifactResolutionException: Unable to locate site descriptor: Could
not transfer artifact org.apache:apache:xml:site_en:8 from/to repository.jboss.org (http://repository.jboss.org/nexus/content/groups/public-jboss/):
Failed to transfer file: http://repository.jboss.org/nexus/content/groups/public-jboss/org/apache/apache/8/apache-8-site_en.xml.
Return code is: 503, ReasonPhrase:Service Temporarily Unavailable.
  org.apache:apache:xml:8

from the specified remote repositories:
  apache release (https://repository.apache.org/content/repositories/releases/, releases=true,
snapshots=true),
  apache non-releases (http://people.apache.org/~stack/m2/repository, releases=true, snapshots=false),
  java.net (http://download.java.net/maven/2/, releases=true, snapshots=false),
  codehaus (http://repository.codehaus.org/, releases=true, snapshots=false),
  repository.jboss.org (http://repository.jboss.org/nexus/content/groups/public-jboss/, releases=true,
snapshots=false),
  ghelmling.testing (http://people.apache.org/~garyh/mvn/, releases=true, snapshots=true),
  apache.snapshots (http://repository.apache.org/snapshots, releases=false, snapshots=true),
  central (http://repo.maven.apache.org/maven2, releases=true, snapshots=false)

	at org.apache.maven.lifecycle.internal.MojoExecutor.execute(MojoExecutor.java:217)
	at org.apache.maven.lifecycle.internal.MojoExecutor.execute(MojoExecutor.java:153)
	at org.apache.maven.lifecycle.internal.MojoExecutor.execute(MojoExecutor.java:145)
	at org.apache.maven.lifecycle.internal.LifecycleModuleBuilder.buildProject(LifecycleModuleBuilder.java:84)
	at org.apache.maven.lifecycle.internal.LifecycleModuleBuilder.buildProject(LifecycleModuleBuilder.java:59)
	at org.apache.maven.lifecycle.internal.LifecycleStarter.singleThreadedBuild(LifecycleStarter.java:183)
	at org.apache.maven.lifecycle.internal.LifecycleStarter.execute(LifecycleStarter.java:161)
	at org.apache.maven.DefaultMaven.doExecute(DefaultMaven.java:320)
	at org.apache.maven.DefaultMaven.execute(DefaultMaven.java:156)
	at org.jvnet.hudson.maven3.launcher.Maven3Launcher.main(Maven3Launcher.java:79)
	at sun.reflect.NativeMethodAccessorImpl.invoke0(Native Method)
	at sun.reflect.NativeMethodAccessorImpl.invoke(NativeMethodAccessorImpl.java:39)
	at sun.reflect.DelegatingMethodAccessorImpl.invoke(DelegatingMethodAccessorImpl.java:25)
	at java.lang.reflect.Method.invoke(Method.java:597)
	at org.codehaus.plexus.classworlds.launcher.Launcher.launchStandard(Launcher.java:329)
	at org.codehaus.plexus.classworlds.launcher.Launcher.launch(Launcher.java:239)
	at org.jvnet.hudson.maven3.agent.Maven3Main.launch(Maven3Main.java:158)
	at hudson.maven.Maven3Builder.call(Maven3Builder.java:100)
	at hudson.maven.Maven3Builder.call(Maven3Builder.java:66)
	at hudson.remoting.UserRequest.perform(UserRequest.java:118)
	at hudson.remoting.UserRequest.perform(UserRequest.java:48)
	at hudson.remoting.Request$2.run(Request.java:326)
	at hudson.remoting.InterceptingExecutorService$1.call(InterceptingExecutorService.java:72)
	at java.util.concurrent.FutureTask$Sync.innerRun(FutureTask.java:303)
	at java.util.concurrent.FutureTask.run(FutureTask.java:138)
	at java.util.concurrent.ThreadPoolExecutor$Worker.runTask(ThreadPoolExecutor.java:895)
	at java.util.concurrent.ThreadPoolExecutor$Worker.run(ThreadPoolExecutor.java:918)
	at java.lang.Thread.run(Thread.java:662)
Caused by: org.apache.maven.plugin.MojoExecutionException: SiteToolException: The site descriptor
cannot be resolved from the repository: ArtifactResolutionException: Unable to locate site
descriptor: Could not transfer artifact org.apache:apache:xml:site_en:8 from/to repository.jboss.org
(http://repository.jboss.org/nexus/content/groups/public-jboss/): Failed to transfer file:
http://repository.jboss.org/nexus/content/groups/public-jboss/org/apache/apache/8/apache-8-site_en.xml.
Return code is: 503, ReasonPhrase:Service Temporarily Unavailable.
  org.apache:apache:xml:8

from the specified remote repositories:
  apache release (https://repository.apache.org/content/repositories/releases/, releases=true,
snapshots=true),
  apache non-releases (http://people.apache.org/~stack/m2/repository, releases=true, snapshots=false),
  java.net (http://download.java.net/maven/2/, releases=true, snapshots=false),
  codehaus (http://repository.codehaus.org/, releases=true, snapshots=false),
  repository.jboss.org (http://repository.jboss.org/nexus/content/groups/public-jboss/, releases=true,
snapshots=false),
  ghelmling.testing (http://people.apache.org/~garyh/mvn/, releases=true, snapshots=true),
  apache.snapshots (http://repository.apache.org/snapshots, releases=false, snapshots=true),
  central (http://repo.maven.apache.org/maven2, releases=true, snapshots=false)

	at org.apache.maven.plugins.site.AbstractSiteRenderingMojo.createSiteRenderingContext(AbstractSiteRenderingMojo.java:288)
	at org.apache.maven.plugins.site.SiteMojo.renderLocale(SiteMojo.java:154)
	at org.apache.maven.plugins.site.SiteMojo.execute(SiteMojo.java:138)
	at org.apache.maven.plugin.DefaultBuildPluginManager.executeMojo(DefaultBuildPluginManager.java:101)
	at org.apache.maven.lifecycle.internal.MojoExecutor.execute(MojoExecutor.java:209)
	... 27 more
Caused by: org.apache.maven.doxia.tools.SiteToolException: The site descriptor cannot be resolved
from the repository: ArtifactResolutionException: Unable to locate site descriptor: Could
not transfer artifact org.apache:apache:xml:site_en:8 from/to repository.jboss.org (http://repository.jboss.org/nexus/content/groups/public-jboss/):
Failed to transfer file: http://repository.jboss.org/nexus/content/groups/public-jboss/org/apache/apache/8/apache-8-site_en.xml.
Return code is: 503, ReasonPhrase:Service Temporarily Unavailable.
  org.apache:apache:xml:8

from the specified remote repositories:
  apache release (https://repository.apache.org/content/repositories/releases/, releases=true,
snapshots=true),
  apache non-releases (http://people.apache.org/~stack/m2/repository, releases=true, snapshots=false),
  java.net (http://download.java.net/maven/2/, releases=true, snapshots=false),
  codehaus (http://repository.codehaus.org/, releases=true, snapshots=false),
  repository.jboss.org (http://repository.jboss.org/nexus/content/groups/public-jboss/, releases=true,
snapshots=false),
  ghelmling.testing (http://people.apache.org/~garyh/mvn/, releases=true, snapshots=true),
  apache.snapshots (http://repository.apache.org/snapshots, releases=false, snapshots=true),
  central (http://repo.maven.apache.org/maven2, releases=true, snapshots=false)

	at org.apache.maven.doxia.tools.DefaultSiteTool.getDecorationModel(DefaultSiteTool.java:1150)
	at org.apache.maven.doxia.tools.DefaultSiteTool.getDecorationModel(DefaultSiteTool.java:1192)
	at org.apache.maven.doxia.tools.DefaultSiteTool.getDecorationModel(DefaultSiteTool.java:454)
	at org.apache.maven.plugins.site.AbstractSiteRenderingMojo.createSiteRenderingContext(AbstractSiteRenderingMojo.java:281)
	... 31 more
Caused by: org.apache.maven.doxia.tools.SiteToolException: ArtifactResolutionException: Unable
to locate site descriptor: Could not transfer artifact org.apache:apache:xml:site_en:8 from/to
repository.jboss.org (http://repository.jboss.org/nexus/content/groups/public-jboss/): Failed
to transfer file: http://repository.jboss.org/nexus/content/groups/public-jboss/org/apache/apache/8/apache-8-site_en.xml.
Return code is: 503, ReasonPhrase:Service Temporarily Unavailable.
  org.apache:apache:xml:8

from the specified remote repositories:
  apache release (https://repository.apache.org/content/repositories/releases/, releases=true,
snapshots=true),
  apache non-releases (http://people.apache.org/~stack/m2/repository, releases=true, snapshots=false),
  java.net (http://download.java.net/maven/2/, releases=true, snapshots=false),
  codehaus (http://repository.codehaus.org/, releases=true, snapshots=false),
  repository.jboss.org (http://repository.jboss.org/nexus/content/groups/public-jboss/, releases=true,
snapshots=false),
  ghelmling.testing (http://people.apache.org/~garyh/mvn/, releases=true, snapshots=true),
  apache.snapshots (http://repository.apache.org/snapshots, releases=false, snapshots=true),
  central (http://repo.maven.apache.org/maven2, releases=true, snapshots=false)

	at org.apache.maven.doxia.tools.DefaultSiteTool.getSiteDescriptorFromRepository(DefaultSiteTool.java:403)
	at org.apache.maven.doxia.tools.DefaultSiteTool.getDecorationModel(DefaultSiteTool.java:1146)
	... 34 more
Caused by: org.apache.maven.artifact.resolver.ArtifactResolutionException: Could not transfer
artifact org.apache:apache:xml:site_en:8 from/to repository.jboss.org (http://repository.jboss.org/nexus/content/groups/public-jboss/):
Failed to transfer file: http://repository.jboss.org/nexus/content/groups/public-jboss/org/apache/apache/8/apache-8-site_en.xml.
Return code is: 503, ReasonPhrase:Service Temporarily Unavailable.
  org.apache:apache:xml:8

from the specified remote repositories:
  apache release (https://repository.apache.org/content/repositories/releases/, releases=true,
snapshots=true),
  apache non-releases (http://people.apache.org/~stack/m2/repository, releases=true, snapshots=false),
  java.net (http://download.java.net/maven/2/, releases=true, snapshots=false),
  codehaus (http://repository.codehaus.org/, releases=true, snapshots=false),
  repository.jboss.org (http://repository.jboss.org/nexus/content/groups/public-jboss/, releases=true,
snapshots=false),
  ghelmling.testing (http://people.apache.org/~garyh/mvn/, releases=true, snapshots=true),
  apache.snapshots (http://repository.apache.org/snapshots, releases=false, snapshots=true),
  central (http://repo.maven.apache.org/maven2, releases=true, snapshots=false)

	at org.apache.maven.artifact.resolver.DefaultArtifactResolver.resolve(DefaultArtifactResolver.java:223)
	at org.apache.maven.artifact.resolver.DefaultArtifactResolver.resolve(DefaultArtifactResolver.java:157)
	at org.apache.maven.artifact.resolver.DefaultArtifactResolver.resolve(DefaultArtifactResolver.java:525)
	at org.apache.maven.doxia.tools.DefaultSiteTool.resolveSiteDescriptor(DefaultSiteTool.java:1062)
	at org.apache.maven.doxia.tools.DefaultSiteTool.getSiteDescriptorFromRepository(DefaultSiteTool.java:394)
	... 35 more
Caused by: org.sonatype.aether.resolution.ArtifactResolutionException: Could not transfer
artifact org.apache:apache:xml:site_en:8 from/to repository.jboss.org (http://repository.jboss.org/nexus/content/groups/public-jboss/):
Failed to transfer file: http://repository.jboss.org/nexus/content/groups/public-jboss/org/apache/apache/8/apache-8-site_en.xml.
Return code is: 503, ReasonPhrase:Service Temporarily Unavailable.
	at org.sonatype.aether.impl.internal.DefaultArtifactResolver.resolve(DefaultArtifactResolver.java:538)
	at org.sonatype.aether.impl.internal.DefaultArtifactResolver.resolveArtifacts(DefaultArtifactResolver.java:216)
	at org.sonatype.aether.impl.internal.DefaultArtifactResolver.resolveArtifact(DefaultArtifactResolver.java:193)
	at org.sonatype.aether.impl.internal.DefaultRepositorySystem.resolveArtifact(DefaultRepositorySystem.java:286)
	at org.apache.maven.artifact.resolver.DefaultArtifactResolver.resolve(DefaultArtifactResolver.java:213)
	... 39 more
Caused by: org.sonatype.aether.transfer.ArtifactTransferException: Could not transfer artifact
org.apache:apache:xml:site_en:8 from/to repository.jboss.org (http://repository.jboss.org/nexus/content/groups/public-jboss/):
Failed to transfer file: http://repository.jboss.org/nexus/content/groups/public-jboss/org/apache/apache/8/apache-8-site_en.xml.
Return code is: 503, ReasonPhrase:Service Temporarily Unavailable.
	at org.sonatype.aether.connector.wagon.WagonRepositoryConnector$4.wrap(WagonRepositoryConnector.java:951)
	at org.sonatype.aether.connector.wagon.WagonRepositoryConnector$4.wrap(WagonRepositoryConnector.java:941)
	at org.sonatype.aether.connector.wagon.WagonRepositoryConnector$GetTask.run(WagonRepositoryConnector.java:669)
	at org.sonatype.aether.util.concurrency.RunnableErrorForwarder$1.run(RunnableErrorForwarder.java:60)
	... 3 more
Caused by: org.apache.maven.wagon.TransferFailedException: Failed to transfer file: http://repository.jboss.org/nexus/content/groups/public-jboss/org/apache/apache/8/apache-8-site_en.xml.
Return code is: 503, ReasonPhrase:Service Temporarily Unavailable.
	at org.apache.maven.wagon.shared.http4.AbstractHttpClientWagon.fillInputData(AbstractHttpClientWagon.java:852)
	at org.apache.maven.wagon.StreamWagon.getInputStream(StreamWagon.java:116)
	at org.apache.maven.wagon.StreamWagon.getIfNewer(StreamWagon.java:88)
	at org.apache.maven.wagon.StreamWagon.get(StreamWagon.java:61)
	at org.sonatype.aether.connector.wagon.WagonRepositoryConnector$GetTask.run(WagonRepositoryConnector.java:601)
	... 4 more
channel stopped
Archiving artifacts

Mime
View raw message