hbase-dev mailing list archives

Site index · List index
Message view « Date » · « Thread »
Top « Date » · « Thread »
From apurt...@apache.org
Subject Build failed in Jenkins: HBase-0.95 #185
Date Thu, 25 Apr 2013 19:11:54 GMT
See <http://54.241.6.143/job/HBase-0.95/185/changes>

Changes:

[ddas] HBASE-5930. Limits the amount of time an edit can live in the memstore.

[sershe] HBASE-8024 Make Store flush algorithm pluggable

------------------------------------------
[...truncated 6978 lines...]
Running org.apache.hadoop.hbase.client.TestFromClientSide
Tests run: 61, Failures: 0, Errors: 0, Skipped: 3, Time elapsed: 201.409 sec
Running org.apache.hadoop.hbase.client.TestHTableMultiplexer
Tests run: 1, Failures: 0, Errors: 0, Skipped: 0, Time elapsed: 23.231 sec
Running org.apache.hadoop.hbase.client.TestFromClientSide3
Tests run: 5, Failures: 0, Errors: 0, Skipped: 0, Time elapsed: 82.2 sec
Running org.apache.hadoop.hbase.client.TestClientTimeouts
Tests run: 1, Failures: 0, Errors: 0, Skipped: 0, Time elapsed: 22.818 sec
Running org.apache.hadoop.hbase.client.TestMultiParallel
Tests run: 11, Failures: 0, Errors: 0, Skipped: 0, Time elapsed: 101.807 sec
Running org.apache.hadoop.hbase.client.TestSnapshotFromClient
Tests run: 3, Failures: 0, Errors: 0, Skipped: 0, Time elapsed: 28.686 sec
Running org.apache.hadoop.hbase.client.TestScannersFromClientSide
Tests run: 4, Failures: 0, Errors: 0, Skipped: 0, Time elapsed: 18.329 sec
Running org.apache.hadoop.hbase.client.TestCloneSnapshotFromClient
Tests run: 3, Failures: 0, Errors: 0, Skipped: 0, Time elapsed: 119.766 sec
Running org.apache.hadoop.hbase.TestInfoServers
Tests run: 3, Failures: 0, Errors: 0, Skipped: 0, Time elapsed: 13.285 sec
Running org.apache.hadoop.hbase.rest.TestSchemaResource
Tests run: 2, Failures: 0, Errors: 0, Skipped: 0, Time elapsed: 20.714 sec
Running org.apache.hadoop.hbase.rest.TestGzipFilter
Tests run: 2, Failures: 0, Errors: 0, Skipped: 0, Time elapsed: 15.199 sec
Running org.apache.hadoop.hbase.rest.TestScannerResource
Tests run: 5, Failures: 0, Errors: 0, Skipped: 0, Time elapsed: 31.238 sec
Running org.apache.hadoop.hbase.rest.TestMultiRowResource
Tests run: 3, Failures: 0, Errors: 0, Skipped: 0, Time elapsed: 16.144 sec
Running org.apache.hadoop.hbase.rest.TestRowResource
Tests run: 12, Failures: 0, Errors: 0, Skipped: 0, Time elapsed: 19.35 sec
Running org.apache.hadoop.hbase.rest.client.TestRemoteTable
Tests run: 4, Failures: 0, Errors: 0, Skipped: 0, Time elapsed: 18.76 sec
Running org.apache.hadoop.hbase.rest.TestTableResource
Tests run: 8, Failures: 0, Errors: 0, Skipped: 0, Time elapsed: 32.484 sec
Running org.apache.hadoop.hbase.rest.client.TestRemoteAdmin
Tests run: 1, Failures: 0, Errors: 0, Skipped: 0, Time elapsed: 18.503 sec
Running org.apache.hadoop.hbase.client.TestFromClientSideWithCoprocessor
Tests run: 61, Failures: 0, Errors: 0, Skipped: 3, Time elapsed: 162.489 sec
Running org.apache.hadoop.hbase.rest.TestStatusResource
Tests run: 2, Failures: 0, Errors: 0, Skipped: 0, Time elapsed: 13.057 sec
Running org.apache.hadoop.hbase.rest.TestVersionResource
Tests run: 7, Failures: 0, Errors: 0, Skipped: 0, Time elapsed: 14.522 sec
Running org.apache.hadoop.hbase.mapreduce.TestHLogRecordReader
Tests run: 2, Failures: 0, Errors: 0, Skipped: 0, Time elapsed: 6.849 sec
Running org.apache.hadoop.hbase.rest.TestScannersWithFilters
Tests run: 10, Failures: 0, Errors: 0, Skipped: 0, Time elapsed: 20.513 sec
Running org.apache.hadoop.hbase.client.TestAdmin
Tests run: 43, Failures: 1, Errors: 0, Skipped: 0, Time elapsed: 323.055 sec <<<
FAILURE!
Running org.apache.hadoop.hbase.mapreduce.TestRowCounter
Tests run: 3, Failures: 0, Errors: 0, Skipped: 0, Time elapsed: 167.141 sec
Running org.apache.hadoop.hbase.mapreduce.TestLoadIncrementalHFiles
Tests run: 7, Failures: 0, Errors: 0, Skipped: 0, Time elapsed: 52.371 sec
Running org.apache.hadoop.hbase.mapreduce.TestImportTsv
Tests run: 5, Failures: 0, Errors: 0, Skipped: 0, Time elapsed: 394.865 sec
Running org.apache.hadoop.hbase.mapreduce.TestTableInputFormatScan1
Tests run: 5, Failures: 0, Errors: 0, Skipped: 0, Time elapsed: 513.879 sec
Running org.apache.hadoop.hbase.mapreduce.TestTableInputFormatScan2
Tests run: 7, Failures: 0, Errors: 0, Skipped: 0, Time elapsed: 700.561 sec
Running org.apache.hadoop.hbase.mapreduce.TestMultiTableInputFormat
Tests run: 5, Failures: 0, Errors: 0, Skipped: 0, Time elapsed: 857.371 sec
Running org.apache.hadoop.hbase.mapreduce.TestSecureLoadIncrementalHFiles
Tests run: 7, Failures: 0, Errors: 0, Skipped: 0, Time elapsed: 43.746 sec
Running org.apache.hadoop.hbase.mapreduce.TestTimeRangeMapRed
Tests run: 1, Failures: 0, Errors: 0, Skipped: 0, Time elapsed: 89.679 sec
Running org.apache.hadoop.hbase.mapreduce.TestHFileOutputFormat
Tests run: 10, Failures: 0, Errors: 0, Skipped: 0, Time elapsed: 723.229 sec
Running org.apache.hadoop.hbase.mapreduce.TestSecureLoadIncrementalHFilesSplitRecovery
Tests run: 4, Failures: 0, Errors: 0, Skipped: 0, Time elapsed: 56.215 sec
Running org.apache.hadoop.hbase.mapreduce.TestTableMapReduce
Tests run: 2, Failures: 0, Errors: 0, Skipped: 0, Time elapsed: 461.751 sec
Running org.apache.hadoop.hbase.mapreduce.TestLoadIncrementalHFilesSplitRecovery
Tests run: 4, Failures: 0, Errors: 0, Skipped: 0, Time elapsed: 96.261 sec
Running org.apache.hadoop.hbase.ipc.TestDelayedRpc
Tests run: 4, Failures: 0, Errors: 0, Skipped: 0, Time elapsed: 9.447 sec
Running org.apache.hadoop.hbase.ipc.TestProtoBufRpc
Tests run: 1, Failures: 0, Errors: 0, Skipped: 0, Time elapsed: 5.73 sec
Running org.apache.hadoop.hbase.ipc.TestHBaseClient
Tests run: 1, Failures: 0, Errors: 0, Skipped: 0, Time elapsed: 1.624 sec
Running org.apache.hadoop.hbase.mapreduce.TestWALPlayer
Tests run: 1, Failures: 0, Errors: 0, Skipped: 0, Time elapsed: 73.657 sec
Running org.apache.hadoop.hbase.mapreduce.TestImportExport
Running org.apache.hadoop.hbase.TestHBaseTestingUtility
Tests run: 5, Failures: 0, Errors: 0, Skipped: 0, Time elapsed: 654.223 sec
Tests run: 7, Failures: 0, Errors: 0, Skipped: 0, Time elapsed: 72.161 sec
Running org.apache.hadoop.hbase.io.hfile.TestHFilePerformance
Tests run: 1, Failures: 0, Errors: 0, Skipped: 0, Time elapsed: 21.793 sec
Running org.apache.hadoop.hbase.TestFullLogReconstruction
Tests run: 1, Failures: 0, Errors: 0, Skipped: 0, Time elapsed: 54.731 sec
Running org.apache.hadoop.hbase.io.hfile.TestHFileSeek
Tests run: 1, Failures: 0, Errors: 0, Skipped: 0, Time elapsed: 13.593 sec
Running org.apache.hadoop.hbase.io.hfile.TestScannerSelectionUsingTTL
Tests run: 6, Failures: 0, Errors: 0, Skipped: 0, Time elapsed: 68.408 sec
Running org.apache.hadoop.hbase.io.hfile.TestHFileBlockIndex
Tests run: 10, Failures: 0, Errors: 0, Skipped: 0, Time elapsed: 21.199 sec
Running org.apache.hadoop.hbase.io.hfile.TestForceCacheImportantBlocks
Tests run: 2, Failures: 0, Errors: 0, Skipped: 0, Time elapsed: 69.02 sec
Running org.apache.hadoop.hbase.mapreduce.TestMultithreadedTableMapper
Tests run: 1, Failures: 0, Errors: 0, Skipped: 0, Time elapsed: 217.644 sec
Running org.apache.hadoop.hbase.io.hfile.TestHFileBlock
Tests run: 14, Failures: 0, Errors: 0, Skipped: 0, Time elapsed: 68.4 sec
Running org.apache.hadoop.hbase.io.hfile.slab.TestSingleSizeCache
Tests run: 5, Failures: 0, Errors: 0, Skipped: 0, Time elapsed: 77.075 sec
Running org.apache.hadoop.hbase.io.hfile.TestCacheOnWrite
Tests run: 36, Failures: 0, Errors: 0, Skipped: 0, Time elapsed: 101.924 sec
Running org.apache.hadoop.hbase.io.TestFileLink
Tests run: 3, Failures: 0, Errors: 0, Skipped: 0, Time elapsed: 22.84 sec
Running org.apache.hadoop.hbase.io.hfile.slab.TestSlabCache
Tests run: 7, Failures: 0, Errors: 0, Skipped: 0, Time elapsed: 53.476 sec
Running org.apache.hadoop.hbase.io.encoding.TestBufferedDataBlockEncoder
Tests run: 1, Failures: 0, Errors: 0, Skipped: 0, Time elapsed: 32.08 sec
Running org.apache.hadoop.hbase.io.encoding.TestLoadAndSwitchEncodeOnDisk
Tests run: 1, Failures: 0, Errors: 0, Skipped: 0, Time elapsed: 42.282 sec
Running org.apache.hadoop.hbase.mapred.TestTableInputFormat
Tests run: 10, Failures: 0, Errors: 0, Skipped: 0, Time elapsed: 29.556 sec
Running org.apache.hadoop.hbase.snapshot.TestSnapshotDescriptionUtils
Tests run: 2, Failures: 0, Errors: 0, Skipped: 0, Time elapsed: 2.081 sec
Running org.apache.hadoop.hbase.io.encoding.TestEncodedSeekers
Tests run: 10, Failures: 0, Errors: 0, Skipped: 0, Time elapsed: 80.113 sec
Running org.apache.hadoop.hbase.mapred.TestTableMapReduce
Tests run: 1, Failures: 0, Errors: 0, Skipped: 0, Time elapsed: 86.379 sec
Running org.apache.hadoop.hbase.snapshot.TestExportSnapshot
Tests run: 3, Failures: 0, Errors: 0, Skipped: 0, Time elapsed: 37.348 sec
Running org.apache.hadoop.hbase.fs.TestBlockReorder
Tests run: 3, Failures: 0, Errors: 0, Skipped: 0, Time elapsed: 31.118 sec
Running org.apache.hadoop.hbase.snapshot.TestFlushSnapshotFromClient
Tests run: 5, Failures: 0, Errors: 0, Skipped: 0, Time elapsed: 68.752 sec
Running org.apache.hadoop.hbase.io.encoding.TestDataBlockEncoders
Tests run: 12, Failures: 0, Errors: 0, Skipped: 0, Time elapsed: 163.837 sec
Running org.apache.hadoop.hbase.snapshot.TestRestoreFlushSnapshotFromClient
Tests run: 5, Failures: 1, Errors: 0, Skipped: 0, Time elapsed: 91.7 sec <<< FAILURE!
Running org.apache.hadoop.hbase.TestRegionRebalancing
Tests run: 2, Failures: 0, Errors: 0, Skipped: 0, Time elapsed: 34.875 sec
Running org.apache.hadoop.hbase.thrift.TestThriftServerCmdLine
Tests run: 32, Failures: 0, Errors: 0, Skipped: 0, Time elapsed: 59.324 sec
Running org.apache.hadoop.hbase.io.encoding.TestChangingEncoding
Tests run: 4, Failures: 0, Errors: 0, Skipped: 0, Time elapsed: 201.671 sec
Running org.apache.hadoop.hbase.thrift.TestThriftServer
Tests run: 1, Failures: 0, Errors: 0, Skipped: 0, Time elapsed: 78.065 sec

Results :

Failed tests:   testForceSplitMultiFamily(org.apache.hadoop.hbase.client.TestAdmin)
  testRestoreSnapshot(org.apache.hadoop.hbase.snapshot.TestRestoreFlushSnapshotFromClient):
expected:<1000> but was:<967>

Tests run: 1496, Failures: 2, Errors: 0, Skipped: 14

[JENKINS] Recording test results
[INFO]                                                                         
[INFO] ------------------------------------------------------------------------
[INFO] Skipping HBase
[INFO] This project has been banned from the build due to previous failures.
[INFO] ------------------------------------------------------------------------
[INFO]                                                                         
[INFO] ------------------------------------------------------------------------
[INFO] Skipping HBase
[INFO] This project has been banned from the build due to previous failures.
[INFO] ------------------------------------------------------------------------
[INFO] ------------------------------------------------------------------------
[INFO] Reactor Summary:
[INFO] 
[INFO] HBase ............................................. SUCCESS [43.324s]
[INFO] HBase - Common .................................... SUCCESS [1:04.464s]
[INFO] HBase - Protocol .................................. SUCCESS [18.636s]
[INFO] HBase - Client .................................... SUCCESS [12.794s]
[INFO] HBase - Prefix Tree ............................... SUCCESS [5.632s]
[INFO] HBase - Hadoop Compatibility ...................... SUCCESS [1.385s]
[INFO] HBase - Hadoop One Compatibility .................. SUCCESS [12.333s]
[INFO] HBase - Server .................................... FAILURE [55:47.197s]
[INFO] HBase - Integration Tests ......................... SKIPPED
[INFO] HBase - Examples .................................. SKIPPED
[INFO] HBase - Assembly .................................. SKIPPED
[INFO] ------------------------------------------------------------------------
[INFO] BUILD FAILURE
[INFO] ------------------------------------------------------------------------
[INFO] Total time: 58:57.182s
[INFO] Finished at: Thu Apr 25 19:11:28 UTC 2013
[INFO] Final Memory: 125M/2353M
[INFO] ------------------------------------------------------------------------
[JENKINS] Archiving <http://54.241.6.143/job/HBase-0.95/ws/hbase-common/pom.xml> to
/var/lib/jenkins/jobs/HBase-0.95/modules/org.apache.hbase$hbase-common/builds/2013-04-25_18-12-24/archive/org.apache.hbase/hbase-common/0.97.0-SNAPSHOT/hbase-common-0.97.0-SNAPSHOT.pom
[JENKINS] Archiving <http://54.241.6.143/job/HBase-0.95/ws/hbase-common/target/hbase-common-0.97.0-SNAPSHOT.jar>
to /var/lib/jenkins/jobs/HBase-0.95/modules/org.apache.hbase$hbase-common/builds/2013-04-25_18-12-24/archive/org.apache.hbase/hbase-common/0.97.0-SNAPSHOT/hbase-common-0.97.0-SNAPSHOT.jar
[JENKINS] Archiving <http://54.241.6.143/job/HBase-0.95/ws/hbase-common/target/hbase-common-0.97.0-SNAPSHOT-sources.jar>
to /var/lib/jenkins/jobs/HBase-0.95/modules/org.apache.hbase$hbase-common/builds/2013-04-25_18-12-24/archive/org.apache.hbase/hbase-common/0.97.0-SNAPSHOT/hbase-common-0.97.0-SNAPSHOT-sources.jar
[JENKINS] Archiving <http://54.241.6.143/job/HBase-0.95/ws/hbase-common/target/hbase-common-0.97.0-SNAPSHOT-tests.jar>
to /var/lib/jenkins/jobs/HBase-0.95/modules/org.apache.hbase$hbase-common/builds/2013-04-25_18-12-24/archive/org.apache.hbase/hbase-common/0.97.0-SNAPSHOT/hbase-common-0.97.0-SNAPSHOT-tests.jar
[JENKINS] Archiving <http://54.241.6.143/job/HBase-0.95/ws/hbase-hadoop-compat/pom.xml>
to /var/lib/jenkins/jobs/HBase-0.95/modules/org.apache.hbase$hbase-hadoop-compat/builds/2013-04-25_18-12-24/archive/org.apache.hbase/hbase-hadoop-compat/0.97.0-SNAPSHOT/hbase-hadoop-compat-0.97.0-SNAPSHOT.pom
[JENKINS] Archiving <http://54.241.6.143/job/HBase-0.95/ws/hbase-hadoop-compat/target/hbase-hadoop-compat-0.97.0-SNAPSHOT.jar>
to /var/lib/jenkins/jobs/HBase-0.95/modules/org.apache.hbase$hbase-hadoop-compat/builds/2013-04-25_18-12-24/archive/org.apache.hbase/hbase-hadoop-compat/0.97.0-SNAPSHOT/hbase-hadoop-compat-0.97.0-SNAPSHOT.jar
[JENKINS] Archiving <http://54.241.6.143/job/HBase-0.95/ws/hbase-hadoop-compat/target/hbase-hadoop-compat-0.97.0-SNAPSHOT-sources.jar>
to /var/lib/jenkins/jobs/HBase-0.95/modules/org.apache.hbase$hbase-hadoop-compat/builds/2013-04-25_18-12-24/archive/org.apache.hbase/hbase-hadoop-compat/0.97.0-SNAPSHOT/hbase-hadoop-compat-0.97.0-SNAPSHOT-sources.jar
[JENKINS] Archiving <http://54.241.6.143/job/HBase-0.95/ws/hbase-hadoop-compat/target/hbase-hadoop-compat-0.97.0-SNAPSHOT-tests.jar>
to /var/lib/jenkins/jobs/HBase-0.95/modules/org.apache.hbase$hbase-hadoop-compat/builds/2013-04-25_18-12-24/archive/org.apache.hbase/hbase-hadoop-compat/0.97.0-SNAPSHOT/hbase-hadoop-compat-0.97.0-SNAPSHOT-tests.jar
[JENKINS] Archiving <http://54.241.6.143/job/HBase-0.95/ws/hbase-examples/pom.xml> to
/var/lib/jenkins/jobs/HBase-0.95/modules/org.apache.hbase$hbase-examples/builds/2013-04-25_18-12-25/archive/org.apache.hbase/hbase-examples/0.97.0-SNAPSHOT/hbase-examples-0.97.0-SNAPSHOT.pom
[JENKINS] Archiving <http://54.241.6.143/job/HBase-0.95/ws/hbase-it/pom.xml> to /var/lib/jenkins/jobs/HBase-0.95/modules/org.apache.hbase$hbase-it/builds/2013-04-25_18-12-25/archive/org.apache.hbase/hbase-it/0.97.0-SNAPSHOT/hbase-it-0.97.0-SNAPSHOT.pom
[JENKINS] Archiving <http://54.241.6.143/job/HBase-0.95/ws/pom.xml> to /var/lib/jenkins/jobs/HBase-0.95/modules/org.apache.hbase$hbase/builds/2013-04-25_18-12-24/archive/org.apache.hbase/hbase/0.97.0-SNAPSHOT/hbase-0.97.0-SNAPSHOT.pom
[JENKINS] Archiving <http://54.241.6.143/job/HBase-0.95/ws/target/hbase-0.97.0-SNAPSHOT-site.xml>
to /var/lib/jenkins/jobs/HBase-0.95/modules/org.apache.hbase$hbase/builds/2013-04-25_18-12-24/archive/org.apache.hbase/hbase/0.97.0-SNAPSHOT/hbase-0.97.0-SNAPSHOT-site.xml
[JENKINS] Archiving <http://54.241.6.143/job/HBase-0.95/ws/hbase-assembly/pom.xml> to
/var/lib/jenkins/jobs/HBase-0.95/modules/org.apache.hbase$hbase-assembly/builds/2013-04-25_18-12-25/archive/org.apache.hbase/hbase-assembly/0.97.0-SNAPSHOT/hbase-assembly-0.97.0-SNAPSHOT.pom
[JENKINS] Archiving <http://54.241.6.143/job/HBase-0.95/ws/hbase-client/pom.xml> to
/var/lib/jenkins/jobs/HBase-0.95/modules/org.apache.hbase$hbase-client/builds/2013-04-25_18-12-24/archive/org.apache.hbase/hbase-client/0.97.0-SNAPSHOT/hbase-client-0.97.0-SNAPSHOT.pom
[JENKINS] Archiving <http://54.241.6.143/job/HBase-0.95/ws/hbase-client/target/hbase-client-0.97.0-SNAPSHOT.jar>
to /var/lib/jenkins/jobs/HBase-0.95/modules/org.apache.hbase$hbase-client/builds/2013-04-25_18-12-24/archive/org.apache.hbase/hbase-client/0.97.0-SNAPSHOT/hbase-client-0.97.0-SNAPSHOT.jar
[JENKINS] Archiving <http://54.241.6.143/job/HBase-0.95/ws/hbase-client/target/hbase-client-0.97.0-SNAPSHOT-sources.jar>
to /var/lib/jenkins/jobs/HBase-0.95/modules/org.apache.hbase$hbase-client/builds/2013-04-25_18-12-24/archive/org.apache.hbase/hbase-client/0.97.0-SNAPSHOT/hbase-client-0.97.0-SNAPSHOT-sources.jar
[JENKINS] Archiving <http://54.241.6.143/job/HBase-0.95/ws/hbase-client/target/hbase-client-0.97.0-SNAPSHOT-tests.jar>
to /var/lib/jenkins/jobs/HBase-0.95/modules/org.apache.hbase$hbase-client/builds/2013-04-25_18-12-24/archive/org.apache.hbase/hbase-client/0.97.0-SNAPSHOT/hbase-client-0.97.0-SNAPSHOT-tests.jar
[JENKINS] Archiving <http://54.241.6.143/job/HBase-0.95/ws/hbase-prefix-tree/pom.xml>
to /var/lib/jenkins/jobs/HBase-0.95/modules/org.apache.hbase$hbase-prefix-tree/builds/2013-04-25_18-12-25/archive/org.apache.hbase/hbase-prefix-tree/0.97.0-SNAPSHOT/hbase-prefix-tree-0.97.0-SNAPSHOT.pom
[JENKINS] Archiving <http://54.241.6.143/job/HBase-0.95/ws/hbase-prefix-tree/target/hbase-prefix-tree-0.97.0-SNAPSHOT.jar>
to /var/lib/jenkins/jobs/HBase-0.95/modules/org.apache.hbase$hbase-prefix-tree/builds/2013-04-25_18-12-25/archive/org.apache.hbase/hbase-prefix-tree/0.97.0-SNAPSHOT/hbase-prefix-tree-0.97.0-SNAPSHOT.jar
[JENKINS] Archiving <http://54.241.6.143/job/HBase-0.95/ws/hbase-prefix-tree/target/hbase-prefix-tree-0.97.0-SNAPSHOT-sources.jar>
to /var/lib/jenkins/jobs/HBase-0.95/modules/org.apache.hbase$hbase-prefix-tree/builds/2013-04-25_18-12-25/archive/org.apache.hbase/hbase-prefix-tree/0.97.0-SNAPSHOT/hbase-prefix-tree-0.97.0-SNAPSHOT-sources.jar
[JENKINS] Archiving <http://54.241.6.143/job/HBase-0.95/ws/hbase-prefix-tree/target/hbase-prefix-tree-0.97.0-SNAPSHOT-tests.jar>
to /var/lib/jenkins/jobs/HBase-0.95/modules/org.apache.hbase$hbase-prefix-tree/builds/2013-04-25_18-12-25/archive/org.apache.hbase/hbase-prefix-tree/0.97.0-SNAPSHOT/hbase-prefix-tree-0.97.0-SNAPSHOT-tests.jar
[JENKINS] Archiving <http://54.241.6.143/job/HBase-0.95/ws/hbase-protocol/pom.xml> to
/var/lib/jenkins/jobs/HBase-0.95/modules/org.apache.hbase$hbase-protocol/builds/2013-04-25_18-12-24/archive/org.apache.hbase/hbase-protocol/0.97.0-SNAPSHOT/hbase-protocol-0.97.0-SNAPSHOT.pom
[JENKINS] Archiving <http://54.241.6.143/job/HBase-0.95/ws/hbase-protocol/target/hbase-protocol-0.97.0-SNAPSHOT.jar>
to /var/lib/jenkins/jobs/HBase-0.95/modules/org.apache.hbase$hbase-protocol/builds/2013-04-25_18-12-24/archive/org.apache.hbase/hbase-protocol/0.97.0-SNAPSHOT/hbase-protocol-0.97.0-SNAPSHOT.jar
[JENKINS] Archiving <http://54.241.6.143/job/HBase-0.95/ws/hbase-protocol/target/hbase-protocol-0.97.0-SNAPSHOT-sources.jar>
to /var/lib/jenkins/jobs/HBase-0.95/modules/org.apache.hbase$hbase-protocol/builds/2013-04-25_18-12-24/archive/org.apache.hbase/hbase-protocol/0.97.0-SNAPSHOT/hbase-protocol-0.97.0-SNAPSHOT-sources.jar
[JENKINS] Archiving <http://54.241.6.143/job/HBase-0.95/ws/hbase-protocol/target/hbase-protocol-0.97.0-SNAPSHOT-tests.jar>
to /var/lib/jenkins/jobs/HBase-0.95/modules/org.apache.hbase$hbase-protocol/builds/2013-04-25_18-12-24/archive/org.apache.hbase/hbase-protocol/0.97.0-SNAPSHOT/hbase-protocol-0.97.0-SNAPSHOT-tests.jar
[JENKINS] Archiving <http://54.241.6.143/job/HBase-0.95/ws/hbase-hadoop1-compat/pom.xml>
to /var/lib/jenkins/jobs/HBase-0.95/modules/org.apache.hbase$hbase-hadoop1-compat/builds/2013-04-25_18-12-25/archive/org.apache.hbase/hbase-hadoop1-compat/0.97.0-SNAPSHOT/hbase-hadoop1-compat-0.97.0-SNAPSHOT.pom
[JENKINS] Archiving <http://54.241.6.143/job/HBase-0.95/ws/hbase-hadoop1-compat/target/hbase-hadoop1-compat-0.97.0-SNAPSHOT.jar>
to /var/lib/jenkins/jobs/HBase-0.95/modules/org.apache.hbase$hbase-hadoop1-compat/builds/2013-04-25_18-12-25/archive/org.apache.hbase/hbase-hadoop1-compat/0.97.0-SNAPSHOT/hbase-hadoop1-compat-0.97.0-SNAPSHOT.jar
[JENKINS] Archiving <http://54.241.6.143/job/HBase-0.95/ws/hbase-hadoop1-compat/target/hbase-hadoop1-compat-0.97.0-SNAPSHOT-sources.jar>
to /var/lib/jenkins/jobs/HBase-0.95/modules/org.apache.hbase$hbase-hadoop1-compat/builds/2013-04-25_18-12-25/archive/org.apache.hbase/hbase-hadoop1-compat/0.97.0-SNAPSHOT/hbase-hadoop1-compat-0.97.0-SNAPSHOT-sources.jar
[JENKINS] Archiving <http://54.241.6.143/job/HBase-0.95/ws/hbase-hadoop1-compat/target/hbase-hadoop1-compat-0.97.0-SNAPSHOT-tests.jar>
to /var/lib/jenkins/jobs/HBase-0.95/modules/org.apache.hbase$hbase-hadoop1-compat/builds/2013-04-25_18-12-25/archive/org.apache.hbase/hbase-hadoop1-compat/0.97.0-SNAPSHOT/hbase-hadoop1-compat-0.97.0-SNAPSHOT-tests.jar
[JENKINS] Archiving <http://54.241.6.143/job/HBase-0.95/ws/hbase-server/pom.xml> to
/var/lib/jenkins/jobs/HBase-0.95/modules/org.apache.hbase$hbase-server/builds/2013-04-25_18-12-24/archive/org.apache.hbase/hbase-server/0.97.0-SNAPSHOT/hbase-server-0.97.0-SNAPSHOT.pom
Waiting for Jenkins to finish collecting data
mavenExecutionResult exceptions not empty
message : Failed to execute goal org.apache.maven.plugins:maven-surefire-plugin:2.12-TRUNK-HBASE-2:test
(secondPartTestsExecution) on project hbase-server: Failure or timeout
cause : Failure or timeout
Stack trace : 
org.apache.maven.lifecycle.LifecycleExecutionException: Failed to execute goal org.apache.maven.plugins:maven-surefire-plugin:2.12-TRUNK-HBASE-2:test
(secondPartTestsExecution) on project hbase-server: Failure or timeout
	at org.apache.maven.lifecycle.internal.MojoExecutor.execute(MojoExecutor.java:217)
	at org.apache.maven.lifecycle.internal.MojoExecutor.execute(MojoExecutor.java:153)
	at org.apache.maven.lifecycle.internal.MojoExecutor.execute(MojoExecutor.java:145)
	at org.apache.maven.lifecycle.internal.LifecycleModuleBuilder.buildProject(LifecycleModuleBuilder.java:84)
	at org.apache.maven.lifecycle.internal.LifecycleModuleBuilder.buildProject(LifecycleModuleBuilder.java:59)
	at org.apache.maven.lifecycle.internal.LifecycleStarter.singleThreadedBuild(LifecycleStarter.java:183)
	at org.apache.maven.lifecycle.internal.LifecycleStarter.execute(LifecycleStarter.java:161)
	at org.apache.maven.DefaultMaven.doExecute(DefaultMaven.java:320)
	at org.apache.maven.DefaultMaven.execute(DefaultMaven.java:156)
	at org.jvnet.hudson.maven3.launcher.Maven3Launcher.main(Maven3Launcher.java:79)
	at sun.reflect.NativeMethodAccessorImpl.invoke0(Native Method)
	at sun.reflect.NativeMethodAccessorImpl.invoke(NativeMethodAccessorImpl.java:39)
	at sun.reflect.DelegatingMethodAccessorImpl.invoke(DelegatingMethodAccessorImpl.java:25)
	at java.lang.reflect.Method.invoke(Method.java:597)
	at org.codehaus.plexus.classworlds.launcher.Launcher.launchStandard(Launcher.java:329)
	at org.codehaus.plexus.classworlds.launcher.Launcher.launch(Launcher.java:239)
	at org.jvnet.hudson.maven3.agent.Maven3Main.launch(Maven3Main.java:158)
	at hudson.maven.Maven3Builder.call(Maven3Builder.java:100)
	at hudson.maven.Maven3Builder.call(Maven3Builder.java:66)
	at hudson.remoting.UserRequest.perform(UserRequest.java:118)
	at hudson.remoting.UserRequest.perform(UserRequest.java:48)
	at hudson.remoting.Request$2.run(Request.java:326)
	at hudson.remoting.InterceptingExecutorService$1.call(InterceptingExecutorService.java:72)
	at java.util.concurrent.FutureTask$Sync.innerRun(FutureTask.java:303)
	at java.util.concurrent.FutureTask.run(FutureTask.java:138)
	at java.util.concurrent.ThreadPoolExecutor$Worker.runTask(ThreadPoolExecutor.java:895)
	at java.util.concurrent.ThreadPoolExecutor$Worker.run(ThreadPoolExecutor.java:918)
	at java.lang.Thread.run(Thread.java:662)
Caused by: org.apache.maven.plugin.MojoExecutionException: Failure or timeout
	at org.apache.maven.plugin.surefire.SurefirePlugin.assertNoFailureOrTimeout(SurefirePlugin.java:643)
	at org.apache.maven.plugin.surefire.SurefirePlugin.handleSummary(SurefirePlugin.java:624)
	at org.apache.maven.plugin.surefire.AbstractSurefireMojo.executeAfterPreconditionsChecked(AbstractSurefireMojo.java:137)
	at org.apache.maven.plugin.surefire.AbstractSurefireMojo.execute(AbstractSurefireMojo.java:98)
	at org.apache.maven.plugin.DefaultBuildPluginManager.executeMojo(DefaultBuildPluginManager.java:101)
	at org.apache.maven.lifecycle.internal.MojoExecutor.execute(MojoExecutor.java:209)
	... 27 more
channel stopped

Mime
View raw message