hbase-dev mailing list archives

Site index · List index
Message view « Date » · « Thread »
Top « Date » · « Thread »
From Apache Jenkins Server <jenk...@builds.apache.org>
Subject Build failed in Jenkins: HBase-TRUNK-on-Hadoop-2.0.0 #492
Date Thu, 11 Apr 2013 01:51:57 GMT
See <https://builds.apache.org/job/HBase-TRUNK-on-Hadoop-2.0.0/492/changes>

Changes:

[larsh] HBASE-8316 JoinedHeap for non essential column families should reseek instead of seek

[tedyu] HBASE-8320 test-patch.sh should post back compilation error against hadoop 2.0

[mbertozzi] HBASE-7658 grant with an empty string as permission should throw an exception

[ramkrishna] HBASE-8266-Master cannot start if TableNotFoundException is thrown while partial
table recovery(Ram)

[stack] HBASE-8165 Update our protobuf to 2.5 from 2.4.1

------------------------------------------
[...truncated 3990 lines...]
  org.apache.hadoop.hbase.master.TestMasterFileSystem: This is supposed to be overridden by
subclasses.
  org.apache.hadoop.hbase.master.TestMaster: This is supposed to be overridden by subclasses.
  org.apache.hadoop.hbase.master.cleaner.TestSnapshotFromMaster: This is supposed to be overridden
by subclasses.
  org.apache.hadoop.hbase.master.cleaner.TestHFileCleaner: This is supposed to be overridden
by subclasses.
  testMasterFailoverWithMockedRITOnDeadRS(org.apache.hadoop.hbase.master.TestMasterFailover):
This is supposed to be overridden by subclasses.
  testMasterFailoverWithMockedRIT(org.apache.hadoop.hbase.master.TestMasterFailover): This
is supposed to be overridden by subclasses.
  testShouldCheckMasterFailOverWhenMETAIsInOpenedState(org.apache.hadoop.hbase.master.TestMasterFailover):
This is supposed to be overridden by subclasses.
  testSimpleMasterFailover(org.apache.hadoop.hbase.master.TestMasterFailover): This is supposed
to be overridden by subclasses.
  testOpenedRegionHandlerOnMasterRestart(org.apache.hadoop.hbase.master.TestOpenedRegionHandler):
This is supposed to be overridden by subclasses.
  testTableReadLock(org.apache.hadoop.hbase.master.TestTableLockManager): This is supposed
to be overridden by subclasses.
  testAlterAndDisable(org.apache.hadoop.hbase.master.TestTableLockManager): This is supposed
to be overridden by subclasses.
  testDelete(org.apache.hadoop.hbase.master.TestTableLockManager): This is supposed to be
overridden by subclasses.
  testLockTimeoutException(org.apache.hadoop.hbase.master.TestTableLockManager): This is supposed
to be overridden by subclasses.
  org.apache.hadoop.hbase.master.TestMasterMetrics: This is supposed to be overridden by subclasses.
  testRecoveredEdits(org.apache.hadoop.hbase.master.TestDistributedLogSplitting): This is
supposed to be overridden by subclasses.
  testThreeRSAbort(org.apache.hadoop.hbase.master.TestDistributedLogSplitting): This is supposed
to be overridden by subclasses.
  testDelayedDeleteOnFailure(org.apache.hadoop.hbase.master.TestDistributedLogSplitting):
This is supposed to be overridden by subclasses.
  testWorkerAbort(org.apache.hadoop.hbase.master.TestDistributedLogSplitting): This is supposed
to be overridden by subclasses.
  testRestartClusterAfterKill(org.apache.hadoop.hbase.master.TestRestartCluster): This is
supposed to be overridden by subclasses.
  testClusterRestart(org.apache.hadoop.hbase.master.TestRestartCluster): This is supposed
to be overridden by subclasses.
  org.apache.hadoop.hbase.master.TestMasterMetricsWrapper: This is supposed to be overridden
by subclasses.
  org.apache.hadoop.hbase.master.snapshot.TestSnapshotFileCache: This is supposed to be overridden
by subclasses.
  org.apache.hadoop.hbase.master.TestMasterTransitions: This is supposed to be overridden
by subclasses.
  org.apache.hadoop.hbase.master.TestAssignmentManagerOnCluster: This is supposed to be overridden
by subclasses.
  testMasterShutdown(org.apache.hadoop.hbase.master.TestMasterShutdown): This is supposed
to be overridden by subclasses.
  testForCheckingIfEnableAndDisableWorksFineAfterSwitch(org.apache.hadoop.hbase.master.TestMasterRestartAfterDisablingTable):
This is supposed to be overridden by subclasses.
  testBasicRollingRestart(org.apache.hadoop.hbase.master.TestRollingRestart): This is supposed
to be overridden by subclasses.
  org.apache.hadoop.hbase.master.TestZKBasedOpenCloseRegion: This is supposed to be overridden
by subclasses.
  testMasterFailoverBalancerPersistence(org.apache.hadoop.hbase.master.TestMasterFailoverBalancerPersistence):
This is supposed to be overridden by subclasses.
  org.apache.hadoop.hbase.master.handler.TestTableDescriptorModification: This is supposed
to be overridden by subclasses.
  testCreateTableHandlerIfCalledTwoTimesAndFirstOneIsUnderProgress(org.apache.hadoop.hbase.master.handler.TestCreateTableHandler):
This is supposed to be overridden by subclasses.
  testMasterRestartAfterEnablingNodeIsCreated(org.apache.hadoop.hbase.master.handler.TestCreateTableHandler):
This is supposed to be overridden by subclasses.
  org.apache.hadoop.hbase.zookeeper.TestZooKeeperACL: This is supposed to be overridden by
subclasses.
  org.apache.hadoop.hbase.backup.TestHFileArchiving: This is supposed to be overridden by
subclasses.
  org.apache.hadoop.hbase.TestDrainingServer: This is supposed to be overridden by subclasses.
  testLocalHBaseCluster(org.apache.hadoop.hbase.TestLocalHBaseCluster): This is supposed to
be overridden by subclasses.
  org.apache.hadoop.hbase.TestFullLogReconstruction: This is supposed to be overridden by
subclasses.
  testRebalanceOnRegionServerNumberChange[0](org.apache.hadoop.hbase.TestRegionRebalancing):
This is supposed to be overridden by subclasses.
  testRebalanceOnRegionServerNumberChange[1](org.apache.hadoop.hbase.TestRegionRebalancing):
This is supposed to be overridden by subclasses.
  org.apache.hadoop.hbase.TestMultiVersions: This is supposed to be overridden by subclasses.
  org.apache.hadoop.hbase.TestInfoServers: This is supposed to be overridden by subclasses.
  testMergeTable(org.apache.hadoop.hbase.util.TestMergeTable): This is supposed to be overridden
by subclasses.
  testcomputeHDFSBlocksDistribution(org.apache.hadoop.hbase.util.TestFSUtils): This is supposed
to be overridden by subclasses.
  testIsHDFS(org.apache.hadoop.hbase.util.TestFSUtils): This is supposed to be overridden
by subclasses.
  loadTest[0](org.apache.hadoop.hbase.util.TestMiniClusterLoadParallel): This is supposed
to be overridden by subclasses.
  loadTest[1](org.apache.hadoop.hbase.util.TestMiniClusterLoadParallel): This is supposed
to be overridden by subclasses.
  loadTest[2](org.apache.hadoop.hbase.util.TestMiniClusterLoadParallel): This is supposed
to be overridden by subclasses.
  loadTest[3](org.apache.hadoop.hbase.util.TestMiniClusterLoadParallel): This is supposed
to be overridden by subclasses.
  org.apache.hadoop.hbase.util.TestHBaseFsck: This is supposed to be overridden by subclasses.
  testMergeTool(org.apache.hadoop.hbase.util.TestMergeTool): This is supposed to be overridden
by subclasses.
  testMetaRebuild(org.apache.hadoop.hbase.util.hbck.TestOfflineMetaRebuildBase): This is supposed
to be overridden by subclasses.
  testMetaRebuildOverlapFail(org.apache.hadoop.hbase.util.hbck.TestOfflineMetaRebuildOverlap):
This is supposed to be overridden by subclasses.
  testMetaRebuildHoleFail(org.apache.hadoop.hbase.util.hbck.TestOfflineMetaRebuildHole): This
is supposed to be overridden by subclasses.
  loadTest[0](org.apache.hadoop.hbase.util.TestMiniClusterLoadEncoded): This is supposed to
be overridden by subclasses.
  loadTest[1](org.apache.hadoop.hbase.util.TestMiniClusterLoadEncoded): This is supposed to
be overridden by subclasses.
  loadTest[2](org.apache.hadoop.hbase.util.TestMiniClusterLoadEncoded): This is supposed to
be overridden by subclasses.
  loadTest[3](org.apache.hadoop.hbase.util.TestMiniClusterLoadEncoded): This is supposed to
be overridden by subclasses.
  loadTest[4](org.apache.hadoop.hbase.util.TestMiniClusterLoadEncoded): This is supposed to
be overridden by subclasses.
  loadTest[0](org.apache.hadoop.hbase.util.TestMiniClusterLoadSequential): This is supposed
to be overridden by subclasses.
  loadTest[1](org.apache.hadoop.hbase.util.TestMiniClusterLoadSequential): This is supposed
to be overridden by subclasses.
  loadTest[2](org.apache.hadoop.hbase.util.TestMiniClusterLoadSequential): This is supposed
to be overridden by subclasses.
  loadTest[3](org.apache.hadoop.hbase.util.TestMiniClusterLoadSequential): This is supposed
to be overridden by subclasses.
  org.apache.hadoop.hbase.util.TestRegionSplitter: This is supposed to be overridden by subclasses.
  org.apache.hadoop.hbase.util.TestCoprocessorScanPolicy: This is supposed to be overridden
by subclasses.
  org.apache.hadoop.hbase.security.access.TestTablePermissions: This is supposed to be overridden
by subclasses.
  org.apache.hadoop.hbase.security.access.TestAccessControlFilter: This is supposed to be
overridden by subclasses.
  org.apache.hadoop.hbase.security.access.TestAccessController: This is supposed to be overridden
by subclasses.
  org.apache.hadoop.hbase.security.access.TestZKPermissionsWatcher: This is supposed to be
overridden by subclasses.
  org.apache.hadoop.hbase.regionserver.TestRSKilledWhenMasterInitializing: This is supposed
to be overridden by subclasses.
  org.apache.hadoop.hbase.regionserver.TestRSKilledWhenMasterInitializing: null not an instance
of org.apache.hadoop.hbase.MiniHBaseCluster
  org.apache.hadoop.hbase.regionserver.TestServerCustomProtocol: This is supposed to be overridden
by subclasses.
  org.apache.hadoop.hbase.master.handler.TestTableDeleteFamilyHandler: This is supposed to
be overridden by subclasses.
  org.apache.hadoop.hbase.master.handler.TestTableDeleteFamilyHandler: org.apache.hadoop.hbase.exceptions.MasterNotRunningException:
Can't get connection to ZooKeeper: KeeperErrorCode = ConnectionLoss for /hbase
  org.apache.hadoop.hbase.regionserver.TestCompactionState: This is supposed to be overridden
by subclasses.
  org.apache.hadoop.hbase.regionserver.TestSplitTransactionOnCluster: This is supposed to
be overridden by subclasses.
  org.apache.hadoop.hbase.regionserver.TestRegionServerMetrics: This is supposed to be overridden
by subclasses.
  org.apache.hadoop.hbase.regionserver.TestEndToEndSplitTransaction: This is supposed to be
overridden by subclasses.
  testJoinedScanners(org.apache.hadoop.hbase.regionserver.TestJoinedScanners): This is supposed
to be overridden by subclasses.
  testDataCorrectnessReplayingRecoveredEdits(org.apache.hadoop.hbase.regionserver.TestHRegionOnCluster):
This is supposed to be overridden by subclasses.
  testgetHDFSBlocksDistribution(org.apache.hadoop.hbase.regionserver.TestHRegion): This is
supposed to be overridden by subclasses.
  testgetHDFSBlocksDistribution(org.apache.hadoop.hbase.regionserver.TestHRegionBusyWait):
This is supposed to be overridden by subclasses.
  org.apache.hadoop.hbase.regionserver.TestStoreFileBlockCacheSummary: This is supposed to
be overridden by subclasses.
  testClusterId(org.apache.hadoop.hbase.regionserver.TestClusterId): This is supposed to be
overridden by subclasses.
  org.apache.hadoop.hbase.regionserver.TestRegionServerNoMaster: This is supposed to be overridden
by subclasses.
  org.apache.hadoop.hbase.regionserver.TestRegionServerNoMaster
  org.apache.hadoop.hbase.regionserver.wal.TestWALReplay: This is supposed to be overridden
by subclasses.
  testFlushedSequenceIdsSentToHMaster(org.apache.hadoop.hbase.regionserver.wal.TestHLogFiltering):
This is supposed to be overridden by subclasses.
  testRSAbortWithUnflushedEdits(org.apache.hadoop.hbase.regionserver.wal.TestLogRollAbort):
This is supposed to be overridden by subclasses.
  org.apache.hadoop.hbase.regionserver.wal.TestWALReplayCompressed: This is supposed to be
overridden by subclasses.
  org.apache.hadoop.hbase.regionserver.wal.TestHLog: This is supposed to be overridden by
subclasses.
  org.apache.hadoop.hbase.regionserver.wal.TestHLogSplit: This is supposed to be overridden
by subclasses.
  org.apache.hadoop.hbase.regionserver.wal.TestHLogSplitCompressed: This is supposed to be
overridden by subclasses.
  testLogRolling(org.apache.hadoop.hbase.regionserver.wal.TestLogRolling): This is supposed
to be overridden by subclasses.
  testLogRollOnDatanodeDeath(org.apache.hadoop.hbase.regionserver.wal.TestLogRolling): This
is supposed to be overridden by subclasses.
  org.apache.hadoop.hbase.regionserver.TestRegionMergeTransactionOnCluster: This is supposed
to be overridden by subclasses.
  testAtomicBulkLoad(org.apache.hadoop.hbase.regionserver.TestHRegionServerBulkLoad): This
is supposed to be overridden by subclasses.
  org.apache.hadoop.hbase.filter.TestFilterWithScanLimits: This is supposed to be overridden
by subclasses.
  org.apache.hadoop.hbase.filter.TestFilterWrapper: This is supposed to be overridden by subclasses.
  org.apache.hadoop.hbase.filter.TestColumnRangeFilter: This is supposed to be overridden
by subclasses.
  org.apache.hadoop.hbase.coprocessor.TestClassLoading: This is supposed to be overridden
by subclasses.
  org.apache.hadoop.hbase.coprocessor.TestAggregateProtocol: This is supposed to be overridden
by subclasses.
  org.apache.hadoop.hbase.coprocessor.TestRowProcessorEndpoint: This is supposed to be overridden
by subclasses.
  org.apache.hadoop.hbase.coprocessor.TestRegionServerCoprocessorExceptionWithRemove: This
is supposed to be overridden by subclasses.
  org.apache.hadoop.hbase.coprocessor.TestRegionServerCoprocessorExceptionWithAbort: This
is supposed to be overridden by subclasses.
  org.apache.hadoop.hbase.coprocessor.TestMasterObserver: This is supposed to be overridden
by subclasses.
  org.apache.hadoop.hbase.coprocessor.TestCoprocessorEndpoint: This is supposed to be overridden
by subclasses.
  org.apache.hadoop.hbase.coprocessor.TestWALObserver: This is supposed to be overridden by
subclasses.
  org.apache.hadoop.hbase.coprocessor.TestMasterCoprocessorExceptionWithAbort: This is supposed
to be overridden by subclasses.
  org.apache.hadoop.hbase.coprocessor.TestRegionObserverInterface: This is supposed to be
overridden by subclasses.
  org.apache.hadoop.hbase.coprocessor.TestMasterCoprocessorExceptionWithRemove: This is supposed
to be overridden by subclasses.
  org.apache.hadoop.hbase.coprocessor.TestBigDecimalColumnInterpreter: This is supposed to
be overridden by subclasses.
  org.apache.hadoop.hbase.coprocessor.TestRegionObserverBypass: This is supposed to be overridden
by subclasses.
  org.apache.hadoop.hbase.mapred.TestTableMapReduce: This is supposed to be overridden by
subclasses.
  org.apache.hadoop.hbase.mapred.TestTableInputFormat: This is supposed to be overridden by
subclasses.
  testGlobalMemStore(org.apache.hadoop.hbase.TestGlobalMemStoreSize): This is supposed to
be overridden by subclasses.
  org.apache.hadoop.hbase.mapreduce.TestTableMapReduce: This is supposed to be overridden
by subclasses.
  testBlockLocationReorder(org.apache.hadoop.hbase.fs.TestBlockReorder): This is supposed
to be overridden by subclasses.
  testBlockLocation(org.apache.hadoop.hbase.fs.TestBlockReorder): This is supposed to be overridden
by subclasses.
  testHBaseCluster(org.apache.hadoop.hbase.fs.TestBlockReorder): This is supposed to be overridden
by subclasses.
  org.apache.hadoop.hbase.mapreduce.TestSecureLoadIncrementalHFiles: This is supposed to be
overridden by subclasses.
  org.apache.hadoop.hbase.mapreduce.TestHLogRecordReader: This is supposed to be overridden
by subclasses.
  org.apache.hadoop.hbase.mapreduce.TestLoadIncrementalHFilesSplitRecovery: This is supposed
to be overridden by subclasses.
  org.apache.hadoop.hbase.mapreduce.TestSecureLoadIncrementalHFilesSplitRecovery: This is
supposed to be overridden by subclasses.
  org.apache.hadoop.hbase.mapreduce.TestWALPlayer: This is supposed to be overridden by subclasses.
  org.apache.hadoop.hbase.mapreduce.TestImportTsv: This is supposed to be overridden by subclasses.
  testExcludeAllFromMinorCompaction(org.apache.hadoop.hbase.mapreduce.TestHFileOutputFormat):
This is supposed to be overridden by subclasses.
  testExcludeMinorCompaction(org.apache.hadoop.hbase.mapreduce.TestHFileOutputFormat): This
is supposed to be overridden by subclasses.
  testMRIncrementalLoad(org.apache.hadoop.hbase.mapreduce.TestHFileOutputFormat): This is
supposed to be overridden by subclasses.
  testMRIncrementalLoadWithSplit(org.apache.hadoop.hbase.mapreduce.TestHFileOutputFormat):
This is supposed to be overridden by subclasses.
  org.apache.hadoop.hbase.mapreduce.TestRowCounter: This is supposed to be overridden by subclasses.
  org.apache.hadoop.hbase.mapreduce.TestTableInputFormatScan: This is supposed to be overridden
by subclasses.
  org.apache.hadoop.hbase.mapreduce.TestMultiTableInputFormat: This is supposed to be overridden
by subclasses.
  org.apache.hadoop.hbase.mapreduce.TestMultithreadedTableMapper: This is supposed to be overridden
by subclasses.
  org.apache.hadoop.hbase.mapreduce.TestTimeRangeMapRed: This is supposed to be overridden
by subclasses.
  org.apache.hadoop.hbase.mapreduce.TestLoadIncrementalHFiles: This is supposed to be overridden
by subclasses.
  org.apache.hadoop.hbase.mapreduce.TestImportExport: This is supposed to be overridden by
subclasses.
  org.apache.hadoop.hbase.trace.TestHTraceHooks: This is supposed to be overridden by subclasses.
  testMixedAtomicity(org.apache.hadoop.hbase.TestAcidGuarantees): This is supposed to be overridden
by subclasses.
  testGetAtomicity(org.apache.hadoop.hbase.TestAcidGuarantees): This is supposed to be overridden
by subclasses.
  testScanAtomicity(org.apache.hadoop.hbase.TestAcidGuarantees): This is supposed to be overridden
by subclasses.
  org.apache.hadoop.hbase.snapshot.TestExportSnapshot: This is supposed to be overridden by
subclasses.
  org.apache.hadoop.hbase.snapshot.TestRestoreFlushSnapshotFromClient: This is supposed to
be overridden by subclasses.
  org.apache.hadoop.hbase.snapshot.TestFlushSnapshotFromClient: This is supposed to be overridden
by subclasses.
  org.apache.hadoop.hbase.thrift2.TestThriftHBaseServiceHandler: This is supposed to be overridden
by subclasses.
  org.apache.hadoop.hbase.catalog.TestMetaReaderEditor: This is supposed to be overridden
by subclasses.
  org.apache.hadoop.hbase.catalog.TestMetaReaderEditor
  org.apache.hadoop.hbase.catalog.TestMetaMigrationConvertingToPB: This is supposed to be
overridden by subclasses.
  org.apache.hadoop.hbase.client.TestFromClientSide3: This is supposed to be overridden by
subclasses.
  org.apache.hadoop.hbase.client.TestTimestampsFilter: This is supposed to be overridden by
subclasses.
  org.apache.hadoop.hbase.client.TestShell: This is supposed to be overridden by subclasses.
  org.apache.hadoop.hbase.client.TestFromClientSide: This is supposed to be overridden by
subclasses.
  org.apache.hadoop.hbase.client.TestClientTimeouts: This is supposed to be overridden by
subclasses.
  org.apache.hadoop.hbase.client.TestScannersFromClientSide: This is supposed to be overridden
by subclasses.
  org.apache.hadoop.hbase.client.TestHCM: This is supposed to be overridden by subclasses.
  org.apache.hadoop.hbase.client.TestScannerTimeout: This is supposed to be overridden by
subclasses.
  org.apache.hadoop.hbase.client.TestFromClientSideWithCoprocessor: This is supposed to be
overridden by subclasses.
  org.apache.hadoop.hbase.client.TestHTableMultiplexer: This is supposed to be overridden
by subclasses.
  org.apache.hadoop.hbase.client.TestMetaScanner: This is supposed to be overridden by subclasses.
  org.apache.hadoop.hbase.client.TestHTableUtil: This is supposed to be overridden by subclasses.
  org.apache.hadoop.hbase.client.TestRestoreSnapshotFromClient: This is supposed to be overridden
by subclasses.
  org.apache.hadoop.hbase.client.TestSnapshotFromClient: This is supposed to be overridden
by subclasses.
  org.apache.hadoop.hbase.client.TestSnapshotMetadata: This is supposed to be overridden by
subclasses.
  org.apache.hadoop.hbase.client.TestMultipleTimestamps: This is supposed to be overridden
by subclasses.
  org.apache.hadoop.hbase.client.TestSnapshotCloneIndependence: This is supposed to be overridden
by subclasses.
  org.apache.hadoop.hbase.client.TestClientScannerRPCTimeout: This is supposed to be overridden
by subclasses.
  org.apache.hadoop.hbase.client.TestMultiParallel: This is supposed to be overridden by subclasses.
  org.apache.hadoop.hbase.client.TestAdmin: This is supposed to be overridden by subclasses.
  org.apache.hadoop.hbase.client.TestCloneSnapshotFromClient: This is supposed to be overridden
by subclasses.
  org.apache.hadoop.hbase.constraint.TestConstraint: This is supposed to be overridden by
subclasses.
  org.apache.hadoop.hbase.rest.TestGzipFilter: This is supposed to be overridden by subclasses.
  org.apache.hadoop.hbase.rest.TestMultiRowResource: This is supposed to be overridden by
subclasses.
  org.apache.hadoop.hbase.rest.TestScannersWithFilters: This is supposed to be overridden
by subclasses.
  org.apache.hadoop.hbase.rest.TestRowResource: This is supposed to be overridden by subclasses.
  org.apache.hadoop.hbase.rest.client.TestRemoteAdmin: This is supposed to be overridden by
subclasses.
  org.apache.hadoop.hbase.rest.client.TestRemoteTable: This is supposed to be overridden by
subclasses.
  org.apache.hadoop.hbase.rest.client.TestRemoteTable
  org.apache.hadoop.hbase.rest.TestVersionResource: This is supposed to be overridden by subclasses.
  org.apache.hadoop.hbase.rest.TestScannerResource: This is supposed to be overridden by subclasses.
  org.apache.hadoop.hbase.rest.TestTableResource: This is supposed to be overridden by subclasses.
  org.apache.hadoop.hbase.rest.TestStatusResource: This is supposed to be overridden by subclasses.
  org.apache.hadoop.hbase.rest.TestSchemaResource: This is supposed to be overridden by subclasses.
  org.apache.hadoop.hbase.thrift.TestThriftServerCmdLine: This is supposed to be overridden
by subclasses.
  org.apache.hadoop.hbase.thrift.TestThriftServer: This is supposed to be overridden by subclasses.
  loadTest[0](org.apache.hadoop.hbase.io.encoding.TestLoadAndSwitchEncodeOnDisk): This is
supposed to be overridden by subclasses.
  org.apache.hadoop.hbase.io.encoding.TestChangingEncoding: This is supposed to be overridden
by subclasses.
  testHDFSLinkReadDuringDelete(org.apache.hadoop.hbase.io.TestFileLink): This is supposed
to be overridden by subclasses.
  testHDFSLinkReadDuringRename(org.apache.hadoop.hbase.io.TestFileLink): This is supposed
to be overridden by subclasses.
  testBootMasterFirst(org.apache.hadoop.hbase.TestClusterBootOrder)
  testBootRegionServerFirst(org.apache.hadoop.hbase.TestClusterBootOrder)
  org.apache.hadoop.hbase.replication.TestReplicationDisableInactivePeer: This is supposed
to be overridden by subclasses.
  testMultiSlaveReplication(org.apache.hadoop.hbase.replication.TestMultiSlaveReplication):
This is supposed to be overridden by subclasses.
  org.apache.hadoop.hbase.replication.regionserver.TestReplicationSink: This is supposed to
be overridden by subclasses.
  org.apache.hadoop.hbase.replication.TestReplicationSource: This is supposed to be overridden
by subclasses.
  testCyclicReplication(org.apache.hadoop.hbase.replication.TestMasterReplication): This is
supposed to be overridden by subclasses.
  testSimplePutDelete(org.apache.hadoop.hbase.replication.TestMasterReplication): This is
supposed to be overridden by subclasses.
  org.apache.hadoop.hbase.replication.TestReplicationSmallTests: This is supposed to be overridden
by subclasses.
  org.apache.hadoop.hbase.replication.TestReplicationQueueFailover: This is supposed to be
overridden by subclasses.
  org.apache.hadoop.hbase.replication.TestReplicationQueueFailoverCompressed: This is supposed
to be overridden by subclasses.
  org.apache.hadoop.hbase.TestZooKeeper: This is supposed to be overridden by subclasses.
  testMultipleStartStop(org.apache.hadoop.hbase.TestHBaseTestingUtility): This is supposed
to be overridden by subclasses.
  testMiniDFSCluster(org.apache.hadoop.hbase.TestHBaseTestingUtility): This is supposed to
be overridden by subclasses.
  testMultiClusters(org.apache.hadoop.hbase.TestHBaseTestingUtility): This is supposed to
be overridden by subclasses.
  testMiniCluster(org.apache.hadoop.hbase.TestHBaseTestingUtility): This is supposed to be
overridden by subclasses.
  testSetupClusterTestBuildDir(org.apache.hadoop.hbase.TestHBaseTestingUtility): This is supposed
to be overridden by subclasses.

Tests run: 725, Failures: 0, Errors: 204, Skipped: 1

[INFO] ------------------------------------------------------------------------
[INFO] Reactor Summary:
[INFO] 
[INFO] HBase ............................................. SUCCESS [5.917s]
[INFO] HBase - Common .................................... SUCCESS [21.808s]
[INFO] HBase - Protocol .................................. SUCCESS [18.017s]
[INFO] HBase - Client .................................... SUCCESS [8.210s]
[INFO] HBase - Prefix Tree ............................... SUCCESS [3.913s]
[INFO] HBase - Hadoop Compatibility ...................... SUCCESS [1.025s]
[INFO] HBase - Hadoop Two Compatibility .................. SUCCESS [4.777s]
[INFO] HBase - Server .................................... FAILURE [20:16.016s]
[INFO] HBase - Integration Tests ......................... SKIPPED
[INFO] HBase - Examples .................................. SKIPPED
[INFO] HBase - Assembly .................................. SKIPPED
[INFO] ------------------------------------------------------------------------
[INFO] BUILD FAILURE
[INFO] ------------------------------------------------------------------------
[INFO] Total time: 21:22.964s
[INFO] Finished at: Thu Apr 11 01:51:05 UTC 2013
[INFO] Final Memory: 58M/535M
[INFO] ------------------------------------------------------------------------
[ERROR] Failed to execute goal org.apache.maven.plugins:maven-surefire-plugin:2.12-TRUNK-HBASE-2:test
(secondPartTestsExecution) on project hbase-server: There are test failures.
[ERROR] 
[ERROR] Please refer to <https://builds.apache.org/job/HBase-TRUNK-on-Hadoop-2.0.0/ws/trunk/hbase-server/target/surefire-reports>
for the individual test results.
[ERROR] -> [Help 1]
[ERROR] 
[ERROR] To see the full stack trace of the errors, re-run Maven with the -e switch.
[ERROR] Re-run Maven using the -X switch to enable full debug logging.
[ERROR] 
[ERROR] For more information about the errors and possible solutions, please read the following
articles:
[ERROR] [Help 1] http://cwiki.apache.org/confluence/display/MAVEN/MojoFailureException
[ERROR] 
[ERROR] After correcting the problems, you can resume the build with the command
[ERROR]   mvn <goals> -rf :hbase-server
Build step 'Invoke top-level Maven targets' marked build as failure
Archiving artifacts
Recording test results
Updating HBASE-8165
Updating HBASE-8320
Updating HBASE-8266
Updating HBASE-8316
Updating HBASE-7658

Mime
View raw message