hbase-dev mailing list archives

Site index · List index
Message view « Date » · « Thread »
Top « Date » · « Thread »
From Matteo Bertozzi <theo.berto...@gmail.com>
Subject Re: Build failed in Jenkins: HBase-0.94 #878
Date Mon, 04 Mar 2013 13:37:12 GMT
this failure seems to be related to
HBASE-7299<https://issues.apache.org/jira/browse/HBASE-7299>.
I've attached a 94 patch to HBASE-7360  that seems to fix the problem.

On Mon, Mar 4, 2013 at 1:14 PM, Apache Jenkins Server <
jenkins@builds.apache.org> wrote:

> See <https://builds.apache.org/job/HBase-0.94/878/changes>
>
> Changes:
>
> [mbertozzi] HBASE-7360 Backport Snapshots to 0.94
>
> ------------------------------------------
> [...truncated 2430 lines...]
> Running org.apache.hadoop.hbase.regionserver.TestStore
> Tests run: 12, Failures: 0, Errors: 0, Skipped: 0, Time elapsed: 9.155 sec
> Running org.apache.hadoop.hbase.regionserver.TestSplitTransactionOnCluster
> Tests run: 11, Failures: 0, Errors: 0, Skipped: 0, Time elapsed: 79.762 sec
> Running org.apache.hadoop.hbase.regionserver.wal.TestHLogBench
> Tests run: 1, Failures: 0, Errors: 0, Skipped: 0, Time elapsed: 1.089 sec
> Running org.apache.hadoop.hbase.regionserver.wal.TestHLog
> Tests run: 10, Failures: 0, Errors: 0, Skipped: 0, Time elapsed: 59.647 sec
> Running org.apache.hadoop.hbase.regionserver.wal.TestLogRollAbort
> Tests run: 1, Failures: 0, Errors: 0, Skipped: 0, Time elapsed: 32.067 sec
> Running org.apache.hadoop.hbase.regionserver.wal.TestLogRollingNoCluster
> Tests run: 1, Failures: 0, Errors: 0, Skipped: 0, Time elapsed: 2.463 sec
> Running org.apache.hadoop.hbase.mapreduce.TestHFileOutputFormat
> Tests run: 10, Failures: 0, Errors: 0, Skipped: 0, Time elapsed: 367.204
> sec
> Running org.apache.hadoop.hbase.regionserver.wal.TestHLogSplitCompressed
> Tests run: 30, Failures: 0, Errors: 0, Skipped: 1, Time elapsed: 239.911
> sec
> Running org.apache.hadoop.hbase.regionserver.wal.TestWALReplay
> Tests run: 7, Failures: 0, Errors: 0, Skipped: 0, Time elapsed: 32.667 sec
> Running org.apache.hadoop.hbase.mapreduce.TestTableInputFormatScan
> Tests run: 12, Failures: 0, Errors: 0, Skipped: 0, Time elapsed: 575.642
> sec
> Running org.apache.hadoop.hbase.regionserver.TestCacheOnWriteInSchema
> Tests run: 3, Failures: 0, Errors: 0, Skipped: 0, Time elapsed: 1.281 sec
> Running org.apache.hadoop.hbase.regionserver.wal.TestHLogSplit
> Tests run: 30, Failures: 0, Errors: 0, Skipped: 1, Time elapsed: 241.541
> sec
> Running org.apache.hadoop.hbase.regionserver.wal.TestWALReplayCompressed
> Tests run: 7, Failures: 0, Errors: 0, Skipped: 0, Time elapsed: 34.884 sec
> Running org.apache.hadoop.hbase.regionserver.TestCompactionState
> Tests run: 5, Failures: 0, Errors: 0, Skipped: 0, Time elapsed: 94.486 sec
> Running org.apache.hadoop.hbase.regionserver.wal.TestLogRolling
> Tests run: 2, Failures: 0, Errors: 0, Skipped: 0, Time elapsed: 258.561 sec
> Running org.apache.hadoop.hbase.regionserver.TestRegionServerMetrics
> Tests run: 4, Failures: 0, Errors: 0, Skipped: 0, Time elapsed: 120.425 sec
> Running org.apache.hadoop.hbase.regionserver.TestMXBean
> Tests run: 1, Failures: 0, Errors: 0, Skipped: 0, Time elapsed: 24.887 sec
> Running org.apache.hadoop.hbase.regionserver.TestAtomicOperation
> Tests run: 5, Failures: 0, Errors: 0, Skipped: 0, Time elapsed: 10.897 sec
> Running
> org.apache.hadoop.hbase.regionserver.TestRSKilledWhenMasterInitializing
> Tests run: 1, Failures: 0, Errors: 0, Skipped: 0, Time elapsed: 78.36 sec
> Running org.apache.hadoop.hbase.regionserver.TestFSErrorsExposed
> Tests run: 3, Failures: 0, Errors: 0, Skipped: 0, Time elapsed: 42.441 sec
> Running org.apache.hadoop.hbase.regionserver.TestParallelPut
> Tests run: 2, Failures: 0, Errors: 0, Skipped: 0, Time elapsed: 3.067 sec
> Running org.apache.hadoop.hbase.regionserver.TestRpcMetrics
> Tests run: 1, Failures: 0, Errors: 0, Skipped: 0, Time elapsed: 1.865 sec
> Running org.apache.hadoop.hbase.regionserver.TestSeekOptimizations
> Tests run: 6, Failures: 0, Errors: 0, Skipped: 0, Time elapsed: 2.278 sec
> Running org.apache.hadoop.hbase.regionserver.handler.TestCloseRegionHandler
> Tests run: 3, Failures: 0, Errors: 0, Skipped: 0, Time elapsed: 1.193 sec
> Running org.apache.hadoop.hbase.regionserver.TestServerCustomProtocol
> Tests run: 7, Failures: 0, Errors: 0, Skipped: 0, Time elapsed: 28.116 sec
> Running org.apache.hadoop.hbase.regionserver.TestHRegionBusyWait
> Running org.apache.hadoop.hbase.regionserver.TestBlocksRead
> Tests run: 4, Failures: 0, Errors: 0, Skipped: 0, Time elapsed: 1.05 sec
> Tests run: 74, Failures: 0, Errors: 0, Skipped: 0, Time elapsed: 60.742 sec
> Running org.apache.hadoop.hbase.regionserver.TestStoreScanner
> Tests run: 16, Failures: 0, Errors: 0, Skipped: 0, Time elapsed: 0.04 sec
> Running org.apache.hadoop.hbase.regionserver.TestSplitLogWorker
> Tests run: 5, Failures: 0, Errors: 0, Skipped: 0, Time elapsed: 2.776 sec
> Running org.apache.hadoop.hbase.regionserver.metrics.TestSchemaMetrics
> Tests run: 6, Failures: 0, Errors: 0, Skipped: 0, Time elapsed: 12.846 sec
> Running org.apache.hadoop.hbase.regionserver.handler.TestOpenRegionHandler
> Tests run: 4, Failures: 0, Errors: 0, Skipped: 0, Time elapsed: 25.821 sec
> Running org.apache.hadoop.hbase.regionserver.TestStoreFileBlockCacheSummary
> Tests run: 1, Failures: 0, Errors: 0, Skipped: 0, Time elapsed: 27.259 sec
> Running org.apache.hadoop.hbase.regionserver.TestHRegionOnCluster
> Tests run: 1, Failures: 0, Errors: 0, Skipped: 0, Time elapsed: 113.779 sec
> Running org.apache.hadoop.hbase.regionserver.TestMasterAddressManager
> Tests run: 1, Failures: 0, Errors: 0, Skipped: 0, Time elapsed: 0.54 sec
> Running org.apache.hadoop.hbase.regionserver.TestMultiColumnScanner
> Tests run: 12, Failures: 0, Errors: 0, Skipped: 0, Time elapsed: 31.024 sec
> Running org.apache.hadoop.hbase.regionserver.TestHRegionServerBulkLoad
> Tests run: 1, Failures: 0, Errors: 0, Skipped: 0, Time elapsed: 57.693 sec
> Running org.apache.hadoop.hbase.TestLocalHBaseCluster
> Tests run: 1, Failures: 0, Errors: 0, Skipped: 0, Time elapsed: 22.629 sec
> Running org.apache.hadoop.hbase.regionserver.TestEndToEndSplitTransaction
> Tests run: 2, Failures: 0, Errors: 0, Skipped: 0, Time elapsed: 75.112 sec
> Running org.apache.hadoop.hbase.ipc.TestDelayedRpc
> Tests run: 4, Failures: 0, Errors: 0, Skipped: 0, Time elapsed: 2.862 sec
> Running org.apache.hadoop.hbase.ipc.TestPBOnWritableRpc
> Tests run: 1, Failures: 0, Errors: 0, Skipped: 0, Time elapsed: 0.901 sec
> Running org.apache.hadoop.hbase.regionserver.TestHRegion
> Tests run: 73, Failures: 0, Errors: 0, Skipped: 0, Time elapsed: 55.508 sec
> Running org.apache.hadoop.hbase.TestGlobalMemStoreSize
> Tests run: 1, Failures: 0, Errors: 0, Skipped: 0, Time elapsed: 32.133 sec
> Running org.apache.hadoop.hbase.TestFullLogReconstruction
> Tests run: 1, Failures: 0, Errors: 0, Skipped: 0, Time elapsed: 52.844 sec
> Running org.apache.hadoop.hbase.constraint.TestConstraint
> Tests run: 5, Failures: 0, Errors: 0, Skipped: 0, Time elapsed: 40.369 sec
> Running org.apache.hadoop.hbase.rest.TestSchemaResource
> Tests run: 2, Failures: 0, Errors: 0, Skipped: 0, Time elapsed: 32.447 sec
> Running org.apache.hadoop.hbase.rest.client.TestRemoteAdmin
> Tests run: 1, Failures: 0, Errors: 0, Skipped: 0, Time elapsed: 30.427 sec
> Running org.apache.hadoop.hbase.rest.client.TestRemoteTable
> Tests run: 4, Failures: 0, Errors: 0, Skipped: 0, Time elapsed: 28.719 sec
> Running org.apache.hadoop.hbase.rest.TestMultiRowResource
> Tests run: 3, Failures: 0, Errors: 0, Skipped: 0, Time elapsed: 27.666 sec
> Running org.apache.hadoop.hbase.rest.TestTableResource
> Tests run: 8, Failures: 0, Errors: 0, Skipped: 0, Time elapsed: 40.457 sec
> Running org.apache.hadoop.hbase.backup.TestHFileArchiving
> Tests run: 5, Failures: 0, Errors: 0, Skipped: 0, Time elapsed: 148.348 sec
> Running org.apache.hadoop.hbase.rest.TestGzipFilter
> Tests run: 3, Failures: 0, Errors: 0, Skipped: 0, Time elapsed: 28.657 sec
> Running org.apache.hadoop.hbase.rest.TestVersionResource
> Tests run: 7, Failures: 0, Errors: 0, Skipped: 0, Time elapsed: 27.329 sec
> Running org.apache.hadoop.hbase.rest.TestRowResource
> Tests run: 11, Failures: 0, Errors: 0, Skipped: 0, Time elapsed: 31.015 sec
> Running org.apache.hadoop.hbase.metrics.TestMetricsMBeanBase
> Tests run: 3, Failures: 0, Errors: 0, Skipped: 0, Time elapsed: 1.325 sec
> Running org.apache.hadoop.hbase.rest.TestStatusResource
> Tests run: 2, Failures: 0, Errors: 0, Skipped: 0, Time elapsed: 25.858 sec
> Running org.apache.hadoop.hbase.io.hfile.TestHFileSeek
> Tests run: 1, Failures: 0, Errors: 0, Skipped: 0, Time elapsed: 4.643 sec
> Running org.apache.hadoop.hbase.io.hfile.TestLruBlockCache
> Tests run: 16, Failures: 0, Errors: 0, Skipped: 0, Time elapsed: 0.892 sec
> Running org.apache.hadoop.hbase.io.hfile.TestHFileBlockIndex
> Tests run: 10, Failures: 0, Errors: 0, Skipped: 0, Time elapsed: 7.424 sec
> Running org.apache.hadoop.hbase.io.hfile.TestFixedFileTrailer
> Tests run: 2, Failures: 0, Errors: 0, Skipped: 0, Time elapsed: 0.452 sec
> Running org.apache.hadoop.hbase.io.hfile.TestHFilePerformance
> Tests run: 1, Failures: 0, Errors: 0, Skipped: 0, Time elapsed: 4.509 sec
> Running org.apache.hadoop.hbase.rest.TestScannerResource
> Tests run: 5, Failures: 0, Errors: 0, Skipped: 0, Time elapsed: 46.718 sec
> Running org.apache.hadoop.hbase.io.hfile.TestHFileBlockCompatibility
> Tests run: 10, Failures: 0, Errors: 0, Skipped: 0, Time elapsed: 0.907 sec
> Running org.apache.hadoop.hbase.io.hfile.TestChecksum
> Tests run: 3, Failures: 0, Errors: 0, Skipped: 0, Time elapsed: 0.663 sec
> Running org.apache.hadoop.hbase.rest.TestScannersWithFilters
> Tests run: 10, Failures: 0, Errors: 0, Skipped: 0, Time elapsed: 33.696 sec
> Running org.apache.hadoop.hbase.io.hfile.TestCacheOnWrite
> Tests run: 36, Failures: 0, Errors: 0, Skipped: 0, Time elapsed: 33.13 sec
> Running org.apache.hadoop.hbase.io.hfile.slab.TestSlabCache
> Tests run: 7, Failures: 0, Errors: 0, Skipped: 0, Time elapsed: 16.78 sec
> Running org.apache.hadoop.hbase.io.hfile.TestForceCacheImportantBlocks
> Tests run: 4, Failures: 0, Errors: 0, Skipped: 0, Time elapsed: 44.108 sec
> Running org.apache.hadoop.hbase.io.hfile.TestHFileBlock
> Tests run: 16, Failures: 0, Errors: 0, Skipped: 0, Time elapsed: 50.489 sec
> Running org.apache.hadoop.hbase.io.hfile.slab.TestSingleSizeCache
> Tests run: 5, Failures: 0, Errors: 0, Skipped: 0, Time elapsed: 23.038 sec
> Running org.apache.hadoop.hbase.io.TestFileLink
> Tests run: 3, Failures: 0, Errors: 0, Skipped: 0, Time elapsed: 26.206 sec
> Running org.apache.hadoop.hbase.io.encoding.TestLoadAndSwitchEncodeOnDisk
> Tests run: 1, Failures: 0, Errors: 0, Skipped: 0, Time elapsed: 46.776 sec
> Running org.apache.hadoop.hbase.TestRegionRebalancing
> Tests run: 1, Failures: 0, Errors: 0, Skipped: 0, Time elapsed: 44.384 sec
> Running org.apache.hadoop.hbase.io.encoding.TestDataBlockEncoders
> Tests run: 12, Failures: 0, Errors: 0, Skipped: 0, Time elapsed: 103.329
> sec
> Running
> org.apache.hadoop.hbase.io.encoding.TestUpgradeFromHFileV1ToEncoding
> Tests run: 1, Failures: 0, Errors: 0, Skipped: 0, Time elapsed: 133.463 sec
> Running org.apache.hadoop.hbase.mapred.TestTableInputFormat
> Tests run: 10, Failures: 0, Errors: 0, Skipped: 0, Time elapsed: 41.041 sec
> Running
> org.apache.hadoop.hbase.replication.TestReplicationDisableInactivePeer
> Tests run: 1, Failures: 0, Errors: 0, Skipped: 0, Time elapsed: 81.635 sec
> Running org.apache.hadoop.hbase.mapred.TestTableMapReduce
> Tests run: 1, Failures: 0, Errors: 0, Skipped: 0, Time elapsed: 97.872 sec
> Running org.apache.hadoop.hbase.replication.TestReplicationZookeeper
> Tests run: 1, Failures: 0, Errors: 0, Skipped: 0, Time elapsed: 0.615 sec
> Running
> org.apache.hadoop.hbase.replication.TestReplicationQueueFailoverCompressed
> Tests run: 1, Failures: 0, Errors: 0, Skipped: 0, Time elapsed: 77.121 sec
> Running
> org.apache.hadoop.hbase.replication.regionserver.TestReplicationSourceManager
> Tests run: 1, Failures: 0, Errors: 0, Skipped: 0, Time elapsed: 1.115 sec
> Running org.apache.hadoop.hbase.replication.TestReplicationSource
> Tests run: 1, Failures: 0, Errors: 0, Skipped: 0, Time elapsed: 2.328 sec
> Running
> org.apache.hadoop.hbase.replication.regionserver.TestReplicationSink
> Tests run: 5, Failures: 0, Errors: 0, Skipped: 0, Time elapsed: 45.108 sec
> Running org.apache.hadoop.hbase.io.encoding.TestChangingEncoding
> Tests run: 4, Failures: 0, Errors: 0, Skipped: 0, Time elapsed: 276.96 sec
> Running org.apache.hadoop.hbase.replication.TestReplicationQueueFailover
> Tests run: 1, Failures: 0, Errors: 0, Skipped: 0, Time elapsed: 78.329 sec
> Running org.apache.hadoop.hbase.replication.TestMultiSlaveReplication
> Tests run: 1, Failures: 0, Errors: 0, Skipped: 0, Time elapsed: 108.987 sec
> Running org.apache.hadoop.hbase.util.TestFSTableDescriptors
> Tests run: 11, Failures: 0, Errors: 0, Skipped: 0, Time elapsed: 0.891 sec
> Running org.apache.hadoop.hbase.util.TestIdLock
> Tests run: 1, Failures: 0, Errors: 0, Skipped: 0, Time elapsed: 15.475 sec
> Running org.apache.hadoop.hbase.replication.TestMasterReplication
> Tests run: 2, Failures: 0, Errors: 0, Skipped: 0, Time elapsed: 133.546 sec
> Running org.apache.hadoop.hbase.util.TestEnvironmentEdgeManager
> Tests run: 2, Failures: 0, Errors: 0, Skipped: 0, Time elapsed: 0.354 sec
> Running org.apache.hadoop.hbase.util.TestMergeTable
> Tests run: 1, Failures: 0, Errors: 0, Skipped: 0, Time elapsed: 39.239 sec
> Running org.apache.hadoop.hbase.util.TestMiniClusterLoadSequential
> Tests run: 4, Failures: 0, Errors: 0, Skipped: 0, Time elapsed: 141.429 sec
> Running org.apache.hadoop.hbase.replication.TestReplicationSmallTests
> Tests run: 8, Failures: 0, Errors: 0, Skipped: 0, Time elapsed: 269.916 sec
> Running org.apache.hadoop.hbase.util.TestFSUtils
> Tests run: 4, Failures: 0, Errors: 0, Skipped: 0, Time elapsed: 19.56 sec
> Running org.apache.hadoop.hbase.util.TestPoolMap$TestRoundRobinPoolType
> Tests run: 3, Failures: 0, Errors: 0, Skipped: 0, Time elapsed: 0.007 sec
> Running org.apache.hadoop.hbase.util.TestPoolMap$TestThreadLocalPoolType
> Tests run: 3, Failures: 0, Errors: 0, Skipped: 0, Time elapsed: 0.004 sec
> Running org.apache.hadoop.hbase.util.TestPoolMap$TestReusablePoolType
> Tests run: 3, Failures: 0, Errors: 0, Skipped: 0, Time elapsed: 0.023 sec
> Running org.apache.hadoop.hbase.util.TestMergeTool
> Tests run: 1, Failures: 0, Errors: 0, Skipped: 0, Time elapsed: 268.391 sec
> Running org.apache.hadoop.hbase.util.TestRegionSplitter
> Tests run: 5, Failures: 0, Errors: 0, Skipped: 0, Time elapsed: 28.358 sec
> Running org.apache.hadoop.hbase.util.TestMiniClusterLoadParallel
> Tests run: 4, Failures: 0, Errors: 0, Skipped: 0, Time elapsed: 139.585 sec
> Running org.apache.hadoop.hbase.util.TestFSVisitor
> Tests run: 3, Failures: 0, Errors: 0, Skipped: 0, Time elapsed: 1.453 sec
> Running org.apache.hadoop.hbase.util.TestCoprocessorScanPolicy
> Tests run: 2, Failures: 0, Errors: 0, Skipped: 0, Time elapsed: 28.921 sec
> Running org.apache.hadoop.hbase.util.hbck.TestOfflineMetaRebuildBase
> Tests run: 1, Failures: 0, Errors: 0, Skipped: 0, Time elapsed: 56.777 sec
> Running org.apache.hadoop.hbase.util.hbck.TestOfflineMetaRebuildOverlap
> Tests run: 1, Failures: 0, Errors: 0, Skipped: 0, Time elapsed: 60.308 sec
> Running org.apache.hadoop.hbase.util.TestDefaultEnvironmentEdge
> Tests run: 1, Failures: 0, Errors: 0, Skipped: 0, Time elapsed: 0.234 sec
> Running org.apache.hadoop.hbase.util.TestMiniClusterLoadEncoded
> Tests run: 4, Failures: 0, Errors: 0, Skipped: 0, Time elapsed: 117.631 sec
> Running org.apache.hadoop.hbase.TestInfoServers
> Tests run: 3, Failures: 0, Errors: 0, Skipped: 0, Time elapsed: 28.125 sec
> Running org.apache.hadoop.hbase.util.hbck.TestOfflineMetaRebuildHole
> Tests run: 1, Failures: 0, Errors: 0, Skipped: 0, Time elapsed: 60.645 sec
> Running org.apache.hadoop.hbase.util.TestSizeBasedThrottler
> Tests run: 3, Failures: 0, Errors: 0, Skipped: 0, Time elapsed: 48.24 sec
> Running org.apache.hadoop.hbase.util.TestHBaseFsck
> Tests run: 34, Failures: 0, Errors: 0, Skipped: 0, Time elapsed: 251.58 sec
>
> Results :
>
> Failed tests:
> testFlushCommitsWithAbort(org.apache.hadoop.hbase.client.TestMultiParallel):
> Server count=2, abort=true expected:<1> but was:<2>
>
> Tests in error:
>
> testFlushCommitsNoAbort(org.apache.hadoop.hbase.client.TestMultiParallel):
> Server hemera.apache.org,32876,1362399716392 not running, aborting
>
> Tests run: 1323, Failures: 1, Errors: 1, Skipped: 13
>
> [INFO]
> ------------------------------------------------------------------------
> [INFO] BUILD FAILURE
> [INFO]
> ------------------------------------------------------------------------
> [INFO] Total time: 56:58.091s
> [INFO] Finished at: Mon Mar 04 13:14:17 UTC 2013
> [INFO] Final Memory: 36M/966M
> [INFO]
> ------------------------------------------------------------------------
> [ERROR] Failed to execute goal
> org.apache.maven.plugins:maven-surefire-plugin:2.12-TRUNK-HBASE-2:test
> (secondPartTestsExecution) on project hbase: There are test failures.
> [ERROR]
> [ERROR] Please refer to
> /x1/jenkins/jenkins-slave/workspace/HBase-0.94/trunk/target/surefire-reports
> for the individual test results.
> [ERROR] -> [Help 1]
> [ERROR]
> [ERROR] To see the full stack trace of the errors, re-run Maven with the
> -e switch.
> [ERROR] Re-run Maven using the -X switch to enable full debug logging.
> [ERROR]
> [ERROR] For more information about the errors and possible solutions,
> please read the following articles:
> [ERROR] [Help 1]
> http://cwiki.apache.org/confluence/display/MAVEN/MojoFailureException
> Build step 'Invoke top-level Maven targets' marked build as failure
> Archiving artifacts
> Updating HBASE-7360
> Recording test results
>

Mime
  • Unnamed multipart/alternative (inline, None, 0 bytes)
View raw message