hbase-dev mailing list archives

Site index · List index
Message view « Date » · « Thread »
Top « Date » · « Thread »
From Stack <st...@duboce.net>
Subject Re: Build failed in Jenkins: HBase-TRUNK #3934
Date Sat, 09 Mar 2013 16:38:57 GMT
Again timeouts.  Will look into them....
St.Ack


On Sat, Mar 9, 2013 at 3:09 AM, Apache Jenkins Server <
jenkins@builds.apache.org> wrote:

> See <https://builds.apache.org/job/HBase-TRUNK/3934/changes>
>
> Changes:
>
> [ramkrishna] HBASE-7961 truncate on disabled table should throw
> TableNotEnabledException.
> (Rajesh)
>
> ------------------------------------------
> [...truncated 3730 lines...]
> Running org.apache.hadoop.hbase.replication.TestReplicationSource
> Tests run: 1, Failures: 0, Errors: 0, Skipped: 0, Time elapsed: 11.293 sec
> Running org.apache.hadoop.hbase.master.TestDistributedLogSplitting
> Tests run: 4, Failures: 0, Errors: 0, Skipped: 0, Time elapsed: 196.688 sec
> Running
> org.apache.hadoop.hbase.replication.regionserver.TestReplicationSink
> Tests run: 5, Failures: 0, Errors: 0, Skipped: 0, Time elapsed: 40.469 sec
> Running
> org.apache.hadoop.hbase.replication.regionserver.TestReplicationSourceManager
> Tests run: 1, Failures: 0, Errors: 0, Skipped: 0, Time elapsed: 6.912 sec
> Running org.apache.hadoop.hbase.replication.TestMasterReplication
> Tests run: 2, Failures: 0, Errors: 0, Skipped: 0, Time elapsed: 124.977 sec
> Running
> org.apache.hadoop.hbase.replication.TestReplicationQueueFailoverCompressed
> Tests run: 1, Failures: 0, Errors: 0, Skipped: 0, Time elapsed: 112.946 sec
> Running org.apache.hadoop.hbase.replication.TestReplicationSmallTests
> Tests run: 8, Failures: 0, Errors: 0, Skipped: 0, Time elapsed: 132.116 sec
> Running org.apache.hadoop.hbase.replication.TestMultiSlaveReplication
> Tests run: 1, Failures: 0, Errors: 0, Skipped: 0, Time elapsed: 77.324 sec
> Running
> org.apache.hadoop.hbase.replication.TestReplicationDisableInactivePeer
> Tests run: 1, Failures: 0, Errors: 0, Skipped: 0, Time elapsed: 85.679 sec
> Running org.apache.hadoop.hbase.catalog.TestMetaReaderEditorNoCluster
> Tests run: 2, Failures: 0, Errors: 0, Skipped: 0, Time elapsed: 7.226 sec
> Running org.apache.hadoop.hbase.catalog.TestCatalogTracker
> Tests run: 7, Failures: 0, Errors: 0, Skipped: 0, Time elapsed: 6.519 sec
> Running org.apache.hadoop.hbase.TestMultiVersions
> Tests run: 3, Failures: 0, Errors: 0, Skipped: 0, Time elapsed: 46.745 sec
> Running org.apache.hadoop.hbase.coprocessor.TestAggregateProtocol
> Tests run: 45, Failures: 0, Errors: 0, Skipped: 0, Time elapsed: 30.681 sec
> Running org.apache.hadoop.hbase.catalog.TestMetaReaderEditor
> Tests run: 5, Failures: 0, Errors: 0, Skipped: 0, Time elapsed: 48.741 sec
> Running org.apache.hadoop.hbase.replication.TestReplicationQueueFailover
> Tests run: 1, Failures: 0, Errors: 0, Skipped: 0, Time elapsed: 109.677 sec
> Running org.apache.hadoop.hbase.TestHBaseTestingUtility
> Tests run: 7, Failures: 0, Errors: 0, Skipped: 0, Time elapsed: 115.714 sec
> Running org.apache.hadoop.hbase.coprocessor.TestBigDecimalColumnInterpreter
> Tests run: 38, Failures: 0, Errors: 0, Skipped: 0, Time elapsed: 26.8 sec
> Running org.apache.hadoop.hbase.coprocessor.TestCoprocessorEndpoint
> Tests run: 6, Failures: 0, Errors: 0, Skipped: 0, Time elapsed: 26.446 sec
> Running org.apache.hadoop.hbase.coprocessor.TestRowProcessorEndpoint
> Tests run: 4, Failures: 0, Errors: 0, Skipped: 0, Time elapsed: 42.671 sec
> Running org.apache.hadoop.hbase.coprocessor.TestMasterObserver
> Tests run: 4, Failures: 0, Errors: 0, Skipped: 0, Time elapsed: 59.806 sec
> Running
> org.apache.hadoop.hbase.coprocessor.TestMasterCoprocessorExceptionWithRemove
> Tests run: 1, Failures: 0, Errors: 0, Skipped: 0, Time elapsed: 20.748 sec
> Running org.apache.hadoop.hbase.coprocessor.TestClassLoading
> Tests run: 7, Failures: 0, Errors: 0, Skipped: 0, Time elapsed: 40.809 sec
> Running
> org.apache.hadoop.hbase.coprocessor.TestRegionServerCoprocessorExceptionWithRemove
> Tests run: 1, Failures: 0, Errors: 0, Skipped: 0, Time elapsed: 28.731 sec
> Running org.apache.hadoop.hbase.coprocessor.TestWALObserver
> Tests run: 3, Failures: 0, Errors: 0, Skipped: 0, Time elapsed: 24.701 sec
> Running org.apache.hadoop.hbase.coprocessor.TestRegionObserverInterface
> Tests run: 7, Failures: 0, Errors: 0, Skipped: 0, Time elapsed: 49.31 sec
> Running
> org.apache.hadoop.hbase.coprocessor.TestMasterCoprocessorExceptionWithAbort
> Tests run: 1, Failures: 0, Errors: 0, Skipped: 0, Time elapsed: 32.192 sec
> Running
> org.apache.hadoop.hbase.coprocessor.TestRegionServerCoprocessorExceptionWithAbort
> Tests run: 1, Failures: 0, Errors: 0, Skipped: 0, Time elapsed: 32.902 sec
> Running org.apache.hadoop.hbase.thrift2.TestThriftHBaseServiceHandler
> Tests run: 12, Failures: 0, Errors: 0, Skipped: 0, Time elapsed: 23.796 sec
> Running org.apache.hadoop.hbase.procedure.TestZKProcedure
> Tests run: 4, Failures: 0, Errors: 0, Skipped: 0, Time elapsed: 4.287 sec
> Running org.apache.hadoop.hbase.coprocessor.TestRegionObserverBypass
> Tests run: 2, Failures: 0, Errors: 0, Skipped: 0, Time elapsed: 30.408 sec
> Running org.apache.hadoop.hbase.trace.TestHTraceHooks
> Tests run: 1, Failures: 0, Errors: 0, Skipped: 0, Time elapsed: 20.366 sec
> Running org.apache.hadoop.hbase.procedure.TestZKProcedureControllers
> Tests run: 4, Failures: 0, Errors: 1, Skipped: 0, Time elapsed: 17.95 sec
> <<< FAILURE!
> Running org.apache.hadoop.hbase.regionserver.TestHRegionOnCluster
> Tests run: 1, Failures: 0, Errors: 0, Skipped: 0, Time elapsed: 28.282 sec
> Running org.apache.hadoop.hbase.thrift.TestThriftServerCmdLine
> Tests run: 32, Failures: 0, Errors: 0, Skipped: 0, Time elapsed: 71.992 sec
> Running org.apache.hadoop.hbase.regionserver.TestRegionServerNoMaster
> Tests run: 7, Failures: 0, Errors: 0, Skipped: 0, Time elapsed: 30.798 sec
> Running org.apache.hadoop.hbase.regionserver.TestMasterAddressManager
> Tests run: 1, Failures: 0, Errors: 0, Skipped: 0, Time elapsed: 2.203 sec
> Running org.apache.hadoop.hbase.regionserver.TestMemStore
> Tests run: 22, Failures: 0, Errors: 0, Skipped: 0, Time elapsed: 50.984 sec
> Running org.apache.hadoop.hbase.regionserver.TestRegionServerMetrics
> Tests run: 8, Failures: 0, Errors: 0, Skipped: 0, Time elapsed: 36.935 sec
> Running org.apache.hadoop.hbase.thrift.TestThriftServer
> Tests run: 1, Failures: 0, Errors: 0, Skipped: 0, Time elapsed: 111.782 sec
> Running org.apache.hadoop.hbase.regionserver.TestSplitLogWorker
> Tests run: 5, Failures: 0, Errors: 0, Skipped: 0, Time elapsed: 3.948 sec
> Running org.apache.hadoop.hbase.regionserver.TestHRegion
> Tests run: 62, Failures: 0, Errors: 0, Skipped: 0, Time elapsed: 72.304 sec
> Running org.apache.hadoop.hbase.regionserver.TestCompoundBloomFilter
> Tests run: 3, Failures: 0, Errors: 0, Skipped: 0, Time elapsed: 36.436 sec
> Running org.apache.hadoop.hbase.regionserver.TestCompactionWithCoprocessor
> Tests run: 17, Failures: 0, Errors: 0, Skipped: 0, Time elapsed: 67.891 sec
> Running org.apache.hadoop.hbase.regionserver.TestStore
> Tests run: 15, Failures: 0, Errors: 0, Skipped: 0, Time elapsed: 14.494 sec
> Running org.apache.hadoop.hbase.regionserver.TestStoreFileBlockCacheSummary
> Tests run: 1, Failures: 0, Errors: 0, Skipped: 0, Time elapsed: 29.251 sec
> Running org.apache.hadoop.hbase.regionserver.TestAtomicOperation
> Tests run: 5, Failures: 0, Errors: 0, Skipped: 0, Time elapsed: 30.065 sec
> Running org.apache.hadoop.hbase.regionserver.TestBlocksRead
> Tests run: 4, Failures: 0, Errors: 0, Skipped: 0, Time elapsed: 1.761 sec
> Running org.apache.hadoop.hbase.regionserver.TestHRegionBusyWait
> Tests run: 63, Failures: 0, Errors: 0, Skipped: 0, Time elapsed: 73.095 sec
> Running org.apache.hadoop.hbase.regionserver.TestFSErrorsExposed
> Tests run: 3, Failures: 0, Errors: 0, Skipped: 1, Time elapsed: 1.728 sec
> Running org.apache.hadoop.hbase.regionserver.TestServerCustomProtocol
> Tests run: 7, Failures: 0, Errors: 0, Skipped: 0, Time elapsed: 71.574 sec
> Running org.apache.hadoop.hbase.regionserver.TestClusterId
> Tests run: 1, Failures: 0, Errors: 0, Skipped: 0, Time elapsed: 40.535 sec
> Running org.apache.hadoop.hbase.regionserver.TestSeekOptimizations
> Tests run: 6, Failures: 0, Errors: 0, Skipped: 0, Time elapsed: 6.286 sec
> Running org.apache.hadoop.hbase.regionserver.handler.TestCloseRegionHandler
> Tests run: 3, Failures: 0, Errors: 0, Skipped: 0, Time elapsed: 4.825 sec
> Running org.apache.hadoop.hbase.regionserver.handler.TestOpenRegionHandler
> Tests run: 5, Failures: 0, Errors: 0, Skipped: 0, Time elapsed: 3.611 sec
> Running
> org.apache.hadoop.hbase.regionserver.TestRSKilledWhenMasterInitializing
> Tests run: 1, Failures: 0, Errors: 0, Skipped: 0, Time elapsed: 54.968 sec
> Running org.apache.hadoop.hbase.regionserver.TestGetClosestAtOrBefore
> Tests run: 3, Failures: 0, Errors: 0, Skipped: 0, Time elapsed: 4.533 sec
> Running org.apache.hadoop.hbase.regionserver.TestHRegionServerBulkLoad
> Tests run: 1, Failures: 0, Errors: 0, Skipped: 0, Time elapsed: 56.245 sec
> Running org.apache.hadoop.hbase.regionserver.TestParallelPut
> Tests run: 2, Failures: 0, Errors: 0, Skipped: 0, Time elapsed: 17.721 sec
> Running org.apache.hadoop.hbase.regionserver.TestCacheOnWriteInSchema
> Tests run: 3, Failures: 0, Errors: 0, Skipped: 0, Time elapsed: 6.637 sec
> Running org.apache.hadoop.hbase.regionserver.TestPriorityRpc
> Tests run: 3, Failures: 0, Errors: 0, Skipped: 0, Time elapsed: 2.613 sec
> Running org.apache.hadoop.hbase.regionserver.TestSplitTransactionOnCluster
> Running org.apache.hadoop.hbase.regionserver.TestCompactionState
> Tests run: 9, Failures: 0, Errors: 0, Skipped: 0, Time elapsed: 121.648 sec
> Tests run: 5, Failures: 0, Errors: 0, Skipped: 0, Time elapsed: 156.478 sec
> Running org.apache.hadoop.hbase.regionserver.wal.TestHLog
> Tests run: 11, Failures: 0, Errors: 0, Skipped: 0, Time elapsed: 104.203
> sec
> Running org.apache.hadoop.hbase.regionserver.wal.TestLogRollAbort
> Tests run: 1, Failures: 0, Errors: 0, Skipped: 0, Time elapsed: 179.715 sec
> Running org.apache.hadoop.hbase.regionserver.wal.TestLogRolling
> Tests run: 2, Failures: 0, Errors: 0, Skipped: 0, Time elapsed: 225.592 sec
> Running org.apache.hadoop.hbase.regionserver.wal.TestWALReplay
> Tests run: 8, Failures: 0, Errors: 0, Skipped: 0, Time elapsed: 115.946 sec
> Running org.apache.hadoop.hbase.regionserver.wal.TestWALReplayCompressed
> Tests run: 8, Failures: 0, Errors: 0, Skipped: 0, Time elapsed: 89.663 sec
> Running org.apache.hadoop.hbase.regionserver.TestJoinedScanners
> Tests run: 1, Failures: 0, Errors: 0, Skipped: 0, Time elapsed: 453.012 sec
> Running org.apache.hadoop.hbase.regionserver.TestStoreScanner
> Tests run: 16, Failures: 0, Errors: 0, Skipped: 0, Time elapsed: 0.229 sec
> Running org.apache.hadoop.hbase.regionserver.wal.TestHLogFiltering
> Tests run: 1, Failures: 0, Errors: 0, Skipped: 0, Time elapsed: 34.856 sec
> Running org.apache.hadoop.hbase.regionserver.wal.TestHLogSplit
> Tests run: 32, Failures: 0, Errors: 0, Skipped: 1, Time elapsed: 372.556
> sec
> Running org.apache.hadoop.hbase.regionserver.TestEndToEndSplitTransaction
> Tests run: 2, Failures: 0, Errors: 0, Skipped: 0, Time elapsed: 47.591 sec
> Running org.apache.hadoop.hbase.regionserver.TestMultiColumnScanner
> Tests run: 12, Failures: 0, Errors: 0, Skipped: 0, Time elapsed: 45.897 sec
> Running org.apache.hadoop.hbase.regionserver.TestCompaction
> Tests run: 17, Failures: 0, Errors: 0, Skipped: 0, Time elapsed: 55.919 sec
> Running org.apache.hadoop.hbase.mapred.TestTableInputFormat
> Tests run: 10, Failures: 0, Errors: 0, Skipped: 0, Time elapsed: 48.254 sec
> Running
> org.apache.hadoop.hbase.backup.example.TestZooKeeperTableArchiveClient
> Tests run: 3, Failures: 0, Errors: 0, Skipped: 0, Time elapsed: 8.339 sec
> Running org.apache.hadoop.hbase.fs.TestBlockReorder
> Tests run: 3, Failures: 0, Errors: 0, Skipped: 0, Time elapsed: 56.441 sec
> Running org.apache.hadoop.hbase.regionserver.wal.TestHLogSplitCompressed
> Tests run: 32, Failures: 0, Errors: 0, Skipped: 1, Time elapsed: 383.574
> sec
> Running org.apache.hadoop.hbase.TestClusterBootOrder
> Tests run: 2, Failures: 0, Errors: 0, Skipped: 0, Time elapsed: 40.625 sec
> Running org.apache.hadoop.hbase.TestDrainingServer
> Tests run: 2, Failures: 0, Errors: 0, Skipped: 0, Time elapsed: 33.041 sec
> Running org.apache.hadoop.hbase.mapred.TestTableMapReduce
> Tests run: 1, Failures: 0, Errors: 0, Skipped: 0, Time elapsed: 142.628 sec
> Running org.apache.hadoop.hbase.mapreduce.TestTimeRangeMapRed
> Tests run: 1, Failures: 0, Errors: 0, Skipped: 0, Time elapsed: 51.237 sec
> Running org.apache.hadoop.hbase.mapreduce.TestRowCounter
> Tests run: 3, Failures: 0, Errors: 0, Skipped: 0, Time elapsed: 87.728 sec
> Running org.apache.hadoop.hbase.mapreduce.TestSecureLoadIncrementalHFiles
> Tests run: 6, Failures: 0, Errors: 0, Skipped: 0, Time elapsed: 57.546 sec
> Running org.apache.hadoop.hbase.backup.TestHFileArchiving
> Tests run: 5, Failures: 0, Errors: 0, Skipped: 0, Time elapsed: 249.333 sec
> Running org.apache.hadoop.hbase.mapreduce.TestImportExport
> Tests run: 5, Failures: 0, Errors: 0, Skipped: 0, Time elapsed: 168.545 sec
> Running org.apache.hadoop.hbase.mapreduce.TestImportTsv
> Tests run: 13, Failures: 0, Errors: 0, Skipped: 0, Time elapsed: 271.616
> sec
> Running org.apache.hadoop.hbase.mapreduce.TestMultiTableInputFormat
> Tests run: 5, Failures: 0, Errors: 0, Skipped: 0, Time elapsed: 389.969 sec
> Running org.apache.hadoop.hbase.mapreduce.TestWALPlayer
> Tests run: 1, Failures: 0, Errors: 0, Skipped: 0, Time elapsed: 74.378 sec
> Running org.apache.hadoop.hbase.mapreduce.TestHFileOutputFormat
> Tests run: 10, Failures: 0, Errors: 0, Skipped: 0, Time elapsed: 409.81 sec
> Running org.apache.hadoop.hbase.mapreduce.TestMultithreadedTableMapper
> Tests run: 1, Failures: 0, Errors: 0, Skipped: 0, Time elapsed: 140.213 sec
> Running
> org.apache.hadoop.hbase.mapreduce.TestSecureLoadIncrementalHFilesSplitRecovery
> Tests run: 4, Failures: 0, Errors: 0, Skipped: 0, Time elapsed: 105.107 sec
> Running
> org.apache.hadoop.hbase.mapreduce.TestLoadIncrementalHFilesSplitRecovery
> Tests run: 4, Failures: 0, Errors: 0, Skipped: 0, Time elapsed: 152.735 sec
> Running org.apache.hadoop.hbase.mapreduce.TestHLogRecordReader
> Tests run: 2, Failures: 0, Errors: 0, Skipped: 0, Time elapsed: 27.276 sec
> Running org.apache.hadoop.hbase.mapreduce.TestLoadIncrementalHFiles
> Tests run: 6, Failures: 0, Errors: 0, Skipped: 0, Time elapsed: 60.587 sec
> Running org.apache.hadoop.hbase.mapreduce.TestTableInputFormatScan
> Tests run: 12, Failures: 0, Errors: 0, Skipped: 0, Time elapsed: 541.458
> sec
> Running org.apache.hadoop.hbase.mapreduce.TestTableMapReduce
> Tests run: 2, Failures: 0, Errors: 0, Skipped: 0, Time elapsed: 257.096 sec
>
> Results :
>
> Tests in error:
>
> testSimpleZKCohortMemberController(org.apache.hadoop.hbase.procedure.TestZKProcedureControllers):
> test timed out after 15000 milliseconds
>
> Tests run: 1460, Failures: 0, Errors: 1, Skipped: 13
>
> [INFO]
> [INFO]
> ------------------------------------------------------------------------
> [INFO] Skipping HBase
> [INFO] This project has been banned from the build due to previous
> failures.
> [INFO]
> ------------------------------------------------------------------------
> [INFO]
> [INFO]
> ------------------------------------------------------------------------
> [INFO] Skipping HBase
> [INFO] This project has been banned from the build due to previous
> failures.
> [INFO]
> ------------------------------------------------------------------------
> [INFO]
> ------------------------------------------------------------------------
> [INFO] Reactor Summary:
> [INFO]
> [INFO] HBase ............................................. SUCCESS
> [18.007s]
> [INFO] HBase - Common .................................... SUCCESS
> [20.684s]
> [INFO] HBase - Protocol .................................. SUCCESS [7.547s]
> [INFO] HBase - Client .................................... SUCCESS [8.700s]
> [INFO] HBase - Prefix Tree ............................... SUCCESS [3.144s]
> [INFO] HBase - Hadoop Compatibility ...................... SUCCESS [0.578s]
> [INFO] HBase - Hadoop One Compatibility .................. SUCCESS [2.135s]
> [INFO] HBase - Server .................................... FAILURE
> [1:01:28.577s]
> [INFO] HBase - Integration Tests ......................... SKIPPED
> [INFO] HBase - Examples .................................. SKIPPED
> [INFO]
> ------------------------------------------------------------------------
> [INFO] BUILD FAILURE
> [INFO]
> ------------------------------------------------------------------------
> [INFO] Total time: 1:02:30.578s
> [INFO] Finished at: Sat Mar 09 11:09:13 UTC 2013
> [INFO] Final Memory: 35M/1055M
> [INFO]
> ------------------------------------------------------------------------
> [ERROR] Failed to execute goal
> org.apache.maven.plugins:maven-surefire-plugin:2.12-TRUNK-HBASE-2:test
> (secondPartTestsExecution) on project hbase-server: There are test failures.
> [ERROR]
> [ERROR] Please refer to <
> https://builds.apache.org/job/HBase-TRUNK/ws/trunk/hbase-server/target/surefire-reports>
> for the individual test results.
> [ERROR] -> [Help 1]
> [ERROR]
> [ERROR] To see the full stack trace of the errors, re-run Maven with the
> -e switch.
> [ERROR] Re-run Maven using the -X switch to enable full debug logging.
> [ERROR]
> [ERROR] For more information about the errors and possible solutions,
> please read the following articles:
> [ERROR] [Help 1]
> http://cwiki.apache.org/confluence/display/MAVEN/MojoFailureException
> [ERROR]
> [ERROR] After correcting the problems, you can resume the build with the
> command
> [ERROR]   mvn <goals> -rf :hbase-server
> Build step 'Invoke top-level Maven targets' marked build as failure
> Archiving artifacts
> Recording test results
> Updating HBASE-7961
>

Mime
  • Unnamed multipart/alternative (inline, None, 0 bytes)
View raw message