hbase-dev mailing list archives

Site index · List index
Message view « Date » · « Thread »
Top « Date » · « Thread »
From Stack <st...@duboce.net>
Subject Re: Build failed in Jenkins: hbase-0.95 #21
Date Mon, 04 Mar 2013 18:03:35 GMT
Only example tests failed in this run.  All others passed.  Looking into
it....
St.Ack


On Mon, Mar 4, 2013 at 9:59 AM, Apache Jenkins Server <
jenkins@builds.apache.org> wrote:

> See <https://builds.apache.org/job/hbase-0.95/21/>
>
> ------------------------------------------
> [...truncated 3903 lines...]
> Running org.apache.hadoop.hbase.TestInfoServers
> Tests run: 3, Failures: 0, Errors: 0, Skipped: 0, Time elapsed: 13.994 sec
> Running org.apache.hadoop.hbase.util.hbck.TestOfflineMetaRebuildHole
> Tests run: 1, Failures: 0, Errors: 0, Skipped: 0, Time elapsed: 22.801 sec
> Running org.apache.hadoop.hbase.util.TestMiniClusterLoadEncoded
> Tests run: 5, Failures: 0, Errors: 0, Skipped: 0, Time elapsed: 61.781 sec
> Running org.apache.hadoop.hbase.util.TestHBaseFsck
> Tests run: 34, Failures: 0, Errors: 0, Skipped: 0, Time elapsed: 241.025
> sec
>
> Results :
>
> Tests run: 1467, Failures: 0, Errors: 0, Skipped: 13
>
> [INFO]
> [INFO] --- maven-jar-plugin:2.4:test-jar (default) @ hbase-server ---
> [INFO] Building jar:
> /x1/jenkins/jenkins-slave/workspace/hbase-0.95/0.95/hbase-server/target/hbase-server-0.95-SNAPSHOT-tests.jar
> [INFO]
> [INFO] --- maven-source-plugin:2.2.1:jar-no-fork (attach-sources) @
> hbase-server ---
> [INFO] Building jar:
> /x1/jenkins/jenkins-slave/workspace/hbase-0.95/0.95/hbase-server/target/hbase-server-0.95-SNAPSHOT-sources.jar
> [INFO]
> [INFO] --- maven-jar-plugin:2.4:jar (default-jar) @ hbase-server ---
> [INFO] Building jar:
> /x1/jenkins/jenkins-slave/workspace/hbase-0.95/0.95/hbase-server/target/hbase-server-0.95-SNAPSHOT.jar
> [INFO]
> [INFO] --- apache-rat-plugin:0.8:check (default) @ hbase-server ---
> [INFO] Exclude: **/*.log
> [INFO] Exclude: **/.*
> [INFO] Exclude: **/*.tgz
> [INFO] Exclude: **/*.orig
> [INFO] Exclude: **/test/**
> [INFO] Exclude: **/8e8ab58dcf39412da19833fcd8f687ac
> [INFO] Exclude: **/.git/**
> [INFO] Exclude: **/.idea/**
> [INFO] Exclude: **/*.iml
> [INFO] Exclude: **/target/**
> [INFO] Exclude: **/CHANGES.txt
> [INFO] Exclude: **/generated/**
> [INFO] Exclude: **/gen-*/**
> [INFO] Exclude: **/conf/*
> [INFO] Exclude: **/*.avpr
> [INFO] Exclude: **/*.svg
> [INFO] Exclude: **/META-INF/services/**
> [INFO] Exclude: **/html5shiv.js
> [INFO] Exclude: **/jquery.min.js
> [INFO] Exclude: **/*.vm
> [INFO] Exclude: **/control
> [INFO] Exclude: **/conffile
> [INFO] Exclude: docs/*
> [INFO] Exclude: **/src/site/resources/css/freebsd_docbook.css
> [INFO] Exclude: .git/**
> [INFO] Exclude: .svn/**
> [INFO]
> [INFO]
> ------------------------------------------------------------------------
> [INFO] Building HBase - Integration Tests 0.95-SNAPSHOT
> [INFO]
> ------------------------------------------------------------------------
> [INFO]
> [INFO] --- maven-remote-resources-plugin:1.4:process (default) @ hbase-it
> ---
> [INFO]
> [INFO] --- maven-resources-plugin:2.6:resources (default-resources) @
> hbase-it ---
> [INFO] Using 'UTF-8' encoding to copy filtered resources.
> [INFO] skip non existing resourceDirectory
> /x1/jenkins/jenkins-slave/workspace/hbase-0.95/0.95/hbase-it/src/main/resources
> [INFO] Copying 3 resources
> [INFO]
> [INFO] --- maven-compiler-plugin:2.5.1:compile (default-compile) @
> hbase-it ---
> [INFO] No sources to compile
> [INFO]
> [INFO] --- maven-resources-plugin:2.6:testResources
> (default-testResources) @ hbase-it ---
> [INFO] Using 'UTF-8' encoding to copy filtered resources.
> [INFO] Copying 6 resources
> [INFO] Copying 3 resources
> [INFO]
> [INFO] --- maven-compiler-plugin:2.5.1:testCompile (default-testCompile) @
> hbase-it ---
> [INFO] Compiling 11 source files to
> /x1/jenkins/jenkins-slave/workspace/hbase-0.95/0.95/hbase-it/target/test-classes
> [INFO]
> [INFO] --- maven-surefire-plugin:2.12-TRUNK-HBASE-2:test (default-test) @
> hbase-it ---
> [INFO] Surefire report directory:
> /x1/jenkins/jenkins-slave/workspace/hbase-0.95/0.95/hbase-it/target/surefire-reports
> [INFO] Using configured provider
> org.apache.maven.surefire.junitcore.JUnitCoreProvider
>
> -------------------------------------------------------
>  T E S T S
> -------------------------------------------------------
>
> Results :
>
> Tests run: 0, Failures: 0, Errors: 0, Skipped: 0
>
> [INFO]
> [INFO] --- maven-dependency-plugin:2.1:build-classpath
> (create-hbase-generated-classpath) @ hbase-it ---
> [INFO] Wrote classpath file
> '/x1/jenkins/jenkins-slave/workspace/hbase-0.95/0.95/hbase-it/target/../../target/cached_classpath.txt'.
> [INFO]
> [INFO] --- maven-surefire-plugin:2.12-TRUNK-HBASE-2:test
> (secondPartTestsExecution) @ hbase-it ---
> [INFO] Surefire report directory:
> /x1/jenkins/jenkins-slave/workspace/hbase-0.95/0.95/hbase-it/target/surefire-reports
> [INFO] Using configured provider
> org.apache.maven.surefire.junitcore.JUnitCoreProvider
>
> -------------------------------------------------------
>  T E S T S
> -------------------------------------------------------
>
> -------------------------------------------------------
>  T E S T S
> -------------------------------------------------------
>
> Results :
>
> Tests run: 0, Failures: 0, Errors: 0, Skipped: 0
>
> [INFO]
> [INFO] --- maven-jar-plugin:2.4:test-jar (default) @ hbase-it ---
> [INFO] Building jar:
> /x1/jenkins/jenkins-slave/workspace/hbase-0.95/0.95/hbase-it/target/hbase-it-0.95-SNAPSHOT-tests.jar
> [INFO]
> [INFO] --- maven-jar-plugin:2.4:jar (default-jar) @ hbase-it ---
> [INFO] Building jar:
> /x1/jenkins/jenkins-slave/workspace/hbase-0.95/0.95/hbase-it/target/hbase-it-0.95-SNAPSHOT.jar
> [INFO]
> [INFO] --- apache-rat-plugin:0.8:check (default) @ hbase-it ---
> [INFO] Exclude: **/*.log
> [INFO] Exclude: **/.*
> [INFO] Exclude: **/*.tgz
> [INFO] Exclude: **/*.orig
> [INFO] Exclude: **/test/**
> [INFO] Exclude: **/8e8ab58dcf39412da19833fcd8f687ac
> [INFO] Exclude: **/.git/**
> [INFO] Exclude: **/.idea/**
> [INFO] Exclude: **/*.iml
> [INFO] Exclude: **/target/**
> [INFO] Exclude: **/CHANGES.txt
> [INFO] Exclude: **/generated/**
> [INFO] Exclude: **/gen-*/**
> [INFO] Exclude: **/conf/*
> [INFO] Exclude: **/*.avpr
> [INFO] Exclude: **/*.svg
> [INFO] Exclude: **/META-INF/services/**
> [INFO] Exclude: **/html5shiv.js
> [INFO] Exclude: **/jquery.min.js
> [INFO] Exclude: **/*.vm
> [INFO] Exclude: **/control
> [INFO] Exclude: **/conffile
> [INFO] Exclude: docs/*
> [INFO] Exclude: **/src/site/resources/css/freebsd_docbook.css
> [INFO] Exclude: .git/**
> [INFO] Exclude: .svn/**
> [INFO]
> [INFO]
> ------------------------------------------------------------------------
> [INFO] Building HBase - Examples 0.95-SNAPSHOT
> [INFO]
> ------------------------------------------------------------------------
> [INFO]
> [INFO] --- maven-remote-resources-plugin:1.4:process (default) @
> hbase-examples ---
> [INFO]
> [INFO] --- maven-resources-plugin:2.6:resources (default-resources) @
> hbase-examples ---
> [INFO] Using 'UTF-8' encoding to copy filtered resources.
> [INFO] skip non existing resourceDirectory
> /x1/jenkins/jenkins-slave/workspace/hbase-0.95/0.95/hbase-examples/src/main/resources
> [INFO] Copying 3 resources
> [INFO]
> [INFO] --- maven-compiler-plugin:2.5.1:compile (default-compile) @
> hbase-examples ---
> [INFO] Compiling 20 source files to
> /x1/jenkins/jenkins-slave/workspace/hbase-0.95/0.95/hbase-examples/target/classes
> [INFO]
> [INFO] --- maven-resources-plugin:2.6:testResources
> (default-testResources) @ hbase-examples ---
> [INFO] Using 'UTF-8' encoding to copy filtered resources.
> [INFO] skip non existing resourceDirectory
> /x1/jenkins/jenkins-slave/workspace/hbase-0.95/0.95/hbase-examples/src/test/resources
> [INFO] Copying 3 resources
> [INFO]
> [INFO] --- maven-compiler-plugin:2.5.1:testCompile (default-testCompile) @
> hbase-examples ---
> [INFO] Compiling 3 source files to
> /x1/jenkins/jenkins-slave/workspace/hbase-0.95/0.95/hbase-examples/target/test-classes
> [INFO]
> [INFO] --- maven-surefire-plugin:2.12-TRUNK-HBASE-2:test (default-test) @
> hbase-examples ---
> [INFO] Surefire report directory:
> /x1/jenkins/jenkins-slave/workspace/hbase-0.95/0.95/hbase-examples/target/surefire-reports
> [INFO] Using configured provider
> org.apache.maven.surefire.junitcore.JUnitCoreProvider
>
> -------------------------------------------------------
>  T E S T S
> -------------------------------------------------------
>
> Results :
>
> Tests run: 0, Failures: 0, Errors: 0, Skipped: 0
>
> [INFO]
> [INFO] --- maven-surefire-plugin:2.12-TRUNK-HBASE-2:test
> (secondPartTestsExecution) @ hbase-examples ---
> [INFO] Surefire report directory:
> /x1/jenkins/jenkins-slave/workspace/hbase-0.95/0.95/hbase-examples/target/surefire-reports
> [INFO] Using configured provider
> org.apache.maven.surefire.junitcore.JUnitCoreProvider
>
> -------------------------------------------------------
>  T E S T S
> -------------------------------------------------------
>
> -------------------------------------------------------
>  T E S T S
> -------------------------------------------------------
> Running org.apache.hadoop.hbase.coprocessor.example.TestBulkDeleteProtocol
> Tests run: 8, Failures: 1, Errors: 0, Skipped: 0, Time elapsed: 27.087 sec
> <<< FAILURE!
> Running org.apache.hadoop.hbase.coprocessor.example.TestRowCountEndpoint
> Tests run: 1, Failures: 0, Errors: 1, Skipped: 0, Time elapsed: 218.024
> sec <<< FAILURE!
> Running
> org.apache.hadoop.hbase.coprocessor.example.TestZooKeeperScanPolicyObserver
> Tests run: 1, Failures: 0, Errors: 1, Skipped: 0, Time elapsed: 218.107
> sec <<< FAILURE!
>
> Results :
>
> Failed tests:
> testBulkDeleteColumn(org.apache.hadoop.hbase.coprocessor.example.TestBulkDeleteProtocol):
> expected:<100> but was:<120>
>
> Tests in error:
>   org.apache.hadoop.hbase.coprocessor.example.TestRowCountEndpoint:
> Shutting down
>
> org.apache.hadoop.hbase.coprocessor.example.TestZooKeeperScanPolicyObserver:
> Shutting down
>
> Tests run: 10, Failures: 1, Errors: 2, Skipped: 0
>
> [INFO]
> [INFO]
> ------------------------------------------------------------------------
> [INFO] Skipping HBase
> [INFO] This project has been banned from the build due to previous
> failures.
> [INFO]
> ------------------------------------------------------------------------
> [INFO]
> [INFO]
> ------------------------------------------------------------------------
> [INFO] Skipping HBase
> [INFO] This project has been banned from the build due to previous
> failures.
> [INFO]
> ------------------------------------------------------------------------
> [INFO]
> ------------------------------------------------------------------------
> [INFO] Reactor Summary:
> [INFO]
> [INFO] HBase ............................................. SUCCESS [4.423s]
> [INFO] HBase - Common .................................... SUCCESS
> [15.140s]
> [INFO] HBase - Protocol .................................. SUCCESS [6.382s]
> [INFO] HBase - Client .................................... SUCCESS [7.263s]
> [INFO] HBase - Prefix Tree ............................... SUCCESS [2.499s]
> [INFO] HBase - Hadoop Compatibility ...................... SUCCESS [0.521s]
> [INFO] HBase - Hadoop One Compatibility .................. SUCCESS [1.298s]
> [INFO] HBase - Server .................................... SUCCESS
> [37:38.410s]
> [INFO] HBase - Integration Tests ......................... SUCCESS [2.978s]
> [INFO] HBase - Examples .................................. FAILURE
> [3:41.089s]
> [INFO]
> ------------------------------------------------------------------------
> [INFO] BUILD FAILURE
> [INFO]
> ------------------------------------------------------------------------
> [INFO] Total time: 42:00.587s
> [INFO] Finished at: Mon Mar 04 17:59:06 UTC 2013
> [INFO] Final Memory: 77M/1620M
> [INFO]
> ------------------------------------------------------------------------
> [ERROR] Failed to execute goal
> org.apache.maven.plugins:maven-surefire-plugin:2.12-TRUNK-HBASE-2:test
> (secondPartTestsExecution) on project hbase-examples: There are test
> failures.
> [ERROR]
> [ERROR] Please refer to
> /x1/jenkins/jenkins-slave/workspace/hbase-0.95/0.95/hbase-examples/target/surefire-reports
> for the individual test results.
> [ERROR] -> [Help 1]
> [ERROR]
> [ERROR] To see the full stack trace of the errors, re-run Maven with the
> -e switch.
> [ERROR] Re-run Maven using the -X switch to enable full debug logging.
> [ERROR]
> [ERROR] For more information about the errors and possible solutions,
> please read the following articles:
> [ERROR] [Help 1]
> http://cwiki.apache.org/confluence/display/MAVEN/MojoFailureException
> [ERROR]
> [ERROR] After correcting the problems, you can resume the build with the
> command
> [ERROR]   mvn <goals> -rf :hbase-examples
> Build step 'Invoke top-level Maven targets' marked build as failure
> Archiving artifacts
> Recording test results
>

Mime
  • Unnamed multipart/alternative (inline, None, 0 bytes)
View raw message