hbase-dev mailing list archives

Site index · List index
Message view « Date » · « Thread »
Top « Date » · « Thread »
From Apache Jenkins Server <jenk...@builds.apache.org>
Subject Build failed in Jenkins: HBase-TRUNK-on-Hadoop-2.0.0 #445
Date Wed, 13 Mar 2013 12:53:42 GMT
See <https://builds.apache.org/job/HBase-TRUNK-on-Hadoop-2.0.0/445/changes>

Changes:

[Gary Helmling] HBASE-7482 Port HBASE-7442 HBase remote CopyTable not working when security enabled to trunk

------------------------------------------
[...truncated 22953 lines...]
Forking command line: /bin/sh -c cd <https://builds.apache.org/job/HBase-TRUNK-on-Hadoop-2.0.0/ws/trunk/hbase-server> && /home/jenkins/tools/java/jdk1.6.0_27-32/jre/bin/java -enableassertions -Xmx1900m -Djava.security.egd=file:/dev/./urandom -Djava.net.preferIPv4Stack=true -jar <https://builds.apache.org/job/HBase-TRUNK-on-Hadoop-2.0.0/ws/trunk/hbase-server/target/surefire/surefirebooter8673265185173875837.jar> <https://builds.apache.org/job/HBase-TRUNK-on-Hadoop-2.0.0/ws/trunk/hbase-server/target/surefire/surefire2687676802561423544tmp> <https://builds.apache.org/job/HBase-TRUNK-on-Hadoop-2.0.0/ws/trunk/hbase-server/target/surefire/surefire_1827078349808949054874tmp>
Running org.apache.hadoop.hbase.client.TestFromClientSide
Tests run: 62, Failures: 0, Errors: 0, Skipped: 3, Time elapsed: 244.471 sec
Forking command line: /bin/sh -c cd <https://builds.apache.org/job/HBase-TRUNK-on-Hadoop-2.0.0/ws/trunk/hbase-server> && /home/jenkins/tools/java/jdk1.6.0_27-32/jre/bin/java -enableassertions -Xmx1900m -Djava.security.egd=file:/dev/./urandom -Djava.net.preferIPv4Stack=true -jar <https://builds.apache.org/job/HBase-TRUNK-on-Hadoop-2.0.0/ws/trunk/hbase-server/target/surefire/surefirebooter5505506944244572037.jar> <https://builds.apache.org/job/HBase-TRUNK-on-Hadoop-2.0.0/ws/trunk/hbase-server/target/surefire/surefire840606498766719018tmp> <https://builds.apache.org/job/HBase-TRUNK-on-Hadoop-2.0.0/ws/trunk/hbase-server/target/surefire/surefire_1831703404061791569498tmp>
Running org.apache.hadoop.hbase.client.TestMultipleTimestamps
Tests run: 8, Failures: 0, Errors: 0, Skipped: 0, Time elapsed: 54.928 sec
Forking command line: /bin/sh -c cd <https://builds.apache.org/job/HBase-TRUNK-on-Hadoop-2.0.0/ws/trunk/hbase-server> && /home/jenkins/tools/java/jdk1.6.0_27-32/jre/bin/java -enableassertions -Xmx1900m -Djava.security.egd=file:/dev/./urandom -Djava.net.preferIPv4Stack=true -jar <https://builds.apache.org/job/HBase-TRUNK-on-Hadoop-2.0.0/ws/trunk/hbase-server/target/surefire/surefirebooter7564589590757441173.jar> <https://builds.apache.org/job/HBase-TRUNK-on-Hadoop-2.0.0/ws/trunk/hbase-server/target/surefire/surefire1958701165023554933tmp> <https://builds.apache.org/job/HBase-TRUNK-on-Hadoop-2.0.0/ws/trunk/hbase-server/target/surefire/surefire_1842378664993170363714tmp>
Running org.apache.hadoop.hbase.client.TestSnapshotMetadata
Tests run: 4, Failures: 0, Errors: 0, Skipped: 0, Time elapsed: 82.122 sec
Forking command line: /bin/sh -c cd <https://builds.apache.org/job/HBase-TRUNK-on-Hadoop-2.0.0/ws/trunk/hbase-server> && /home/jenkins/tools/java/jdk1.6.0_27-32/jre/bin/java -enableassertions -Xmx1900m -Djava.security.egd=file:/dev/./urandom -Djava.net.preferIPv4Stack=true -jar <https://builds.apache.org/job/HBase-TRUNK-on-Hadoop-2.0.0/ws/trunk/hbase-server/target/surefire/surefirebooter8844993972295765702.jar> <https://builds.apache.org/job/HBase-TRUNK-on-Hadoop-2.0.0/ws/trunk/hbase-server/target/surefire/surefire1963827424852780472tmp> <https://builds.apache.org/job/HBase-TRUNK-on-Hadoop-2.0.0/ws/trunk/hbase-server/target/surefire/surefire_1858673224656978693739tmp>
Running org.apache.hadoop.hbase.client.replication.TestReplicationAdmin
Tests run: 1, Failures: 0, Errors: 0, Skipped: 0, Time elapsed: 2.354 sec
Forking command line: /bin/sh -c cd <https://builds.apache.org/job/HBase-TRUNK-on-Hadoop-2.0.0/ws/trunk/hbase-server> && /home/jenkins/tools/java/jdk1.6.0_27-32/jre/bin/java -enableassertions -Xmx1900m -Djava.security.egd=file:/dev/./urandom -Djava.net.preferIPv4Stack=true -jar <https://builds.apache.org/job/HBase-TRUNK-on-Hadoop-2.0.0/ws/trunk/hbase-server/target/surefire/surefirebooter9019434383634817124.jar> <https://builds.apache.org/job/HBase-TRUNK-on-Hadoop-2.0.0/ws/trunk/hbase-server/target/surefire/surefire5595410460544864012tmp> <https://builds.apache.org/job/HBase-TRUNK-on-Hadoop-2.0.0/ws/trunk/hbase-server/target/surefire/surefire_1867238437777566398635tmp>
Running org.apache.hadoop.hbase.client.TestClientScannerRPCTimeout
Tests run: 1, Failures: 0, Errors: 0, Skipped: 0, Time elapsed: 35.668 sec
Forking command line: /bin/sh -c cd <https://builds.apache.org/job/HBase-TRUNK-on-Hadoop-2.0.0/ws/trunk/hbase-server> && /home/jenkins/tools/java/jdk1.6.0_27-32/jre/bin/java -enableassertions -Xmx1900m -Djava.security.egd=file:/dev/./urandom -Djava.net.preferIPv4Stack=true -jar <https://builds.apache.org/job/HBase-TRUNK-on-Hadoop-2.0.0/ws/trunk/hbase-server/target/surefire/surefirebooter5124465133679556702.jar> <https://builds.apache.org/job/HBase-TRUNK-on-Hadoop-2.0.0/ws/trunk/hbase-server/target/surefire/surefire3118505730489223441tmp> <https://builds.apache.org/job/HBase-TRUNK-on-Hadoop-2.0.0/ws/trunk/hbase-server/target/surefire/surefire_1872235125891237129722tmp>
Running org.apache.hadoop.hbase.client.TestFromClientSideWithCoprocessor
Tests run: 62, Failures: 0, Errors: 0, Skipped: 3, Time elapsed: 294.056 sec
Forking command line: /bin/sh -c cd <https://builds.apache.org/job/HBase-TRUNK-on-Hadoop-2.0.0/ws/trunk/hbase-server> && /home/jenkins/tools/java/jdk1.6.0_27-32/jre/bin/java -enableassertions -Xmx1900m -Djava.security.egd=file:/dev/./urandom -Djava.net.preferIPv4Stack=true -jar <https://builds.apache.org/job/HBase-TRUNK-on-Hadoop-2.0.0/ws/trunk/hbase-server/target/surefire/surefirebooter4182709703997031993.jar> <https://builds.apache.org/job/HBase-TRUNK-on-Hadoop-2.0.0/ws/trunk/hbase-server/target/surefire/surefire9061955163603634390tmp> <https://builds.apache.org/job/HBase-TRUNK-on-Hadoop-2.0.0/ws/trunk/hbase-server/target/surefire/surefire_1887940740628081866257tmp>
Running org.apache.hadoop.hbase.client.TestSnapshotCloneIndependence
Tests run: 6, Failures: 0, Errors: 0, Skipped: 0, Time elapsed: 154.407 sec
Forking command line: /bin/sh -c cd <https://builds.apache.org/job/HBase-TRUNK-on-Hadoop-2.0.0/ws/trunk/hbase-server> && /home/jenkins/tools/java/jdk1.6.0_27-32/jre/bin/java -enableassertions -Xmx1900m -Djava.security.egd=file:/dev/./urandom -Djava.net.preferIPv4Stack=true -jar <https://builds.apache.org/job/HBase-TRUNK-on-Hadoop-2.0.0/ws/trunk/hbase-server/target/surefire/surefirebooter7075984517081565608.jar> <https://builds.apache.org/job/HBase-TRUNK-on-Hadoop-2.0.0/ws/trunk/hbase-server/target/surefire/surefire1904971840751742215tmp> <https://builds.apache.org/job/HBase-TRUNK-on-Hadoop-2.0.0/ws/trunk/hbase-server/target/surefire/surefire_1896055556802531222389tmp>
Running org.apache.hadoop.hbase.constraint.TestConstraint
Tests run: 5, Failures: 0, Errors: 0, Skipped: 0, Time elapsed: 42.414 sec
Forking command line: /bin/sh -c cd <https://builds.apache.org/job/HBase-TRUNK-on-Hadoop-2.0.0/ws/trunk/hbase-server> && /home/jenkins/tools/java/jdk1.6.0_27-32/jre/bin/java -enableassertions -Xmx1900m -Djava.security.egd=file:/dev/./urandom -Djava.net.preferIPv4Stack=true -jar <https://builds.apache.org/job/HBase-TRUNK-on-Hadoop-2.0.0/ws/trunk/hbase-server/target/surefire/surefirebooter6929792310062304845.jar> <https://builds.apache.org/job/HBase-TRUNK-on-Hadoop-2.0.0/ws/trunk/hbase-server/target/surefire/surefire3412074590014891327tmp> <https://builds.apache.org/job/HBase-TRUNK-on-Hadoop-2.0.0/ws/trunk/hbase-server/target/surefire/surefire_190543625715191248987tmp>
Running org.apache.hadoop.hbase.rest.TestGzipFilter
Tests run: 2, Failures: 0, Errors: 0, Skipped: 0, Time elapsed: 22.985 sec
Forking command line: /bin/sh -c cd <https://builds.apache.org/job/HBase-TRUNK-on-Hadoop-2.0.0/ws/trunk/hbase-server> && /home/jenkins/tools/java/jdk1.6.0_27-32/jre/bin/java -enableassertions -Xmx1900m -Djava.security.egd=file:/dev/./urandom -Djava.net.preferIPv4Stack=true -jar <https://builds.apache.org/job/HBase-TRUNK-on-Hadoop-2.0.0/ws/trunk/hbase-server/target/surefire/surefirebooter5849954408865939043.jar> <https://builds.apache.org/job/HBase-TRUNK-on-Hadoop-2.0.0/ws/trunk/hbase-server/target/surefire/surefire1471367315542457205tmp> <https://builds.apache.org/job/HBase-TRUNK-on-Hadoop-2.0.0/ws/trunk/hbase-server/target/surefire/surefire_1913641424261991189931tmp>
Running org.apache.hadoop.hbase.client.TestMultiParallel
Tests run: 11, Failures: 0, Errors: 1, Skipped: 0, Time elapsed: 164.797 sec <<< FAILURE!
Forking command line: /bin/sh -c cd <https://builds.apache.org/job/HBase-TRUNK-on-Hadoop-2.0.0/ws/trunk/hbase-server> && /home/jenkins/tools/java/jdk1.6.0_27-32/jre/bin/java -enableassertions -Xmx1900m -Djava.security.egd=file:/dev/./urandom -Djava.net.preferIPv4Stack=true -jar <https://builds.apache.org/job/HBase-TRUNK-on-Hadoop-2.0.0/ws/trunk/hbase-server/target/surefire/surefirebooter8970342924133274558.jar> <https://builds.apache.org/job/HBase-TRUNK-on-Hadoop-2.0.0/ws/trunk/hbase-server/target/surefire/surefire1445294737026176920tmp> <https://builds.apache.org/job/HBase-TRUNK-on-Hadoop-2.0.0/ws/trunk/hbase-server/target/surefire/surefire_192516043162159068495tmp>
Running org.apache.hadoop.hbase.rest.TestMultiRowResource
Tests run: 3, Failures: 0, Errors: 0, Skipped: 0, Time elapsed: 24.102 sec
Forking command line: /bin/sh -c cd <https://builds.apache.org/job/HBase-TRUNK-on-Hadoop-2.0.0/ws/trunk/hbase-server> && /home/jenkins/tools/java/jdk1.6.0_27-32/jre/bin/java -enableassertions -Xmx1900m -Djava.security.egd=file:/dev/./urandom -Djava.net.preferIPv4Stack=true -jar <https://builds.apache.org/job/HBase-TRUNK-on-Hadoop-2.0.0/ws/trunk/hbase-server/target/surefire/surefirebooter5792180831658680866.jar> <https://builds.apache.org/job/HBase-TRUNK-on-Hadoop-2.0.0/ws/trunk/hbase-server/target/surefire/surefire5705228404812326825tmp> <https://builds.apache.org/job/HBase-TRUNK-on-Hadoop-2.0.0/ws/trunk/hbase-server/target/surefire/surefire_1935552058403980746832tmp>
Running org.apache.hadoop.hbase.rest.TestScannersWithFilters
Tests run: 10, Failures: 0, Errors: 0, Skipped: 0, Time elapsed: 26.84 sec
Forking command line: /bin/sh -c cd <https://builds.apache.org/job/HBase-TRUNK-on-Hadoop-2.0.0/ws/trunk/hbase-server> && /home/jenkins/tools/java/jdk1.6.0_27-32/jre/bin/java -enableassertions -Xmx1900m -Djava.security.egd=file:/dev/./urandom -Djava.net.preferIPv4Stack=true -jar <https://builds.apache.org/job/HBase-TRUNK-on-Hadoop-2.0.0/ws/trunk/hbase-server/target/surefire/surefirebooter6598359965816485665.jar> <https://builds.apache.org/job/HBase-TRUNK-on-Hadoop-2.0.0/ws/trunk/hbase-server/target/surefire/surefire6111724931822083957tmp> <https://builds.apache.org/job/HBase-TRUNK-on-Hadoop-2.0.0/ws/trunk/hbase-server/target/surefire/surefire_1944890425235932192975tmp>
Running org.apache.hadoop.hbase.rest.TestRowResource
Tests run: 12, Failures: 0, Errors: 0, Skipped: 0, Time elapsed: 32.443 sec
Forking command line: /bin/sh -c cd <https://builds.apache.org/job/HBase-TRUNK-on-Hadoop-2.0.0/ws/trunk/hbase-server> && /home/jenkins/tools/java/jdk1.6.0_27-32/jre/bin/java -enableassertions -Xmx1900m -Djava.security.egd=file:/dev/./urandom -Djava.net.preferIPv4Stack=true -jar <https://builds.apache.org/job/HBase-TRUNK-on-Hadoop-2.0.0/ws/trunk/hbase-server/target/surefire/surefirebooter8657908303714700508.jar> <https://builds.apache.org/job/HBase-TRUNK-on-Hadoop-2.0.0/ws/trunk/hbase-server/target/surefire/surefire3718459849849651734tmp> <https://builds.apache.org/job/HBase-TRUNK-on-Hadoop-2.0.0/ws/trunk/hbase-server/target/surefire/surefire_1955339961907718231253tmp>
Running org.apache.hadoop.hbase.rest.client.TestRemoteAdmin
Tests run: 1, Failures: 0, Errors: 0, Skipped: 0, Time elapsed: 32.355 sec
Forking command line: /bin/sh -c cd <https://builds.apache.org/job/HBase-TRUNK-on-Hadoop-2.0.0/ws/trunk/hbase-server> && /home/jenkins/tools/java/jdk1.6.0_27-32/jre/bin/java -enableassertions -Xmx1900m -Djava.security.egd=file:/dev/./urandom -Djava.net.preferIPv4Stack=true -jar <https://builds.apache.org/job/HBase-TRUNK-on-Hadoop-2.0.0/ws/trunk/hbase-server/target/surefire/surefirebooter2234173209159989182.jar> <https://builds.apache.org/job/HBase-TRUNK-on-Hadoop-2.0.0/ws/trunk/hbase-server/target/surefire/surefire415169399509472532tmp> <https://builds.apache.org/job/HBase-TRUNK-on-Hadoop-2.0.0/ws/trunk/hbase-server/target/surefire/surefire_1965899652146381348308tmp>
Running org.apache.hadoop.hbase.rest.client.TestRemoteTable
Tests run: 4, Failures: 0, Errors: 0, Skipped: 0, Time elapsed: 24.853 sec
Forking command line: /bin/sh -c cd <https://builds.apache.org/job/HBase-TRUNK-on-Hadoop-2.0.0/ws/trunk/hbase-server> && /home/jenkins/tools/java/jdk1.6.0_27-32/jre/bin/java -enableassertions -Xmx1900m -Djava.security.egd=file:/dev/./urandom -Djava.net.preferIPv4Stack=true -jar <https://builds.apache.org/job/HBase-TRUNK-on-Hadoop-2.0.0/ws/trunk/hbase-server/target/surefire/surefirebooter8314570957681630413.jar> <https://builds.apache.org/job/HBase-TRUNK-on-Hadoop-2.0.0/ws/trunk/hbase-server/target/surefire/surefire1337380829056557776tmp> <https://builds.apache.org/job/HBase-TRUNK-on-Hadoop-2.0.0/ws/trunk/hbase-server/target/surefire/surefire_1976930300647724411450tmp>
Running org.apache.hadoop.hbase.rest.TestVersionResource
Tests run: 7, Failures: 0, Errors: 0, Skipped: 0, Time elapsed: 20.944 sec
Forking command line: /bin/sh -c cd <https://builds.apache.org/job/HBase-TRUNK-on-Hadoop-2.0.0/ws/trunk/hbase-server> && /home/jenkins/tools/java/jdk1.6.0_27-32/jre/bin/java -enableassertions -Xmx1900m -Djava.security.egd=file:/dev/./urandom -Djava.net.preferIPv4Stack=true -jar <https://builds.apache.org/job/HBase-TRUNK-on-Hadoop-2.0.0/ws/trunk/hbase-server/target/surefire/surefirebooter6340646118743574102.jar> <https://builds.apache.org/job/HBase-TRUNK-on-Hadoop-2.0.0/ws/trunk/hbase-server/target/surefire/surefire1319231467977487482tmp> <https://builds.apache.org/job/HBase-TRUNK-on-Hadoop-2.0.0/ws/trunk/hbase-server/target/surefire/surefire_1986473870501008799022tmp>
Running org.apache.hadoop.hbase.rest.TestScannerResource
Tests run: 5, Failures: 0, Errors: 0, Skipped: 0, Time elapsed: 35.071 sec
Forking command line: /bin/sh -c cd <https://builds.apache.org/job/HBase-TRUNK-on-Hadoop-2.0.0/ws/trunk/hbase-server> && /home/jenkins/tools/java/jdk1.6.0_27-32/jre/bin/java -enableassertions -Xmx1900m -Djava.security.egd=file:/dev/./urandom -Djava.net.preferIPv4Stack=true -jar <https://builds.apache.org/job/HBase-TRUNK-on-Hadoop-2.0.0/ws/trunk/hbase-server/target/surefire/surefirebooter658171161797614021.jar> <https://builds.apache.org/job/HBase-TRUNK-on-Hadoop-2.0.0/ws/trunk/hbase-server/target/surefire/surefire4500437786543757041tmp> <https://builds.apache.org/job/HBase-TRUNK-on-Hadoop-2.0.0/ws/trunk/hbase-server/target/surefire/surefire_1992132267486139315493tmp>
Running org.apache.hadoop.hbase.rest.TestTableResource
Tests run: 8, Failures: 0, Errors: 0, Skipped: 0, Time elapsed: 35.283 sec
Forking command line: /bin/sh -c cd <https://builds.apache.org/job/HBase-TRUNK-on-Hadoop-2.0.0/ws/trunk/hbase-server> && /home/jenkins/tools/java/jdk1.6.0_27-32/jre/bin/java -enableassertions -Xmx1900m -Djava.security.egd=file:/dev/./urandom -Djava.net.preferIPv4Stack=true -jar <https://builds.apache.org/job/HBase-TRUNK-on-Hadoop-2.0.0/ws/trunk/hbase-server/target/surefire/surefirebooter7317631985471539134.jar> <https://builds.apache.org/job/HBase-TRUNK-on-Hadoop-2.0.0/ws/trunk/hbase-server/target/surefire/surefire6385745019083631567tmp> <https://builds.apache.org/job/HBase-TRUNK-on-Hadoop-2.0.0/ws/trunk/hbase-server/target/surefire/surefire_2002203600568673120566tmp>
Running org.apache.hadoop.hbase.rest.TestStatusResource
Tests run: 2, Failures: 0, Errors: 0, Skipped: 0, Time elapsed: 19.647 sec
Forking command line: /bin/sh -c cd <https://builds.apache.org/job/HBase-TRUNK-on-Hadoop-2.0.0/ws/trunk/hbase-server> && /home/jenkins/tools/java/jdk1.6.0_27-32/jre/bin/java -enableassertions -Xmx1900m -Djava.security.egd=file:/dev/./urandom -Djava.net.preferIPv4Stack=true -jar <https://builds.apache.org/job/HBase-TRUNK-on-Hadoop-2.0.0/ws/trunk/hbase-server/target/surefire/surefirebooter6066019402161423755.jar> <https://builds.apache.org/job/HBase-TRUNK-on-Hadoop-2.0.0/ws/trunk/hbase-server/target/surefire/surefire5354056058521797211tmp> <https://builds.apache.org/job/HBase-TRUNK-on-Hadoop-2.0.0/ws/trunk/hbase-server/target/surefire/surefire_2014677639890300995578tmp>
Running org.apache.hadoop.hbase.rest.TestSchemaResource
Tests run: 2, Failures: 0, Errors: 0, Skipped: 0, Time elapsed: 32.796 sec
Forking command line: /bin/sh -c cd <https://builds.apache.org/job/HBase-TRUNK-on-Hadoop-2.0.0/ws/trunk/hbase-server> && /home/jenkins/tools/java/jdk1.6.0_27-32/jre/bin/java -enableassertions -Xmx1900m -Djava.security.egd=file:/dev/./urandom -Djava.net.preferIPv4Stack=true -jar <https://builds.apache.org/job/HBase-TRUNK-on-Hadoop-2.0.0/ws/trunk/hbase-server/target/surefire/surefirebooter8481834234615448159.jar> <https://builds.apache.org/job/HBase-TRUNK-on-Hadoop-2.0.0/ws/trunk/hbase-server/target/surefire/surefire8616718505243462077tmp> <https://builds.apache.org/job/HBase-TRUNK-on-Hadoop-2.0.0/ws/trunk/hbase-server/target/surefire/surefire_2024857822934377064128tmp>
Running org.apache.hadoop.hbase.client.TestRestoreSnapshotFromClient
Tests run: 3, Failures: 0, Errors: 0, Skipped: 0, Time elapsed: 531.27 sec
Forking command line: /bin/sh -c cd <https://builds.apache.org/job/HBase-TRUNK-on-Hadoop-2.0.0/ws/trunk/hbase-server> && /home/jenkins/tools/java/jdk1.6.0_27-32/jre/bin/java -enableassertions -Xmx1900m -Djava.security.egd=file:/dev/./urandom -Djava.net.preferIPv4Stack=true -jar <https://builds.apache.org/job/HBase-TRUNK-on-Hadoop-2.0.0/ws/trunk/hbase-server/target/surefire/surefirebooter2372970198854100222.jar> <https://builds.apache.org/job/HBase-TRUNK-on-Hadoop-2.0.0/ws/trunk/hbase-server/target/surefire/surefire333326715894043169tmp> <https://builds.apache.org/job/HBase-TRUNK-on-Hadoop-2.0.0/ws/trunk/hbase-server/target/surefire/surefire_2034348111814969782264tmp>
Running org.apache.hadoop.hbase.thrift.TestThriftServerCmdLine
Tests run: 32, Failures: 0, Errors: 0, Skipped: 0, Time elapsed: 72.446 sec
Forking command line: /bin/sh -c cd <https://builds.apache.org/job/HBase-TRUNK-on-Hadoop-2.0.0/ws/trunk/hbase-server> && /home/jenkins/tools/java/jdk1.6.0_27-32/jre/bin/java -enableassertions -Xmx1900m -Djava.security.egd=file:/dev/./urandom -Djava.net.preferIPv4Stack=true -jar <https://builds.apache.org/job/HBase-TRUNK-on-Hadoop-2.0.0/ws/trunk/hbase-server/target/surefire/surefirebooter8138622688644026020.jar> <https://builds.apache.org/job/HBase-TRUNK-on-Hadoop-2.0.0/ws/trunk/hbase-server/target/surefire/surefire4065322686644143942tmp> <https://builds.apache.org/job/HBase-TRUNK-on-Hadoop-2.0.0/ws/trunk/hbase-server/target/surefire/surefire_2043623867302430986079tmp>
Running org.apache.hadoop.hbase.thrift.TestThriftServer
Tests run: 1, Failures: 0, Errors: 0, Skipped: 0, Time elapsed: 107.958 sec
Forking command line: /bin/sh -c cd <https://builds.apache.org/job/HBase-TRUNK-on-Hadoop-2.0.0/ws/trunk/hbase-server> && /home/jenkins/tools/java/jdk1.6.0_27-32/jre/bin/java -enableassertions -Xmx1900m -Djava.security.egd=file:/dev/./urandom -Djava.net.preferIPv4Stack=true -jar <https://builds.apache.org/job/HBase-TRUNK-on-Hadoop-2.0.0/ws/trunk/hbase-server/target/surefire/surefirebooter1519008042042689747.jar> <https://builds.apache.org/job/HBase-TRUNK-on-Hadoop-2.0.0/ws/trunk/hbase-server/target/surefire/surefire1386227103690917191tmp> <https://builds.apache.org/job/HBase-TRUNK-on-Hadoop-2.0.0/ws/trunk/hbase-server/target/surefire/surefire_2057802667190930089230tmp>
Running org.apache.hadoop.hbase.io.encoding.TestLoadAndSwitchEncodeOnDisk
Tests run: 1, Failures: 0, Errors: 0, Skipped: 0, Time elapsed: 59.831 sec
Forking command line: /bin/sh -c cd <https://builds.apache.org/job/HBase-TRUNK-on-Hadoop-2.0.0/ws/trunk/hbase-server> && /home/jenkins/tools/java/jdk1.6.0_27-32/jre/bin/java -enableassertions -Xmx1900m -Djava.security.egd=file:/dev/./urandom -Djava.net.preferIPv4Stack=true -jar <https://builds.apache.org/job/HBase-TRUNK-on-Hadoop-2.0.0/ws/trunk/hbase-server/target/surefire/surefirebooter5159950051907869079.jar> <https://builds.apache.org/job/HBase-TRUNK-on-Hadoop-2.0.0/ws/trunk/hbase-server/target/surefire/surefire5940337173303627140tmp> <https://builds.apache.org/job/HBase-TRUNK-on-Hadoop-2.0.0/ws/trunk/hbase-server/target/surefire/surefire_2065388769721399493384tmp>
Running org.apache.hadoop.hbase.io.encoding.TestEncodedSeekers
Tests run: 10, Failures: 0, Errors: 0, Skipped: 0, Time elapsed: 57.522 sec
Forking command line: /bin/sh -c cd <https://builds.apache.org/job/HBase-TRUNK-on-Hadoop-2.0.0/ws/trunk/hbase-server> && /home/jenkins/tools/java/jdk1.6.0_27-32/jre/bin/java -enableassertions -Xmx1900m -Djava.security.egd=file:/dev/./urandom -Djava.net.preferIPv4Stack=true -jar <https://builds.apache.org/job/HBase-TRUNK-on-Hadoop-2.0.0/ws/trunk/hbase-server/target/surefire/surefirebooter8108422656734012424.jar> <https://builds.apache.org/job/HBase-TRUNK-on-Hadoop-2.0.0/ws/trunk/hbase-server/target/surefire/surefire3286897003743163206tmp> <https://builds.apache.org/job/HBase-TRUNK-on-Hadoop-2.0.0/ws/trunk/hbase-server/target/surefire/surefire_2079082778858137763398tmp>
Running org.apache.hadoop.hbase.client.TestAdmin
Tests run: 41, Failures: 0, Errors: 0, Skipped: 0, Time elapsed: 419.75 sec
Forking command line: /bin/sh -c cd <https://builds.apache.org/job/HBase-TRUNK-on-Hadoop-2.0.0/ws/trunk/hbase-server> && /home/jenkins/tools/java/jdk1.6.0_27-32/jre/bin/java -enableassertions -Xmx1900m -Djava.security.egd=file:/dev/./urandom -Djava.net.preferIPv4Stack=true -jar <https://builds.apache.org/job/HBase-TRUNK-on-Hadoop-2.0.0/ws/trunk/hbase-server/target/surefire/surefirebooter2680049482319915509.jar> <https://builds.apache.org/job/HBase-TRUNK-on-Hadoop-2.0.0/ws/trunk/hbase-server/target/surefire/surefire5496472565387921347tmp> <https://builds.apache.org/job/HBase-TRUNK-on-Hadoop-2.0.0/ws/trunk/hbase-server/target/surefire/surefire_20823851827005630745tmp>
Running org.apache.hadoop.hbase.io.hfile.TestHFileSeek
Tests run: 1, Failures: 0, Errors: 0, Skipped: 0, Time elapsed: 8.595 sec
Forking command line: /bin/sh -c cd <https://builds.apache.org/job/HBase-TRUNK-on-Hadoop-2.0.0/ws/trunk/hbase-server> && /home/jenkins/tools/java/jdk1.6.0_27-32/jre/bin/java -enableassertions -Xmx1900m -Djava.security.egd=file:/dev/./urandom -Djava.net.preferIPv4Stack=true -jar <https://builds.apache.org/job/HBase-TRUNK-on-Hadoop-2.0.0/ws/trunk/hbase-server/target/surefire/surefirebooter1697737990538229727.jar> <https://builds.apache.org/job/HBase-TRUNK-on-Hadoop-2.0.0/ws/trunk/hbase-server/target/surefire/surefire7014322642312031828tmp> <https://builds.apache.org/job/HBase-TRUNK-on-Hadoop-2.0.0/ws/trunk/hbase-server/target/surefire/surefire_209676959755295372395tmp>
Running org.apache.hadoop.hbase.io.encoding.TestBufferedDataBlockEncoder
Tests run: 1, Failures: 0, Errors: 0, Skipped: 0, Time elapsed: 29.685 sec
Forking command line: /bin/sh -c cd <https://builds.apache.org/job/HBase-TRUNK-on-Hadoop-2.0.0/ws/trunk/hbase-server> && /home/jenkins/tools/java/jdk1.6.0_27-32/jre/bin/java -enableassertions -Xmx1900m -Djava.security.egd=file:/dev/./urandom -Djava.net.preferIPv4Stack=true -jar <https://builds.apache.org/job/HBase-TRUNK-on-Hadoop-2.0.0/ws/trunk/hbase-server/target/surefire/surefirebooter7882508396996037184.jar> <https://builds.apache.org/job/HBase-TRUNK-on-Hadoop-2.0.0/ws/trunk/hbase-server/target/surefire/surefire3398479840170617663tmp> <https://builds.apache.org/job/HBase-TRUNK-on-Hadoop-2.0.0/ws/trunk/hbase-server/target/surefire/surefire_210436278549818382774tmp>
Running org.apache.hadoop.hbase.client.TestCloneSnapshotFromClient
Running org.apache.hadoop.hbase.io.hfile.slab.TestSlabCache
Tests run: 7, Failures: 0, Errors: 0, Skipped: 0, Time elapsed: 27.337 sec
Forking command line: /bin/sh -c cd <https://builds.apache.org/job/HBase-TRUNK-on-Hadoop-2.0.0/ws/trunk/hbase-server> && /home/jenkins/tools/java/jdk1.6.0_27-32/jre/bin/java -enableassertions -Xmx1900m -Djava.security.egd=file:/dev/./urandom -Djava.net.preferIPv4Stack=true -jar <https://builds.apache.org/job/HBase-TRUNK-on-Hadoop-2.0.0/ws/trunk/hbase-server/target/surefire/surefirebooter2299480443061093730.jar> <https://builds.apache.org/job/HBase-TRUNK-on-Hadoop-2.0.0/ws/trunk/hbase-server/target/surefire/surefire8796401014996824548tmp> <https://builds.apache.org/job/HBase-TRUNK-on-Hadoop-2.0.0/ws/trunk/hbase-server/target/surefire/surefire_2113369884193998553988tmp>
Tests run: 3, Failures: 0, Errors: 0, Skipped: 0, Time elapsed: 401.169 sec
Forking command line: /bin/sh -c cd <https://builds.apache.org/job/HBase-TRUNK-on-Hadoop-2.0.0/ws/trunk/hbase-server> && /home/jenkins/tools/java/jdk1.6.0_27-32/jre/bin/java -enableassertions -Xmx1900m -Djava.security.egd=file:/dev/./urandom -Djava.net.preferIPv4Stack=true -jar <https://builds.apache.org/job/HBase-TRUNK-on-Hadoop-2.0.0/ws/trunk/hbase-server/target/surefire/surefirebooter216668595541217573.jar> <https://builds.apache.org/job/HBase-TRUNK-on-Hadoop-2.0.0/ws/trunk/hbase-server/target/surefire/surefire2110428566242214128tmp> <https://builds.apache.org/job/HBase-TRUNK-on-Hadoop-2.0.0/ws/trunk/hbase-server/target/surefire/surefire_2123208900571755095367tmp>
Running org.apache.hadoop.hbase.io.hfile.TestHFilePerformance
Tests run: 1, Failures: 0, Errors: 0, Skipped: 0, Time elapsed: 11.962 sec
Forking command line: /bin/sh -c cd <https://builds.apache.org/job/HBase-TRUNK-on-Hadoop-2.0.0/ws/trunk/hbase-server> && /home/jenkins/tools/java/jdk1.6.0_27-32/jre/bin/java -enableassertions -Xmx1900m -Djava.security.egd=file:/dev/./urandom -Djava.net.preferIPv4Stack=true -jar <https://builds.apache.org/job/HBase-TRUNK-on-Hadoop-2.0.0/ws/trunk/hbase-server/target/surefire/surefirebooter1050725842115930938.jar> <https://builds.apache.org/job/HBase-TRUNK-on-Hadoop-2.0.0/ws/trunk/hbase-server/target/surefire/surefire32481154338762447tmp> <https://builds.apache.org/job/HBase-TRUNK-on-Hadoop-2.0.0/ws/trunk/hbase-server/target/surefire/surefire_2131831497981903477533tmp>
Running org.apache.hadoop.hbase.io.hfile.TestHFileBlockIndex
Tests run: 10, Failures: 0, Errors: 0, Skipped: 0, Time elapsed: 13.519 sec
Forking command line: /bin/sh -c cd <https://builds.apache.org/job/HBase-TRUNK-on-Hadoop-2.0.0/ws/trunk/hbase-server> && /home/jenkins/tools/java/jdk1.6.0_27-32/jre/bin/java -enableassertions -Xmx1900m -Djava.security.egd=file:/dev/./urandom -Djava.net.preferIPv4Stack=true -jar <https://builds.apache.org/job/HBase-TRUNK-on-Hadoop-2.0.0/ws/trunk/hbase-server/target/surefire/surefirebooter5513164699038336934.jar> <https://builds.apache.org/job/HBase-TRUNK-on-Hadoop-2.0.0/ws/trunk/hbase-server/target/surefire/surefire6831930394948659989tmp> <https://builds.apache.org/job/HBase-TRUNK-on-Hadoop-2.0.0/ws/trunk/hbase-server/target/surefire/surefire_2147661262310427200643tmp>
Running org.apache.hadoop.hbase.io.hfile.slab.TestSingleSizeCache
Tests run: 5, Failures: 0, Errors: 0, Skipped: 0, Time elapsed: 39.567 sec
Forking command line: /bin/sh -c cd <https://builds.apache.org/job/HBase-TRUNK-on-Hadoop-2.0.0/ws/trunk/hbase-server> && /home/jenkins/tools/java/jdk1.6.0_27-32/jre/bin/java -enableassertions -Xmx1900m -Djava.security.egd=file:/dev/./urandom -Djava.net.preferIPv4Stack=true -jar <https://builds.apache.org/job/HBase-TRUNK-on-Hadoop-2.0.0/ws/trunk/hbase-server/target/surefire/surefirebooter3468185844988610091.jar> <https://builds.apache.org/job/HBase-TRUNK-on-Hadoop-2.0.0/ws/trunk/hbase-server/target/surefire/surefire8637111305628269534tmp> <https://builds.apache.org/job/HBase-TRUNK-on-Hadoop-2.0.0/ws/trunk/hbase-server/target/surefire/surefire_2151844664427619762428tmp>
Running org.apache.hadoop.hbase.io.hfile.TestForceCacheImportantBlocks
Tests run: 2, Failures: 0, Errors: 0, Skipped: 0, Time elapsed: 42.908 sec
Forking command line: /bin/sh -c cd <https://builds.apache.org/job/HBase-TRUNK-on-Hadoop-2.0.0/ws/trunk/hbase-server> && /home/jenkins/tools/java/jdk1.6.0_27-32/jre/bin/java -enableassertions -Xmx1900m -Djava.security.egd=file:/dev/./urandom -Djava.net.preferIPv4Stack=true -jar <https://builds.apache.org/job/HBase-TRUNK-on-Hadoop-2.0.0/ws/trunk/hbase-server/target/surefire/surefirebooter3136883238277951437.jar> <https://builds.apache.org/job/HBase-TRUNK-on-Hadoop-2.0.0/ws/trunk/hbase-server/target/surefire/surefire6714181350308687736tmp> <https://builds.apache.org/job/HBase-TRUNK-on-Hadoop-2.0.0/ws/trunk/hbase-server/target/surefire/surefire_2163109357501535564748tmp>
Running org.apache.hadoop.hbase.io.hfile.TestHFileBlock
Tests run: 14, Failures: 0, Errors: 0, Skipped: 0, Time elapsed: 54.703 sec
Forking command line: /bin/sh -c cd <https://builds.apache.org/job/HBase-TRUNK-on-Hadoop-2.0.0/ws/trunk/hbase-server> && /home/jenkins/tools/java/jdk1.6.0_27-32/jre/bin/java -enableassertions -Xmx1900m -Djava.security.egd=file:/dev/./urandom -Djava.net.preferIPv4Stack=true -jar <https://builds.apache.org/job/HBase-TRUNK-on-Hadoop-2.0.0/ws/trunk/hbase-server/target/surefire/surefirebooter8241322853334249428.jar> <https://builds.apache.org/job/HBase-TRUNK-on-Hadoop-2.0.0/ws/trunk/hbase-server/target/surefire/surefire14856656879369271tmp> <https://builds.apache.org/job/HBase-TRUNK-on-Hadoop-2.0.0/ws/trunk/hbase-server/target/surefire/surefire_2175704889557798024907tmp>
Running org.apache.hadoop.hbase.io.hfile.TestScannerSelectionUsingTTL
Tests run: 6, Failures: 0, Errors: 0, Skipped: 0, Time elapsed: 67.184 sec
Forking command line: /bin/sh -c cd <https://builds.apache.org/job/HBase-TRUNK-on-Hadoop-2.0.0/ws/trunk/hbase-server> && /home/jenkins/tools/java/jdk1.6.0_27-32/jre/bin/java -enableassertions -Xmx1900m -Djava.security.egd=file:/dev/./urandom -Djava.net.preferIPv4Stack=true -jar <https://builds.apache.org/job/HBase-TRUNK-on-Hadoop-2.0.0/ws/trunk/hbase-server/target/surefire/surefirebooter2389774743969075046.jar> <https://builds.apache.org/job/HBase-TRUNK-on-Hadoop-2.0.0/ws/trunk/hbase-server/target/surefire/surefire2928475183241997586tmp> <https://builds.apache.org/job/HBase-TRUNK-on-Hadoop-2.0.0/ws/trunk/hbase-server/target/surefire/surefire_2181347858801307285152tmp>
Running org.apache.hadoop.hbase.io.encoding.TestDataBlockEncoders
Tests run: 12, Failures: 0, Errors: 0, Skipped: 0, Time elapsed: 161.065 sec
Forking command line: /bin/sh -c cd <https://builds.apache.org/job/HBase-TRUNK-on-Hadoop-2.0.0/ws/trunk/hbase-server> && /home/jenkins/tools/java/jdk1.6.0_27-32/jre/bin/java -enableassertions -Xmx1900m -Djava.security.egd=file:/dev/./urandom -Djava.net.preferIPv4Stack=true -jar <https://builds.apache.org/job/HBase-TRUNK-on-Hadoop-2.0.0/ws/trunk/hbase-server/target/surefire/surefirebooter5192726452025235581.jar> <https://builds.apache.org/job/HBase-TRUNK-on-Hadoop-2.0.0/ws/trunk/hbase-server/target/surefire/surefire4829535010917507203tmp> <https://builds.apache.org/job/HBase-TRUNK-on-Hadoop-2.0.0/ws/trunk/hbase-server/target/surefire/surefire_2197177135173111029008tmp>
Running org.apache.hadoop.hbase.io.TestFileLink
Tests run: 3, Failures: 0, Errors: 0, Skipped: 0, Time elapsed: 45.888 sec
Forking command line: /bin/sh -c cd <https://builds.apache.org/job/HBase-TRUNK-on-Hadoop-2.0.0/ws/trunk/hbase-server> && /home/jenkins/tools/java/jdk1.6.0_27-32/jre/bin/java -enableassertions -Xmx1900m -Djava.security.egd=file:/dev/./urandom -Djava.net.preferIPv4Stack=true -jar <https://builds.apache.org/job/HBase-TRUNK-on-Hadoop-2.0.0/ws/trunk/hbase-server/target/surefire/surefirebooter2506093208945824419.jar> <https://builds.apache.org/job/HBase-TRUNK-on-Hadoop-2.0.0/ws/trunk/hbase-server/target/surefire/surefire7056724858388383048tmp> <https://builds.apache.org/job/HBase-TRUNK-on-Hadoop-2.0.0/ws/trunk/hbase-server/target/surefire/surefire_2206730681317114026302tmp>
Running org.apache.hadoop.hbase.io.hfile.TestCacheOnWrite
Tests run: 36, Failures: 0, Errors: 0, Skipped: 0, Time elapsed: 68.309 sec
Forking command line: /bin/sh -c cd <https://builds.apache.org/job/HBase-TRUNK-on-Hadoop-2.0.0/ws/trunk/hbase-server> && /home/jenkins/tools/java/jdk1.6.0_27-32/jre/bin/java -enableassertions -Xmx1900m -Djava.security.egd=file:/dev/./urandom -Djava.net.preferIPv4Stack=true -jar <https://builds.apache.org/job/HBase-TRUNK-on-Hadoop-2.0.0/ws/trunk/hbase-server/target/surefire/surefirebooter7136969223992931239.jar> <https://builds.apache.org/job/HBase-TRUNK-on-Hadoop-2.0.0/ws/trunk/hbase-server/target/surefire/surefire3846990353316814031tmp> <https://builds.apache.org/job/HBase-TRUNK-on-Hadoop-2.0.0/ws/trunk/hbase-server/target/surefire/surefire_2219017779374572346887tmp>
Running org.apache.hadoop.hbase.replication.regionserver.TestReplicationSourceManager
Tests run: 1, Failures: 0, Errors: 0, Skipped: 0, Time elapsed: 3.734 sec
Forking command line: /bin/sh -c cd <https://builds.apache.org/job/HBase-TRUNK-on-Hadoop-2.0.0/ws/trunk/hbase-server> && /home/jenkins/tools/java/jdk1.6.0_27-32/jre/bin/java -enableassertions -Xmx1900m -Djava.security.egd=file:/dev/./urandom -Djava.net.preferIPv4Stack=true -jar <https://builds.apache.org/job/HBase-TRUNK-on-Hadoop-2.0.0/ws/trunk/hbase-server/target/surefire/surefirebooter5033294857242438030.jar> <https://builds.apache.org/job/HBase-TRUNK-on-Hadoop-2.0.0/ws/trunk/hbase-server/target/surefire/surefire3106070688675804418tmp> <https://builds.apache.org/job/HBase-TRUNK-on-Hadoop-2.0.0/ws/trunk/hbase-server/target/surefire/surefire_2222273285993092812528tmp>
Running org.apache.hadoop.hbase.TestClusterBootOrder
Tests run: 2, Failures: 0, Errors: 0, Skipped: 0, Time elapsed: 53.204 sec
Forking command line: /bin/sh -c cd <https://builds.apache.org/job/HBase-TRUNK-on-Hadoop-2.0.0/ws/trunk/hbase-server> && /home/jenkins/tools/java/jdk1.6.0_27-32/jre/bin/java -enableassertions -Xmx1900m -Djava.security.egd=file:/dev/./urandom -Djava.net.preferIPv4Stack=true -jar <https://builds.apache.org/job/HBase-TRUNK-on-Hadoop-2.0.0/ws/trunk/hbase-server/target/surefire/surefirebooter5357924526878883245.jar> <https://builds.apache.org/job/HBase-TRUNK-on-Hadoop-2.0.0/ws/trunk/hbase-server/target/surefire/surefire6281079171145500476tmp> <https://builds.apache.org/job/HBase-TRUNK-on-Hadoop-2.0.0/ws/trunk/hbase-server/target/surefire/surefire_2233036856023834378728tmp>
Running org.apache.hadoop.hbase.replication.regionserver.TestReplicationSink
Tests run: 5, Failures: 0, Errors: 0, Skipped: 0, Time elapsed: 28.79 sec
Forking command line: /bin/sh -c cd <https://builds.apache.org/job/HBase-TRUNK-on-Hadoop-2.0.0/ws/trunk/hbase-server> && /home/jenkins/tools/java/jdk1.6.0_27-32/jre/bin/java -enableassertions -Xmx1900m -Djava.security.egd=file:/dev/./urandom -Djava.net.preferIPv4Stack=true -jar <https://builds.apache.org/job/HBase-TRUNK-on-Hadoop-2.0.0/ws/trunk/hbase-server/target/surefire/surefirebooter8925858825964762609.jar> <https://builds.apache.org/job/HBase-TRUNK-on-Hadoop-2.0.0/ws/trunk/hbase-server/target/surefire/surefire7726840116089819783tmp> <https://builds.apache.org/job/HBase-TRUNK-on-Hadoop-2.0.0/ws/trunk/hbase-server/target/surefire/surefire_2243051064516795435006tmp>
Running org.apache.hadoop.hbase.replication.TestReplicationSource
Tests run: 1, Failures: 0, Errors: 0, Skipped: 0, Time elapsed: 7.892 sec
Forking command line: /bin/sh -c cd <https://builds.apache.org/job/HBase-TRUNK-on-Hadoop-2.0.0/ws/trunk/hbase-server> && /home/jenkins/tools/java/jdk1.6.0_27-32/jre/bin/java -enableassertions -Xmx1900m -Djava.security.egd=file:/dev/./urandom -Djava.net.preferIPv4Stack=true -jar <https://builds.apache.org/job/HBase-TRUNK-on-Hadoop-2.0.0/ws/trunk/hbase-server/target/surefire/surefirebooter2288578522991954761.jar> <https://builds.apache.org/job/HBase-TRUNK-on-Hadoop-2.0.0/ws/trunk/hbase-server/target/surefire/surefire1966709779569036343tmp> <https://builds.apache.org/job/HBase-TRUNK-on-Hadoop-2.0.0/ws/trunk/hbase-server/target/surefire/surefire_2251596825901172767126tmp>
Running org.apache.hadoop.hbase.replication.TestReplicationDisableInactivePeer
Tests run: 1, Failures: 0, Errors: 0, Skipped: 0, Time elapsed: 74.936 sec
Forking command line: /bin/sh -c cd <https://builds.apache.org/job/HBase-TRUNK-on-Hadoop-2.0.0/ws/trunk/hbase-server> && /home/jenkins/tools/java/jdk1.6.0_27-32/jre/bin/java -enableassertions -Xmx1900m -Djava.security.egd=file:/dev/./urandom -Djava.net.preferIPv4Stack=true -jar <https://builds.apache.org/job/HBase-TRUNK-on-Hadoop-2.0.0/ws/trunk/hbase-server/target/surefire/surefirebooter7164274310372070600.jar> <https://builds.apache.org/job/HBase-TRUNK-on-Hadoop-2.0.0/ws/trunk/hbase-server/target/surefire/surefire3312363936418442577tmp> <https://builds.apache.org/job/HBase-TRUNK-on-Hadoop-2.0.0/ws/trunk/hbase-server/target/surefire/surefire_2262477179119109484119tmp>
Running org.apache.hadoop.hbase.replication.TestMultiSlaveReplication
Tests run: 1, Failures: 0, Errors: 0, Skipped: 0, Time elapsed: 65.68 sec
Forking command line: /bin/sh -c cd <https://builds.apache.org/job/HBase-TRUNK-on-Hadoop-2.0.0/ws/trunk/hbase-server> && /home/jenkins/tools/java/jdk1.6.0_27-32/jre/bin/java -enableassertions -Xmx1900m -Djava.security.egd=file:/dev/./urandom -Djava.net.preferIPv4Stack=true -jar <https://builds.apache.org/job/HBase-TRUNK-on-Hadoop-2.0.0/ws/trunk/hbase-server/target/surefire/surefirebooter5052104357852603702.jar> <https://builds.apache.org/job/HBase-TRUNK-on-Hadoop-2.0.0/ws/trunk/hbase-server/target/surefire/surefire2939767207482454281tmp> <https://builds.apache.org/job/HBase-TRUNK-on-Hadoop-2.0.0/ws/trunk/hbase-server/target/surefire/surefire_2273550660652896361889tmp>
Running org.apache.hadoop.hbase.replication.TestReplicationZookeeper
Tests run: 4, Failures: 0, Errors: 0, Skipped: 0, Time elapsed: 1.355 sec
Forking command line: /bin/sh -c cd <https://builds.apache.org/job/HBase-TRUNK-on-Hadoop-2.0.0/ws/trunk/hbase-server> && /home/jenkins/tools/java/jdk1.6.0_27-32/jre/bin/java -enableassertions -Xmx1900m -Djava.security.egd=file:/dev/./urandom -Djava.net.preferIPv4Stack=true -jar <https://builds.apache.org/job/HBase-TRUNK-on-Hadoop-2.0.0/ws/trunk/hbase-server/target/surefire/surefirebooter8382367614186104819.jar> <https://builds.apache.org/job/HBase-TRUNK-on-Hadoop-2.0.0/ws/trunk/hbase-server/target/surefire/surefire4588193247396624234tmp> <https://builds.apache.org/job/HBase-TRUNK-on-Hadoop-2.0.0/ws/trunk/hbase-server/target/surefire/surefire_228229775534689315998tmp>
Running org.apache.hadoop.hbase.replication.TestMasterReplication
Tests run: 2, Failures: 0, Errors: 0, Skipped: 0, Time elapsed: 115.875 sec
Forking command line: /bin/sh -c cd <https://builds.apache.org/job/HBase-TRUNK-on-Hadoop-2.0.0/ws/trunk/hbase-server> && /home/jenkins/tools/java/jdk1.6.0_27-32/jre/bin/java -enableassertions -Xmx1900m -Djava.security.egd=file:/dev/./urandom -Djava.net.preferIPv4Stack=true -jar <https://builds.apache.org/job/HBase-TRUNK-on-Hadoop-2.0.0/ws/trunk/hbase-server/target/surefire/surefirebooter401685789485945703.jar> <https://builds.apache.org/job/HBase-TRUNK-on-Hadoop-2.0.0/ws/trunk/hbase-server/target/surefire/surefire1910613173449109860tmp> <https://builds.apache.org/job/HBase-TRUNK-on-Hadoop-2.0.0/ws/trunk/hbase-server/target/surefire/surefire_2295963428386367277700tmp>
Running org.apache.hadoop.hbase.ipc.TestDelayedRpc
Tests run: 4, Failures: 0, Errors: 0, Skipped: 0, Time elapsed: 3.311 sec
Forking command line: /bin/sh -c cd <https://builds.apache.org/job/HBase-TRUNK-on-Hadoop-2.0.0/ws/trunk/hbase-server> && /home/jenkins/tools/java/jdk1.6.0_27-32/jre/bin/java -enableassertions -Xmx1900m -Djava.security.egd=file:/dev/./urandom -Djava.net.preferIPv4Stack=true -jar <https://builds.apache.org/job/HBase-TRUNK-on-Hadoop-2.0.0/ws/trunk/hbase-server/target/surefire/surefirebooter8365835330631927662.jar> <https://builds.apache.org/job/HBase-TRUNK-on-Hadoop-2.0.0/ws/trunk/hbase-server/target/surefire/surefire2316892712354713103tmp> <https://builds.apache.org/job/HBase-TRUNK-on-Hadoop-2.0.0/ws/trunk/hbase-server/target/surefire/surefire_230757223275911077518tmp>
Running org.apache.hadoop.hbase.ipc.TestProtoBufRpc
Tests run: 1, Failures: 0, Errors: 0, Skipped: 0, Time elapsed: 1.515 sec
Forking command line: /bin/sh -c cd <https://builds.apache.org/job/HBase-TRUNK-on-Hadoop-2.0.0/ws/trunk/hbase-server> && /home/jenkins/tools/java/jdk1.6.0_27-32/jre/bin/java -enableassertions -Xmx1900m -Djava.security.egd=file:/dev/./urandom -Djava.net.preferIPv4Stack=true -jar <https://builds.apache.org/job/HBase-TRUNK-on-Hadoop-2.0.0/ws/trunk/hbase-server/target/surefire/surefirebooter9137677900713206683.jar> <https://builds.apache.org/job/HBase-TRUNK-on-Hadoop-2.0.0/ws/trunk/hbase-server/target/surefire/surefire2517124282326633599tmp> <https://builds.apache.org/job/HBase-TRUNK-on-Hadoop-2.0.0/ws/trunk/hbase-server/target/surefire/surefire_2311208592633588233490tmp>
Running org.apache.hadoop.hbase.ipc.TestHBaseClient
Tests run: 1, Failures: 0, Errors: 0, Skipped: 0, Time elapsed: 0.328 sec
Forking command line: /bin/sh -c cd <https://builds.apache.org/job/HBase-TRUNK-on-Hadoop-2.0.0/ws/trunk/hbase-server> && /home/jenkins/tools/java/jdk1.6.0_27-32/jre/bin/java -enableassertions -Xmx1900m -Djava.security.egd=file:/dev/./urandom -Djava.net.preferIPv4Stack=true -jar <https://builds.apache.org/job/HBase-TRUNK-on-Hadoop-2.0.0/ws/trunk/hbase-server/target/surefire/surefirebooter4067250864791271634.jar> <https://builds.apache.org/job/HBase-TRUNK-on-Hadoop-2.0.0/ws/trunk/hbase-server/target/surefire/surefire8867583859652096646tmp> <https://builds.apache.org/job/HBase-TRUNK-on-Hadoop-2.0.0/ws/trunk/hbase-server/target/surefire/surefire_2328844125012637257583tmp>
Running org.apache.hadoop.hbase.TestZooKeeper
Tests run: 9, Failures: 0, Errors: 0, Skipped: 0, Time elapsed: 51.116 sec
Forking command line: /bin/sh -c cd <https://builds.apache.org/job/HBase-TRUNK-on-Hadoop-2.0.0/ws/trunk/hbase-server> && /home/jenkins/tools/java/jdk1.6.0_27-32/jre/bin/java -enableassertions -Xmx1900m -Djava.security.egd=file:/dev/./urandom -Djava.net.preferIPv4Stack=true -jar <https://builds.apache.org/job/HBase-TRUNK-on-Hadoop-2.0.0/ws/trunk/hbase-server/target/surefire/surefirebooter2573889536563112162.jar> <https://builds.apache.org/job/HBase-TRUNK-on-Hadoop-2.0.0/ws/trunk/hbase-server/target/surefire/surefire8747146431927873560tmp> <https://builds.apache.org/job/HBase-TRUNK-on-Hadoop-2.0.0/ws/trunk/hbase-server/target/surefire/surefire_2332073902782143476418tmp>
Running org.apache.hadoop.hbase.replication.TestReplicationSmallTests
Tests run: 8, Failures: 0, Errors: 0, Skipped: 0, Time elapsed: 142.364 sec
Running org.apache.hadoop.hbase.replication.TestReplicationQueueFailoverCompressed
Tests run: 1, Failures: 0, Errors: 0, Skipped: 0, Time elapsed: 171.294 sec
Running org.apache.hadoop.hbase.replication.TestReplicationQueueFailover
Tests run: 1, Failures: 0, Errors: 0, Skipped: 0, Time elapsed: 185.51 sec
Running org.apache.hadoop.hbase.TestHBaseTestingUtility
Tests run: 7, Failures: 0, Errors: 0, Skipped: 0, Time elapsed: 93.947 sec

Results :

Failed tests:   testDelete(org.apache.hadoop.hbase.master.TestTableLockManager)
  testMasterFailoverWithMockedRITOnDeadRS(org.apache.hadoop.hbase.master.TestMasterFailover): region=enabledTable,fff,1363174900985.ab0116033b618b3564f29fca206f48c4., [{NAME => '.META.,,1', STARTKEY => '', ENDKEY => '', ENCODED => 1028785192,}, {NAME => 'disabledTable,,1363174902562.8c4cb1d08ace12b27b1102040ea7b3e6.', STARTKEY => '', ENDKEY => 'aaa', ENCODED => 8c4cb1d08ace12b27b1102040ea7b3e6,}, {NAME => 'disabledTable,aaa,1363174902568.dbd6dd6e724dcfbebaf917e8c6c39522.', STARTKEY => 'aaa', ENDKEY => 'bbb', ENCODED => dbd6dd6e724dcfbebaf917e8c6c39522,}, {NAME => 'enabledTable,,1363174900662.d95e270f83e9606735bc0470c2c41555.', STARTKEY => '', ENDKEY => 'aaa', ENCODED => d95e270f83e9606735bc0470c2c41555,}, {NAME => 'enabledTable,aaa,1363174900838.04dc253eed99447eaeeefdfbf539b849.', STARTKEY => 'aaa', ENDKEY => 'bbb', ENCODED => 04dc253eed99447eaeeefdfbf539b849,}, {NAME => 'enabledTable,bbb,1363174900883.4e8f6095643c99bac33d660623a3a99c.', STARTKEY => 'bbb', ENDKEY => 'ccc', ENCODED => 4e8f6095643c99bac33d660623a3a99c,}, {NAME => 'enabledTable,ccc,1363174900888.45116f99df5b0e00909190d53f5bce2f.', STARTKEY => 'ccc', ENDKEY => 'ddd', ENCODED => 45116f99df5b0e00909190d53f5bce2f,}, {NAME => 'enabledTable,ddd,1363174900936.d50869b4fe2eb7551b17224186ddc472.', STARTKEY => 'ddd', ENDKEY => 'eee', ENCODED => d50869b4fe2eb7551b17224186ddc472,}, {NAME => 'enabledTable,eee,1363174900979.6167521a5669aea9728c394eb701106f.', STARTKEY => 'eee', ENDKEY => 'fff', ENCODED => 6167521a5669aea9728c394eb701106f,}]
  testRegionShouldNotBeDeployed(org.apache.hadoop.hbase.util.TestHBaseFsck): expected:<[SHOULD_NOT_BE_DEPLOYED]> but was:<[]>

Tests in error: 
  testThreeRSAbort(org.apache.hadoop.hbase.master.TestDistributedLogSplitting): test timed out after 300000 milliseconds
  loadTest[0](org.apache.hadoop.hbase.util.TestMiniClusterLoadParallel): test timed out after 180000 milliseconds
  loadTest[1](org.apache.hadoop.hbase.util.TestMiniClusterLoadParallel): test timed out after 180000 milliseconds
  loadTest[0](org.apache.hadoop.hbase.util.TestMiniClusterLoadSequential): test timed out after 180000 milliseconds
  loadTest[1](org.apache.hadoop.hbase.util.TestMiniClusterLoadSequential): test timed out after 180000 milliseconds
  testLogRollOnDatanodeDeath(org.apache.hadoop.hbase.regionserver.wal.TestLogRolling): Failed 1 action: ExecutionException: 1 time, 
  testExportScannerBatching(org.apache.hadoop.hbase.mapreduce.TestImportExport)
  testWithFilter(org.apache.hadoop.hbase.mapreduce.TestImportExport)
  testBatchWithPut(org.apache.hadoop.hbase.client.TestMultiParallel): Failed 20 actions: ExecutionException: 20 times, 

Tests run: 1404, Failures: 3, Errors: 9, Skipped: 13

[INFO]                                                                         
[INFO] ------------------------------------------------------------------------
[INFO] Skipping HBase
[INFO] This project has been banned from the build due to previous failures.
[INFO] ------------------------------------------------------------------------
[INFO] ------------------------------------------------------------------------
[INFO] Reactor Summary:
[INFO] 
[INFO] HBase ............................................. SUCCESS [22.991s]
[INFO] HBase - Common .................................... SUCCESS [24.453s]
[INFO] HBase - Protocol .................................. SUCCESS [15.951s]
[INFO] HBase - Client .................................... SUCCESS [8.112s]
[INFO] HBase - Prefix Tree ............................... SUCCESS [3.659s]
[INFO] HBase - Hadoop Compatibility ...................... SUCCESS [0.572s]
[INFO] HBase - Hadoop Two Compatibility .................. SUCCESS [5.037s]
[INFO] HBase - Server .................................... FAILURE [1:12:44.462s]
[INFO] HBase - Integration Tests ......................... SKIPPED
[INFO] HBase - Examples .................................. SKIPPED
[INFO] ------------------------------------------------------------------------
[INFO] BUILD FAILURE
[INFO] ------------------------------------------------------------------------
[INFO] Total time: 1:14:11.925s
[INFO] Finished at: Wed Mar 13 12:51:57 UTC 2013
[INFO] Final Memory: 110M/669M
[INFO] ------------------------------------------------------------------------
[ERROR] Failed to execute goal org.apache.maven.plugins:maven-surefire-plugin:2.12-TRUNK-HBASE-2:test (secondPartTestsExecution) on project hbase-server: Failure or timeout -> [Help 1]
org.apache.maven.lifecycle.LifecycleExecutionException: Failed to execute goal org.apache.maven.plugins:maven-surefire-plugin:2.12-TRUNK-HBASE-2:test (secondPartTestsExecution) on project hbase-server: Failure or timeout
	at org.apache.maven.lifecycle.internal.MojoExecutor.execute(MojoExecutor.java:217)
	at org.apache.maven.lifecycle.internal.MojoExecutor.execute(MojoExecutor.java:153)
	at org.apache.maven.lifecycle.internal.MojoExecutor.execute(MojoExecutor.java:145)
	at org.apache.maven.lifecycle.internal.LifecycleModuleBuilder.buildProject(LifecycleModuleBuilder.java:84)
	at org.apache.maven.lifecycle.internal.LifecycleModuleBuilder.buildProject(LifecycleModuleBuilder.java:59)
	at org.apache.maven.lifecycle.internal.LifecycleStarter.singleThreadedBuild(LifecycleStarter.java:183)
	at org.apache.maven.lifecycle.internal.LifecycleStarter.execute(LifecycleStarter.java:161)
	at org.apache.maven.DefaultMaven.doExecute(DefaultMaven.java:320)
	at org.apache.maven.DefaultMaven.execute(DefaultMaven.java:156)
	at org.apache.maven.cli.MavenCli.execute(MavenCli.java:537)
	at org.apache.maven.cli.MavenCli.doMain(MavenCli.java:196)
	at org.apache.maven.cli.MavenCli.main(MavenCli.java:141)
	at sun.reflect.NativeMethodAccessorImpl.invoke0(Native Method)
	at sun.reflect.NativeMethodAccessorImpl.invoke(NativeMethodAccessorImpl.java:39)
	at sun.reflect.DelegatingMethodAccessorImpl.invoke(DelegatingMethodAccessorImpl.java:25)
	at java.lang.reflect.Method.invoke(Method.java:597)
	at org.codehaus.plexus.classworlds.launcher.Launcher.launchEnhanced(Launcher.java:290)
	at org.codehaus.plexus.classworlds.launcher.Launcher.launch(Launcher.java:230)
	at org.codehaus.plexus.classworlds.launcher.Launcher.mainWithExitCode(Launcher.java:409)
	at org.codehaus.plexus.classworlds.launcher.Launcher.main(Launcher.java:352)
Caused by: org.apache.maven.plugin.MojoExecutionException: Failure or timeout
	at org.apache.maven.plugin.surefire.SurefirePlugin.assertNoFailureOrTimeout(SurefirePlugin.java:643)
	at org.apache.maven.plugin.surefire.SurefirePlugin.handleSummary(SurefirePlugin.java:624)
	at org.apache.maven.plugin.surefire.AbstractSurefireMojo.executeAfterPreconditionsChecked(AbstractSurefireMojo.java:137)
	at org.apache.maven.plugin.surefire.AbstractSurefireMojo.execute(AbstractSurefireMojo.java:98)
	at org.apache.maven.plugin.DefaultBuildPluginManager.executeMojo(DefaultBuildPluginManager.java:101)
	at org.apache.maven.lifecycle.internal.MojoExecutor.execute(MojoExecutor.java:209)
	... 19 more
[ERROR] 
[ERROR] 
[ERROR] For more information about the errors and possible solutions, please read the following articles:
[ERROR] [Help 1] http://cwiki.apache.org/confluence/display/MAVEN/MojoExecutionException
[ERROR] 
[ERROR] After correcting the problems, you can resume the build with the command
[ERROR]   mvn <goals> -rf :hbase-server
Build step 'Invoke top-level Maven targets' marked build as failure
Archiving artifacts
Recording test results
Updating HBASE-7442
Updating HBASE-7482

Mime
View raw message